<?xml version='1.0' encoding='UTF-8' standalone='no'?>
<svg width="49.9533mm" height="49.9533mm" version="1.2" viewBox="0 0 590 590" xmlns:cc="http://creativecommons.org/ns#" xmlns:xlink="http://www.w3.org/1999/xlink" xmlns="http://www.w3.org/2000/svg" baseProfile="tiny">
 <defs/>
 <g stroke="black" fill-rule="evenodd" stroke-linecap="square" fill="none" stroke-linejoin="bevel" stroke-width="1">
  <g stroke="#000000" font-weight="400" stroke-opacity="1" font-style="normal" stroke-linecap="square" fill="none" stroke-linejoin="bevel" stroke-width="1" font-family="Noto Sans" transform="matrix(1,0,0,1,0,0)" font-size="41.6667"/>
  <g stroke="#000000" font-weight="400" stroke-opacity="1" font-style="normal" stroke-linecap="square" fill="none" stroke-linejoin="bevel" stroke-width="1" font-family="Noto Sans" transform="matrix(1,0,0,1,0,0)" font-size="41.6667"/>
  <g stroke="#000000" font-weight="400" stroke-opacity="1" font-style="normal" stroke-linecap="square" fill="none" stroke-linejoin="bevel" stroke-width="1" font-family="Noto Sans" transform="matrix(11.8,0,0,11.8,0,0)" font-size="41.6667"/>
  <g stroke="#000000" font-weight="400" stroke-opacity="1" font-style="normal" stroke-linecap="square" fill="none" stroke-linejoin="bevel" stroke-width="1" font-family="Noto Sans" transform="matrix(11.8,0,0,11.8,0,0)" font-size="41.6667"/>
  <g stroke="#000000" font-weight="400" stroke-opacity="1" font-style="normal" stroke-linecap="square" fill="none" stroke-linejoin="bevel" stroke-width="1" font-family="Noto Sans" transform="matrix(11.8,0,0,11.8,0,0)" font-size="41.6667"/>
  <g stroke="#000000" font-weight="400" stroke-opacity="1" font-style="normal" stroke-linecap="square" fill="none" stroke-linejoin="bevel" stroke-width="1" font-family="Noto Sans" transform="matrix(11.8,0,0,11.8,0,0)" font-size="41.6667"/>
  <g stroke="#000000" font-weight="400" stroke-opacity="1" font-style="normal" stroke-linecap="square" fill="none" stroke-linejoin="bevel" stroke-width="1" font-family="Noto Sans" transform="matrix(11.8,0,0,11.8,0,0)" font-size="41.6667"/>
  <g stroke="#000000" font-weight="400" stroke-opacity="1" font-style="normal" stroke-linecap="square" fill="none" stroke-linejoin="bevel" stroke-width="1" font-family="Noto Sans" transform="matrix(0.999067,0,0,0.999067,0,0)" font-size="41.6667"/>
  <g stroke="none" font-weight="400" font-style="normal" fill-opacity="1" fill="#ffffff" font-family="Noto Sans" transform="matrix(0.999067,0,0,0.999067,0,0)" font-size="41.6667">
   <path d="M-2,-2 L593,-2 L593,593 L-2,593 L-2,-2" vector-effect="none" fill-rule="evenodd"/>
  </g>
  <g stroke="#000000" font-weight="400" stroke-opacity="1" font-style="normal" stroke-linecap="square" fill="none" stroke-linejoin="bevel" stroke-width="1" font-family="Noto Sans" transform="matrix(0.999067,0,0,0.999067,0,0)" font-size="41.6667"/>
  <g stroke="#000000" font-weight="400" stroke-opacity="1" font-style="normal" stroke-linecap="square" fill="none" stroke-linejoin="bevel" stroke-width="1" font-family="Noto Sans" transform="matrix(11.8,0,0,11.8,0,0)" font-size="41.6667"/>
  <g stroke="#000000" font-weight="400" stroke-opacity="1" font-style="normal" stroke-linecap="square" fill="none" stroke-linejoin="bevel" stroke-width="1" font-family="Noto Sans" transform="matrix(11.8,0,0,11.8,0,0)" font-size="41.6667"/>
  <g stroke="#000000" font-weight="400" stroke-opacity="1" font-style="normal" stroke-linecap="square" fill="none" stroke-linejoin="bevel" stroke-width="1" font-family="Noto Sans" transform="matrix(11.8,0,0,11.8,0,0)" font-size="41.6667"/>
  <g stroke="#000000" font-weight="400" stroke-opacity="1" font-style="normal" stroke-linecap="square" fill="none" stroke-linejoin="bevel" stroke-width="1" font-family="Noto Sans" transform="matrix(11.8,0,0,11.8,0,0)" font-size="41.6667"/>
  <g stroke="#000000" font-weight="400" stroke-opacity="1" font-style="normal" stroke-linecap="square" fill="none" stroke-linejoin="bevel" stroke-width="1" font-family="Noto Sans" transform="matrix(11.8,0,0,11.8,0,0)" font-size="41.6667"/>
  <g stroke="none" font-weight="400" font-style="normal" fill-opacity="1" fill="#ffffff" font-family="Noto Sans" transform="matrix(11.8,0,0,11.8,0,0)" font-size="41.6667">
   <path d="M0,0 L50,0 L50,50 L0,50 L0,0" vector-effect="none" fill-rule="evenodd"/>
  </g>
  <g stroke="#000000" font-weight="400" stroke-opacity="1" font-style="normal" stroke-linecap="square" fill="none" stroke-linejoin="bevel" stroke-width="1" font-family="Noto Sans" transform="matrix(11.8,0,0,11.8,0,0)" font-size="41.6667"/>
  <g stroke="#000000" font-weight="400" stroke-opacity="1" font-style="normal" stroke-linecap="square" fill="none" stroke-linejoin="bevel" stroke-width="1" font-family="Noto Sans" transform="matrix(11.8,0,0,11.8,0,0)" font-size="41.6667"/>
  <g stroke="none" font-weight="400" font-style="normal" fill-opacity="0" fill="#000000" font-family="Noto Sans" transform="matrix(0.999067,0,0,0.999067,0,0)" font-size="41.6667">
   <rect width="591" height="591" y="0" x="0"/>
  </g>
  <g stroke="#000000" font-weight="400" stroke-opacity="1" font-style="normal" stroke-linecap="square" fill="none" stroke-linejoin="bevel" stroke-width="1" font-family="Noto Sans" transform="matrix(0.999067,0,0,0.999067,0,0)" font-size="41.6667"/>
  <g stroke="#000000" font-weight="400" stroke-opacity="1" font-style="normal" stroke-linecap="square" fill="none" stroke-linejoin="bevel" stroke-width="7.79528" font-family="Noto Sans" transform="matrix(0.999067,0,0,0.999067,0,0)" font-size="41.6667">
   <path d="M128.099,462.901 L413.286,413.286 L356.56,87.2236 L71.3732,136.838 L128.099,462.901" vector-effect="none" fill-rule="evenodd"/>
  </g>
  <g stroke="#000000" font-weight="400" stroke-opacity="1" font-style="normal" stroke-linecap="square" fill="none" stroke-linejoin="bevel" stroke-width="1" font-family="Noto Sans" transform="matrix(0.999067,0,0,0.999067,0,0)" font-size="41.6667"/>
  <g stroke="#ffffff" font-weight="400" stroke-opacity="1" font-style="normal" fill-opacity="1" stroke-linecap="square" fill="#000000" stroke-linejoin="bevel" stroke-width="4.72441" font-family="Noto Sans" transform="matrix(0.999067,0,0,0.999067,0,0)" font-size="41.6667">
   <path d="M151.721,462.901 C151.721,475.947 141.145,486.523 128.099,486.523 C115.053,486.523 104.477,475.947 104.477,462.901 C104.477,449.855 115.053,439.279 128.099,439.279 C141.145,439.279 151.721,449.855 151.721,462.901 " vector-effect="none" fill-rule="evenodd"/>
  </g>
  <g stroke="#232323" font-weight="400" stroke-opacity="1" font-style="normal" fill-opacity="1" stroke-linecap="square" fill="#ffffff" stroke-linejoin="bevel" stroke-width="1" font-family="Noto Sans" transform="matrix(0.999067,0,0,0.999067,0,0)" font-size="41.6667">
   <path d="M139.91,462.901 C139.91,469.424 134.622,474.712 128.099,474.712 C121.576,474.712 116.288,469.424 116.288,462.901 C116.288,456.378 121.576,451.09 128.099,451.09 C134.622,451.09 139.91,456.378 139.91,462.901 " vector-effect="non-scaling-stroke" fill-rule="evenodd"/>
  </g>
  <g stroke="#ffffff" font-weight="400" stroke-opacity="1" font-style="normal" fill-opacity="1" stroke-linecap="square" fill="#000000" stroke-linejoin="bevel" stroke-width="4.72441" font-family="Noto Sans" transform="matrix(0.999067,0,0,0.999067,0,0)" font-size="41.6667">
   <path d="M436.908,413.286 C436.908,426.332 426.332,436.908 413.286,436.908 C400.24,436.908 389.664,426.332 389.664,413.286 C389.664,400.24 400.24,389.664 413.286,389.664 C426.332,389.664 436.908,400.24 436.908,413.286 " vector-effect="none" fill-rule="evenodd"/>
  </g>
  <g stroke="#232323" font-weight="400" stroke-opacity="1" font-style="normal" fill-opacity="1" stroke-linecap="square" fill="#ffffff" stroke-linejoin="bevel" stroke-width="1" font-family="Noto Sans" transform="matrix(0.999067,0,0,0.999067,0,0)" font-size="41.6667">
   <path d="M425.097,413.286 C425.097,419.809 419.809,425.097 413.286,425.097 C406.763,425.097 401.475,419.809 401.475,413.286 C401.475,406.763 406.763,401.475 413.286,401.475 C419.809,401.475 425.097,406.763 425.097,413.286 " vector-effect="non-scaling-stroke" fill-rule="evenodd"/>
  </g>
  <g stroke="#000000" font-weight="400" stroke-opacity="1" font-style="normal" stroke-linecap="square" fill="none" stroke-linejoin="bevel" stroke-width="1" font-family="Noto Sans" transform="matrix(0.999067,0,0,0.999067,0,0)" font-size="41.6667"/>
  <g stroke="#000000" font-weight="400" stroke-opacity="1" font-style="normal" stroke-linecap="square" fill="none" stroke-linejoin="bevel" stroke-width="1" font-family="Noto Sans" transform="matrix(0.999067,0,0,0.999067,0,0)" font-size="41.6667"/>
  <g stroke="#000000" font-weight="400" stroke-opacity="1" font-style="normal" stroke-linecap="square" fill="none" stroke-linejoin="bevel" stroke-width="1" font-family="Noto Sans" transform="matrix(0.319701,2.44701e-16,-2.44701e-16,0.319701,147.612,476.01)" font-size="41.6667"/>
  <g stroke="none" font-weight="400" font-style="normal" fill-opacity="1" fill="#000000" font-family="Noto Sans" transform="matrix(0.999067,2.44701e-16,-2.44701e-16,0.999067,147.612,476.01)" font-size="41.6667">
   <path d="M14.9063,0 L11.2969,0 L11.2969,-20.9688 C11.2969,-22.1667 11.3125,-23.1302 11.3438,-23.8594 C11.375,-24.5885 11.4167,-25.3438 11.4688,-26.125 C11.0208,-25.6771 10.6068,-25.2995 10.2266,-24.9922 C9.84635,-24.6849 9.39063,-24.2917 8.85938,-23.8125 L5.67188,-21.2188 L3.73438,-23.6875 L11.8438,-30 L14.9063,-30 L14.9063,0 M25.7031,-9.625 L25.7031,-12.8906 L35.8594,-12.8906 L35.8594,-9.625 L25.7031,-9.625 M64.5469,0 L60.7656,0 L60.7656,-13.9844 L45.3906,-13.9844 L45.3906,0 L41.6094,0 L41.6094,-30 L45.3906,-30 L45.3906,-17.3125 L60.7656,-17.3125 L60.7656,-30 L64.5469,-30 L64.5469,0" vector-effect="none" fill-rule="nonzero"/>
  </g>
  <g stroke="#000000" font-weight="400" stroke-opacity="1" font-style="normal" stroke-linecap="square" fill="none" stroke-linejoin="bevel" stroke-width="1" font-family="Noto Sans" transform="matrix(0.319701,2.44701e-16,-2.44701e-16,0.319701,147.612,476.01)" font-size="41.6667"/>
  <g stroke="#000000" font-weight="400" stroke-opacity="1" font-style="normal" stroke-linecap="square" fill="none" stroke-linejoin="bevel" stroke-width="1" font-family="Noto Sans" transform="matrix(0.999067,0,0,0.999067,0,0)" font-size="41.6667"/>
  <g stroke="#000000" font-weight="400" stroke-opacity="1" font-style="normal" stroke-linecap="square" fill="none" stroke-linejoin="bevel" stroke-width="1" font-family="Noto Sans" transform="matrix(0.319701,2.44701e-16,-2.44701e-16,0.319701,442.836,416.511)" font-size="41.6667"/>
  <g stroke="none" font-weight="400" font-style="normal" fill-opacity="1" fill="#000000" font-family="Noto Sans" transform="matrix(0.999067,2.44701e-16,-2.44701e-16,0.999067,442.836,416.511)" font-size="41.6667">
   <path d="M21.8438,0 L2.01563,0 L2.01563,-3.0625 L9.875,-11 C11.3542,-12.5208 12.6198,-13.8672 13.6719,-15.0391 C14.724,-16.2109 15.5156,-17.3568 16.0469,-18.4766 C16.5781,-19.5964 16.8438,-20.8438 16.8438,-22.2188 C16.8438,-23.875 16.3542,-25.1302 15.375,-25.9844 C14.3958,-26.8385 13.1198,-27.2656 11.5469,-27.2656 C10.0677,-27.2656 8.78125,-27.013 7.6875,-26.5078 C6.59375,-26.0026 5.47396,-25.3021 4.32813,-24.4063 L2.35938,-26.8906 C3.52604,-27.8698 4.875,-28.7005 6.40625,-29.3828 C7.9375,-30.0651 9.65104,-30.4063 11.5469,-30.4063 C14.349,-30.4063 16.5625,-29.6927 18.1875,-28.2656 C19.8125,-26.8385 20.625,-24.8958 20.625,-22.4375 C20.625,-20.8646 20.3021,-19.3932 19.6563,-18.0234 C19.0104,-16.6536 18.1146,-15.2969 16.9688,-13.9531 C15.8229,-12.6094 14.4792,-11.1927 12.9375,-9.70313 L6.67188,-3.53125 L6.67188,-3.35938 L21.8438,-3.35938 L21.8438,0 M25.7031,-9.625 L25.7031,-12.8906 L35.8594,-12.8906 L35.8594,-9.625 L25.7031,-9.625 M64.5469,0 L60.7656,0 L60.7656,-13.9844 L45.3906,-13.9844 L45.3906,0 L41.6094,0 L41.6094,-30 L45.3906,-30 L45.3906,-17.3125 L60.7656,-17.3125 L60.7656,-30 L64.5469,-30 L64.5469,0" vector-effect="none" fill-rule="nonzero"/>
  </g>
  <g stroke="#000000" font-weight="400" stroke-opacity="1" font-style="normal" stroke-linecap="square" fill="none" stroke-linejoin="bevel" stroke-width="1" font-family="Noto Sans" transform="matrix(0.319701,2.44701e-16,-2.44701e-16,0.319701,442.836,416.511)" font-size="41.6667"/>
  <g stroke="#000000" font-weight="400" stroke-opacity="1" font-style="normal" stroke-linecap="square" fill="none" stroke-linejoin="bevel" stroke-width="1" font-family="Noto Sans" transform="matrix(0.999067,0,0,0.999067,0,0)" font-size="41.6667"/>
  <g stroke="#000000" font-weight="400" stroke-opacity="1" font-style="normal" stroke-linecap="square" fill="none" stroke-linejoin="bevel" stroke-width="1" font-family="Noto Sans" transform="matrix(11.8,0,0,11.8,0,0)" font-size="41.6667"/>
  <g stroke="#000000" font-weight="400" stroke-opacity="1" font-style="normal" stroke-linecap="square" fill="none" stroke-linejoin="bevel" stroke-width="1" font-family="Noto Sans" transform="matrix(11.8,0,0,11.8,0,0)" font-size="41.6667"/>
  <g stroke="#000000" font-weight="400" stroke-opacity="1" font-style="normal" stroke-linecap="square" fill="none" stroke-linejoin="bevel" stroke-width="1" font-family="Noto Sans" transform="matrix(11.8,0,0,11.8,0,0)" font-size="41.6667"/>
  <g stroke="#000000" font-weight="400" stroke-opacity="1" font-style="normal" stroke-linecap="square" fill="none" stroke-linejoin="bevel" stroke-width="1" font-family="Noto Sans" transform="matrix(1,0,0,1,0,0)" font-size="41.6667"/>
  <g stroke="#000000" font-weight="400" stroke-opacity="1" font-style="normal" stroke-linecap="square" fill="none" stroke-linejoin="bevel" stroke-width="1" font-family="Noto Sans" transform="matrix(11.8,0,0,11.8,0,0)" font-size="41.6667"/>
  <g stroke="#000000" font-weight="400" stroke-opacity="1" font-style="normal" stroke-linecap="square" fill="none" stroke-linejoin="bevel" stroke-width="1" font-family="Noto Sans" transform="matrix(11.8,0,0,11.8,0,0)" font-size="41.6667"/>
  <g stroke="#000000" font-weight="400" stroke-opacity="1" font-style="normal" stroke-linecap="square" fill="none" stroke-linejoin="bevel" stroke-width="1" font-family="Noto Sans" transform="matrix(1,0,0,1,0,0)" font-size="41.6667"/>
 </g>
 <metadata>
  <rdf:RDF xmlns:rdf="http://www.w3.org/1999/02/22-rdf-syntax-ns#" xmlns:rdfs="http://www.w3.org/2000/01/rdf-schema#" xmlns:dc="http://purl.org/dc/elements/1.1/">
   <rdf:Description dc:description="" dc:format="image/svg+xml" dc:identifier="" dc:title="" dc:date="2021-03-30T07:37:29">
    <dc:creator>
     <rdf:Bag>
      <rdf:li>Loïc Bartoletti</rdf:li>
     </rdf:Bag>
    </dc:creator>
    <dc:publisher>
     <rdf:Bag>
      <rdf:li>QGIS 3.18.1-Zürich</rdf:li>
     </rdf:Bag>
    </dc:publisher>
    <dc:subject>
     <rdf:Bag/>
    </dc:subject>
   </rdf:Description>
   <cc:Work rdf:about="">
    <dc:format>image/svg+xml</dc:format>
    <dc:title></dc:title>
    <dc:date>2021-03-30T07:37:29</dc:date>
    <dc:identifier></dc:identifier>
    <dc:description></dc:description>
    <dc:creator>
     <cc:Agent>
      <dc:title>Loïc Bartoletti</dc:title>
     </cc:Agent>
    </dc:creator>
    <dc:publisher>
     <cc:Agent>
      <dc:title>QGIS 3.18.1-Zürich</dc:title>
     </cc:Agent>
    </dc:publisher>
   </cc:Work>
  </rdf:RDF>
 </metadata>
</svg>
