<?xml version="1.0" encoding="UTF-8" standalone="no"?>
<!-- Created with Inkscape (http://www.inkscape.org/) -->

<svg
   xmlns:dc="http://purl.org/dc/elements/1.1/"
   xmlns:cc="http://creativecommons.org/ns#"
   xmlns:rdf="http://www.w3.org/1999/02/22-rdf-syntax-ns#"
   xmlns:svg="http://www.w3.org/2000/svg"
   xmlns="http://www.w3.org/2000/svg"
   xmlns:xlink="http://www.w3.org/1999/xlink"
   xmlns:sodipodi="http://sodipodi.sourceforge.net/DTD/sodipodi-0.dtd"
   xmlns:inkscape="http://www.inkscape.org/namespaces/inkscape"
   width="200"
   height="200"
   viewBox="0 0 52.916665 52.916668"
   version="1.1"
   id="svg8"
   inkscape:version="0.92.5 (2060ec1f9f, 2020-04-08)"
   sodipodi:docname="landsurveycodesimport_final.svg">
  <defs
     id="defs2">
    <linearGradient
       id="linearGradient3559"
       inkscape:collect="always">
      <stop
         id="stop3555"
         offset="0"
         style="stop-color:#3f80be;stop-opacity:1" />
      <stop
         id="stop3557"
         offset="1"
         style="stop-color:#c6daec;stop-opacity:1" />
    </linearGradient>
    <linearGradient
       id="linearGradient3548"
       inkscape:collect="always">
      <stop
         id="stop3544"
         offset="0"
         style="stop-color:#4988c2;stop-opacity:1" />
      <stop
         id="stop3546"
         offset="1"
         style="stop-color:#d3e2f0;stop-opacity:1" />
    </linearGradient>
    <linearGradient
       id="linearGradient3537"
       inkscape:collect="always">
      <stop
         id="stop3533"
         offset="0"
         style="stop-color:#b6cfe7;stop-opacity:1" />
      <stop
         id="stop3535"
         offset="1"
         style="stop-color:#90b6da;stop-opacity:1" />
    </linearGradient>
    <linearGradient
       id="linearGradient3526"
       inkscape:collect="always">
      <stop
         id="stop3522"
         offset="0"
         style="stop-color:#3a74ac;stop-opacity:1" />
      <stop
         id="stop3524"
         offset="1"
         style="stop-color:#2b5781;stop-opacity:1" />
    </linearGradient>
    <linearGradient
       id="linearGradient3515"
       inkscape:collect="always">
      <stop
         id="stop3511"
         offset="0"
         style="stop-color:#3a74ac;stop-opacity:1" />
      <stop
         id="stop3513"
         offset="1"
         style="stop-color:#254a6d;stop-opacity:1" />
    </linearGradient>
    <filter
       inkscape:collect="always"
       style="color-interpolation-filters:sRGB"
       id="filter1555-4"
       x="-0.036874998"
       width="1.07375"
       y="-0.16090913"
       height="1.3218184">
      <feGaussianBlur
         inkscape:collect="always"
         stdDeviation="0.3719205"
         id="feGaussianBlur1557-7" />
    </filter>
    <radialGradient
       inkscape:collect="always"
       xlink:href="#linearGradient3515"
       id="radialGradient1477-2"
       cx="49.841553"
       cy="180.50691"
       fx="49.841553"
       fy="180.50691"
       r="2.8576946"
       gradientUnits="userSpaceOnUse"
       gradientTransform="rotate(-28.072468,212.87136,268.49034)" />
    <radialGradient
       inkscape:collect="always"
       xlink:href="#linearGradient3526"
       id="radialGradient1469-6"
       cx="46.227413"
       cy="176.6407"
       fx="46.227413"
       fy="176.6407"
       r="8.3209343"
       gradientUnits="userSpaceOnUse"
       gradientTransform="matrix(1.4444444,0.48484848,-0.31821591,0.94801826,13.440382,73.839675)" />
    <radialGradient
       inkscape:collect="always"
       xlink:href="#linearGradient3559"
       id="radialGradient1485-9"
       cx="42.781372"
       cy="172.52217"
       fx="42.781372"
       fy="172.52217"
       r="12.691525"
       gradientUnits="userSpaceOnUse"
       gradientTransform="matrix(-0.06523842,1.4222917,-1.9312949,-0.08858572,356.53958,214.02851)" />
    <radialGradient
       inkscape:collect="always"
       xlink:href="#linearGradient3537"
       id="radialGradient1493-1"
       cx="42.277069"
       cy="168.82399"
       fx="42.277069"
       fy="168.82399"
       r="18.154764"
       gradientUnits="userSpaceOnUse"
       gradientTransform="matrix(0.49999987,1.513889,-0.94955086,0.31361303,159.22152,138.9467)" />
    <radialGradient
       inkscape:collect="always"
       xlink:href="#linearGradient3548"
       id="radialGradient1501-1"
       cx="36.729778"
       cy="184.62535"
       fx="36.729778"
       fy="184.62535"
       r="18.827164"
       gradientUnits="userSpaceOnUse"
       gradientTransform="translate(-22.223987,87.070955)" />
  </defs>
  <sodipodi:namedview
     id="base"
     pagecolor="#ffffff"
     bordercolor="#666666"
     borderopacity="1.0"
     inkscape:pageopacity="0.0"
     inkscape:pageshadow="2"
     inkscape:zoom="1.9356061"
     inkscape:cx="96.04518"
     inkscape:cy="72.403289"
     inkscape:document-units="mm"
     inkscape:current-layer="layer1"
     showgrid="false"
     inkscape:window-width="1920"
     inkscape:window-height="1171"
     inkscape:window-x="1920"
     inkscape:window-y="0"
     inkscape:window-maximized="1"
     inkscape:showpageshadow="false"
     inkscape:snap-global="false"
     units="px" />
  <metadata
     id="metadata5">
    <rdf:RDF>
      <cc:Work
         rdf:about="">
        <dc:format>image/svg+xml</dc:format>
        <dc:type
           rdf:resource="http://purl.org/dc/dcmitype/StillImage" />
        <dc:title></dc:title>
      </cc:Work>
    </rdf:RDF>
  </metadata>
  <g
     inkscape:label="Calque 1"
     inkscape:groupmode="layer"
     id="layer1"
     transform="translate(0,-244.08332)">
    <path
       inkscape:connector-curvature="0"
       style="opacity:0.98000004;fill:url(#radialGradient1501-1);fill-opacity:1;stroke:none;stroke-width:1.74588239;stroke-linecap:round;stroke-linejoin:bevel;stroke-miterlimit:4;stroke-dasharray:none;stroke-opacity:1"
       d="M 45.688282,266.98952 A 18.827164,18.827164 0 0 1 26.861122,285.81668 18.827164,18.827164 0 0 1 8.0339521,266.98952 18.827164,18.827164 0 0 1 26.861122,248.16236 18.827164,18.827164 0 0 1 45.688282,266.98952 Z"
       id="path1401-7-6-0-9-2" />
    <path
       inkscape:connector-curvature="0"
       style="opacity:0.98000004;fill:url(#radialGradient1493-1);fill-opacity:1;stroke:none;stroke-width:1.68352938;stroke-linecap:round;stroke-linejoin:bevel;stroke-miterlimit:4;stroke-dasharray:none;stroke-opacity:1"
       d="M 45.015882,266.98952 A 18.154764,18.154764 0 0 1 26.861122,285.14428 18.154764,18.154764 0 0 1 8.7063521,266.98952 18.154764,18.154764 0 0 1 26.861122,248.83476 18.154764,18.154764 0 0 1 45.015882,266.98952 Z"
       id="path1401-7-6-0-76" />
    <path
       inkscape:connector-curvature="0"
       style="opacity:0.98000004;fill:#a6a6a6;fill-opacity:0.00724637;stroke:none;stroke-width:1.25485289;stroke-linecap:round;stroke-linejoin:bevel;stroke-miterlimit:4;stroke-dasharray:none;stroke-opacity:1"
       d="m 20.095112,278.70859 a 13.532023,13.532023 0 0 1 -4.95307,-18.48508 13.532023,13.532023 0 0 1 18.48509,-4.95307 13.532023,13.532023 0 0 1 4.95306,18.48509 13.532023,13.532023 0 0 1 -18.48508,4.95306 z"
       id="path1401-7-6-9-3" />
    <path
       inkscape:connector-curvature="0"
       style="opacity:0.98000004;fill:url(#radialGradient1485-9);fill-opacity:1;stroke:none;stroke-width:1.17691171;stroke-linecap:round;stroke-linejoin:bevel;stroke-miterlimit:4;stroke-dasharray:none;stroke-opacity:1"
       d="m 39.552642,266.98952 a 12.691525,12.691525 0 0 1 -12.69152,12.69153 12.691525,12.691525 0 0 1 -12.69153,-12.69153 12.691525,12.691525 0 0 1 12.69153,-12.69152 12.691525,12.691525 0 0 1 12.69152,12.69152 z"
       id="path1401-7-6-1" />
    <path
       inkscape:connector-curvature="0"
       style="opacity:0.98000004;fill:url(#radialGradient1469-6);fill-opacity:1;stroke:none;stroke-width:0.77161759;stroke-linecap:round;stroke-linejoin:bevel;stroke-miterlimit:4;stroke-dasharray:none;stroke-opacity:1"
       d="m 35.182052,266.98952 a 8.3209344,8.3209344 0 0 1 -8.32093,8.32093 8.3209344,8.3209344 0 0 1 -8.32094,-8.32093 8.3209344,8.3209344 0 0 1 8.32094,-8.32093 8.3209344,8.3209344 0 0 1 8.32093,8.32093 z"
       id="path1401-7-2" />
    <path
       inkscape:connector-curvature="0"
       style="opacity:0.98000004;fill:url(#radialGradient1477-2);fill-opacity:1;stroke:none;stroke-width:0.26499999;stroke-linecap:round;stroke-linejoin:bevel;stroke-miterlimit:4;stroke-dasharray:none;stroke-opacity:1"
       d="m 29.718812,266.98952 a 2.8576947,2.8576947 0 0 1 -2.85769,2.8577 2.8576947,2.8576947 0 0 1 -2.8577,-2.8577 2.8576947,2.8576947 0 0 1 2.8577,-2.85769 2.8576947,2.8576947 0 0 1 2.85769,2.85769 z"
       id="path1401-1" />
    <path
       inkscape:connector-curvature="0"
       style="opacity:0.98000004;fill:#c9c9c9;fill-opacity:0.51449274;stroke:none;stroke-width:0.53728551;stroke-linecap:round;stroke-linejoin:bevel;stroke-miterlimit:4;stroke-dasharray:none;stroke-opacity:1;filter:url(#filter1555-4)"
       d="m 38.964292,291.36635 a 12.103176,2.7736437 0 0 1 -12.10317,2.77365 12.103176,2.7736437 0 0 1 -12.10318,-2.77365 12.103176,2.7736437 0 0 1 12.10318,-2.77364 12.103176,2.7736437 0 0 1 12.10317,2.77364 z"
       id="path1401-7-6-0-7-5" />
    <g
       transform="translate(-12.138005,91.945845)"
       aria-label="LANDSURVEY"
       style="font-style:normal;font-weight:normal;font-size:6.58389187px;line-height:1.25;font-family:sans-serif;letter-spacing:0px;word-spacing:0px;fill:#34699b;fill-opacity:1;stroke:none;stroke-width:0.16459729"
       id="text909-1-2-8-9">
      <path
         inkscape:connector-curvature="0"
         d="m 28.757447,189.26203 q -0.09578,-0.079 -0.01676,-0.17481 l 1.43327,-1.73719 q 0.143687,-0.17416 0.214552,-0.31327 0.06292,-0.13834 0.05508,-0.26189 -0.01143,-0.11919 -0.09513,-0.23947 -0.09165,-0.11952 -0.261449,-0.25961 l -1.763317,-1.45482 q -0.09578,-0.079 -0.01676,-0.17482 l 0.352031,-0.42667 q 0.07903,-0.0958 0.174812,-0.0168 l 1.78944,1.47637 q 0.330894,0.27301 0.511359,0.52435 0.180465,0.25133 0.21714,0.50844 0.02873,0.25786 -0.08122,0.53303 -0.117892,0.27593 -0.376527,0.58941 l -1.487153,1.8025 q -0.07903,0.0958 -0.179166,0.0132 z"
         style="font-style:normal;font-variant:normal;font-weight:600;font-stretch:normal;font-size:5.64444447px;font-family:Conthrax;-inkscape-font-specification:'Conthrax, Semi-Bold';font-variant-ligatures:normal;font-variant-caps:normal;font-variant-numeric:normal;font-feature-settings:normal;text-align:start;writing-mode:lr-tb;text-anchor:start;fill:#34699b;fill-opacity:1"
         id="path1299-9" />
      <path
         inkscape:connector-curvature="0"
         d="m 23.674298,183.46365 q -0.104551,-0.18729 -0.09723,-0.35945 0.0024,-0.16941 0.155389,-0.41643 l 2.051316,-3.28488 q 0.03553,-0.0522 0.07828,-0.0566 0.03507,-0.007 0.06809,0.0525 l 0.349421,0.62591 q 0.04677,0.0838 -7.89e-4,0.14912 l -0.440427,0.70485 1.293133,2.31638 0.825616,-0.0149 q 0.08333,-0.001 0.127351,0.0776 l 0.357675,0.6407 q 0.03577,0.0641 0.01445,0.0954 -0.029,0.0291 -0.09204,0.032 l -3.864454,0.037 q -0.290565,6e-4 -0.430524,-0.0764 -0.144888,-0.0743 -0.232931,-0.23197 z m 2.712146,-0.25998 -0.946463,-1.69539 -1.006578,1.58977 q -0.02349,0.039 -0.0042,0.0735 l 0.01651,0.0296 q 0.01926,0.0345 0.06476,0.035 z"
         style="font-style:normal;font-variant:normal;font-weight:600;font-stretch:normal;font-size:5.64444447px;font-family:Conthrax;-inkscape-font-specification:'Conthrax, Semi-Bold';font-variant-ligatures:normal;font-variant-caps:normal;font-variant-numeric:normal;font-feature-settings:normal;text-align:start;writing-mode:lr-tb;text-anchor:start;fill:#34699b;fill-opacity:1"
         id="path1301-1" />
      <path
         inkscape:connector-curvature="0"
         d="m 21.749401,178.21089 q -0.01394,-0.13475 -0.01201,-0.22574 0.0019,-0.091 0.03426,-0.16243 0.02672,-0.0709 0.0877,-0.13959 0.05537,-0.0682 0.153908,-0.1578 l 2.523725,-2.3721 q 0.03698,-0.0265 0.03175,-0.0771 l -0.0052,-0.0505 q -0.0046,-0.0449 -0.06079,-0.0391 l -2.930749,0.30329 q -0.123518,0.0128 -0.1363,-0.11074 l -0.06101,-0.58952 q -0.01278,-0.12351 0.110736,-0.1363 l 3.222702,-0.33349 q 0.342482,-0.0354 0.478782,0.0753 0.130686,0.11132 0.157412,0.36958 l 0.04997,0.48285 q 0.01336,0.12913 0.01143,0.22012 -0.0025,0.0854 -0.02923,0.15624 -0.02672,0.0709 -0.0815,0.14463 -0.06098,0.0687 -0.164556,0.16457 l -2.523144,2.37772 q -0.03582,0.0377 -0.03175,0.077 l 0.0052,0.0505 q 0.0046,0.0449 0.06079,0.0391 l 2.930749,-0.30328 q 0.123518,-0.0128 0.1363,0.11073 l 0.06101,0.58952 q 0.01336,0.12913 -0.110155,0.14192 l -3.222702,0.33349 q -0.342482,0.0354 -0.473168,-0.0759 -0.1363,-0.11074 -0.163026,-0.36901 z"
         style="font-style:normal;font-variant:normal;font-weight:600;font-stretch:normal;font-size:5.64444447px;font-family:Conthrax;-inkscape-font-specification:'Conthrax, Semi-Bold';font-variant-ligatures:normal;font-variant-caps:normal;font-variant-numeric:normal;font-feature-settings:normal;text-align:start;writing-mode:lr-tb;text-anchor:start;fill:#34699b;fill-opacity:1"
         id="path1303-4" />
      <path
         inkscape:connector-curvature="0"
         d="m 22.433372,169.41806 q 0.133247,-0.43735 0.320449,-0.72255 0.181803,-0.28684 0.431648,-0.42905 0.244446,-0.14384 0.56398,-0.1468 0.315779,-0.01 0.709936,0.11008 l 0.73432,0.22373 q 0.394157,0.12008 0.656114,0.30611 0.258203,0.17897 0.386317,0.43633 0.122713,0.25571 0.119091,0.59684 -0.009,0.33948 -0.142269,0.77684 l -0.769875,2.52692 q -0.04935,0.16198 -0.211333,0.11263 l -3.455622,-1.05282 q -0.161982,-0.0494 -0.112631,-0.21133 z m 2.39134,2.76428 q 0.07019,0.0214 0.09158,-0.0488 l 0.53957,-1.77101 q 0.07238,-0.23757 0.07854,-0.41271 0.0062,-0.17514 -0.06142,-0.30194 -0.06593,-0.1322 -0.214755,-0.22475 -0.148822,-0.0926 -0.386396,-0.16493 l -0.593935,-0.18095 q -0.237574,-0.0724 -0.412717,-0.0785 -0.175143,-0.006 -0.303588,0.0668 -0.1268,0.0676 -0.219346,0.2164 -0.09255,0.14883 -0.164927,0.3864 l -0.539571,1.77101 q -0.02138,0.0702 0.05421,0.0932 z"
         style="font-style:normal;font-variant:normal;font-weight:600;font-stretch:normal;font-size:5.64444447px;font-family:Conthrax;-inkscape-font-specification:'Conthrax, Semi-Bold';font-variant-ligatures:normal;font-variant-caps:normal;font-variant-numeric:normal;font-feature-settings:normal;text-align:start;writing-mode:lr-tb;text-anchor:start;fill:#34699b;fill-opacity:1"
         id="path1305-9" />
      <path
         inkscape:connector-curvature="0"
         d="m 26.427129,162.74624 q 0.07681,-0.0976 0.174382,-0.0208 l 0.421348,0.33167 q 0.09758,0.0768 0.02077,0.17438 l -1.749083,2.22206 q -0.101244,0.12862 -0.07661,0.23421 0.02463,0.10559 0.139951,0.19636 l 0.150799,0.1187 q 0.248373,0.19551 0.429915,-0.0351 l 1.309193,-1.66321 q 0.303733,-0.38587 0.656931,-0.42392 0.348763,-0.0415 0.716888,0.24823 l 0.35482,0.2793 q 0.323773,0.25485 0.373238,0.60267 0.04946,0.34782 -0.268232,0.75143 l -1.934115,2.45712 q -0.0803,0.10201 -0.177873,0.0252 l -0.421348,-0.33166 q -0.09758,-0.0768 -0.01728,-0.17882 l 1.83287,-2.3285 q 0.101245,-0.12863 0.07661,-0.23422 -0.02463,-0.10559 -0.139951,-0.19636 l -0.181845,-0.14314 q -0.248374,-0.1955 -0.429915,0.0351 l -1.309193,1.66322 q -0.303733,0.38586 -0.652496,0.4274 -0.353198,0.038 -0.721323,-0.25172 l -0.323773,-0.25486 q -0.323773,-0.25485 -0.373238,-0.60267 -0.04947,-0.34782 0.268232,-0.75143 z"
         style="font-style:normal;font-variant:normal;font-weight:600;font-stretch:normal;font-size:5.64444447px;font-family:Conthrax;-inkscape-font-specification:'Conthrax, Semi-Bold';font-variant-ligatures:normal;font-variant-caps:normal;font-variant-numeric:normal;font-feature-settings:normal;text-align:start;writing-mode:lr-tb;text-anchor:start;fill:#34699b;fill-opacity:1"
         id="path1307-1" />
      <path
         inkscape:connector-curvature="0"
         d="m 28.863833,160.69839 q 0.107756,-0.0617 0.169471,0.046 l 1.119295,1.9543 q 0.112211,0.19592 0.21734,0.31134 0.107223,0.10771 0.225577,0.144 0.115548,0.0314 0.257635,-0.004 0.144179,-0.0435 0.335201,-0.15295 l 1.356743,-0.77706 q 0.191022,-0.1094 0.29664,-0.20892 0.107711,-0.10722 0.139102,-0.22277 0.02859,-0.12045 -0.01496,-0.26463 -0.04635,-0.14907 -0.158564,-0.34499 l -1.119295,-1.9543 q -0.06172,-0.10776 0.04604,-0.16947 l 0.533881,-0.30578 q 0.107756,-0.0617 0.169472,0.046 l 1.161373,2.02777 q 0.201978,0.35266 0.271576,0.64453 0.06679,0.28698 -0.01,0.5391 -0.07467,0.24441 -0.299889,0.46446 -0.22032,0.21725 -0.592567,0.43045 l -1.410622,0.80791 q -0.372247,0.2132 -0.671114,0.29331 -0.298867,0.0801 -0.552362,0.0237 -0.251401,-0.0642 -0.470032,-0.26418 -0.216537,-0.20772 -0.418515,-0.56037 l -1.161374,-2.02777 q -0.06172,-0.10776 0.05094,-0.17228 z"
         style="font-style:normal;font-variant:normal;font-weight:600;font-stretch:normal;font-size:5.64444447px;font-family:Conthrax;-inkscape-font-specification:'Conthrax, Semi-Bold';font-variant-ligatures:normal;font-variant-caps:normal;font-variant-numeric:normal;font-feature-settings:normal;text-align:start;writing-mode:lr-tb;text-anchor:start;fill:#34699b;fill-opacity:1"
         id="path1309-0" />
      <path
         inkscape:connector-curvature="0"
         d="m 37.72655,157.5669 q 0.64279,-0.0904 0.963127,0.16099 0.320336,0.25136 0.400491,0.82149 l 0.04479,0.3186 q 0.06758,0.48069 -0.08876,0.78767 -0.156341,0.30698 -0.586908,0.44731 l 1.122396,1.05059 q 0.03188,0.024 0.02856,0.0815 -0.0033,0.0575 -0.08157,0.0685 l -0.721042,0.10137 q -0.07266,0.0102 -0.102968,-0.003 -0.0303,-0.0128 -0.06375,-0.048 l -1.046589,-1.03845 -1.8054,0.25382 0.156379,1.1123 q 0.01729,0.12297 -0.10568,0.14026 l -0.603664,0.0849 q -0.128558,0.0181 -0.145846,-0.10489 l -0.509215,-3.62198 q -0.02358,-0.16769 0.144109,-0.19126 z m -2.033502,2.32077 2.140769,-0.30097 q 0.285063,-0.0401 0.385154,-0.17955 0.10009,-0.13947 0.06473,-0.39099 l -0.033,-0.23476 q -0.03536,-0.25153 -0.17003,-0.35799 -0.134667,-0.10647 -0.41973,-0.0664 l -2.068106,0.29075 q -0.07266,0.0102 -0.06323,0.0773 z"
         style="font-style:normal;font-variant:normal;font-weight:600;font-stretch:normal;font-size:5.64444447px;font-family:Conthrax;-inkscape-font-specification:'Conthrax, Semi-Bold';font-variant-ligatures:normal;font-variant-caps:normal;font-variant-numeric:normal;font-feature-settings:normal;text-align:start;writing-mode:lr-tb;text-anchor:start;fill:#34699b;fill-opacity:1"
         id="path1311-7" />
      <path
         inkscape:connector-curvature="0"
         d="m 41.34522,157.6262 q 0.05491,0.0131 0.07294,0.0348 0.02353,0.023 0.03633,0.0667 l 0.904471,3.33747 q 0.0073,0.0424 0.05672,0.0541 l 0.02745,0.007 q 0.03843,0.009 0.06956,-0.024 l 2.291031,-2.5756 q 0.04996,-0.0635 0.1433,-0.0413 l 0.719262,0.17148 q 0.06589,0.0157 0.06771,0.0568 0.0086,0.0369 -0.03193,0.0852 l -2.587631,2.87046 q -0.19748,0.21984 -0.348889,0.27078 -0.151408,0.0509 -0.327106,0.009 l -0.318452,-0.0759 q -0.214132,-0.0511 -0.337251,-0.16745 -0.117628,-0.11508 -0.194676,-0.40037 l -1.036134,-3.73442 q -0.01436,-0.0614 0.0045,-0.0918 0.02563,-0.0345 0.09701,-0.0175 z"
         style="font-style:normal;font-variant:normal;font-weight:600;font-stretch:normal;font-size:5.64444447px;font-family:Conthrax;-inkscape-font-specification:'Conthrax, Semi-Bold';font-variant-ligatures:normal;font-variant-caps:normal;font-variant-numeric:normal;font-feature-settings:normal;text-align:start;writing-mode:lr-tb;text-anchor:start;fill:#34699b;fill-opacity:1"
         id="path1313-5" />
      <path
         inkscape:connector-curvature="0"
         d="m 50.593844,161.8056 q 0.106746,0.0739 0.03607,0.17599 l -0.30518,0.44091 q -0.07067,0.1021 -0.177419,0.0282 l -2.028175,-1.40383 q -0.181004,-0.12528 -0.32416,-0.17632 -0.135303,-0.0525 -0.26096,-0.0296 -0.117803,0.0214 -0.232385,0.12746 -0.11137,0.1014 -0.236654,0.2824 l -0.03213,0.0464 2.62224,1.81502 q 0.102105,0.0707 0.03143,0.17278 l -0.253782,0.36665 q -0.07067,0.1021 -0.172778,0.0314 l -2.622239,-1.81502 -0.05461,0.0789 q -0.125285,0.18101 -0.184173,0.32559 -0.05568,0.13995 -0.03746,0.26239 0.02607,0.12102 0.119613,0.23381 0.101395,0.11137 0.282399,0.23666 l 2.028174,1.40383 q 0.106746,0.0739 0.03607,0.17599 l -0.30518,0.4409 q -0.07067,0.10211 -0.177419,0.0282 l -2.042098,-1.41346 q -0.352726,-0.24415 -0.553732,-0.47938 -0.201006,-0.23523 -0.25922,-0.48833 -0.05036,-0.25453 0.036,-0.53798 0.09422,-0.28489 0.325511,-0.61905 l 0.552537,-0.79827 q 0.231294,-0.33416 0.461532,-0.51803 0.234879,-0.18066 0.487621,-0.21853 0.260596,-0.0393 0.55155,0.066 0.294167,0.10064 0.646893,0.34479 z"
         style="font-style:normal;font-variant:normal;font-weight:600;font-stretch:normal;font-size:5.64444447px;font-family:Conthrax;-inkscape-font-specification:'Conthrax, Semi-Bold';font-variant-ligatures:normal;font-variant-caps:normal;font-variant-numeric:normal;font-feature-settings:normal;text-align:start;writing-mode:lr-tb;text-anchor:start;fill:#34699b;fill-opacity:1"
         id="path1315-8" />
      <path
         inkscape:connector-curvature="0"
         d="m 52.500126,163.81007 q 0.05101,0.0745 0.02063,0.15004 l -0.830139,2.3946 2.539097,0.10193 q 0.0814,-0.001 0.132413,0.0735 l 0.417674,0.61016 q 0.02551,0.0373 0.0025,0.0736 -0.01838,0.0331 -0.06693,0.0321 l -3.315106,-0.18634 -0.894278,0.61216 q -0.10247,0.0702 -0.172613,-0.0323 L 49.989,167.13648 q -0.07333,-0.10713 0.02914,-0.17728 l 0.894278,-0.61216 1.038621,-3.13926 q 0.01666,-0.0456 0.05098,-0.0554 0.04217,-0.008 0.07086,0.0336 z"
         style="font-style:normal;font-variant:normal;font-weight:600;font-stretch:normal;font-size:5.64444447px;font-family:Conthrax;-inkscape-font-specification:'Conthrax, Semi-Bold';font-variant-ligatures:normal;font-variant-caps:normal;font-variant-numeric:normal;font-feature-settings:normal;text-align:start;writing-mode:lr-tb;text-anchor:start;fill:#34699b;fill-opacity:1"
         id="path1317-7" />
    </g>
    <g
       aria-label="CODESIMPORT"
       transform="rotate(52.538639,-60.459864,208.77809)"
       style="font-style:normal;font-weight:normal;font-size:6.58389187px;line-height:1.25;font-family:sans-serif;letter-spacing:0px;word-spacing:0px;fill:#316491;fill-opacity:1;stroke:none;stroke-width:0.16459729"
       id="text909-1-9-0-8-0">
      <path
         inkscape:connector-curvature="0"
         d="m 44.256843,186.40234 q -0.08479,0.0547 -0.139472,-0.0301 l -0.243568,-0.37772 q -0.05716,-0.0887 0.02763,-0.14333 l 1.715141,-1.106 q 0.150316,-0.0969 0.233128,-0.18853 0.08144,-0.0853 0.09949,-0.1842 0.02053,-0.0951 -0.01711,-0.21271 -0.04149,-0.11512 -0.14091,-0.26929 l -0.352926,-0.5473 q -0.09942,-0.15417 -0.189647,-0.24333 -0.0916,-0.0828 -0.18918,-0.1072 -0.09509,-0.0205 -0.208848,0.0146 -0.115123,0.0415 -0.265439,0.13842 l -1.715141,1.106 q -0.08479,0.0547 -0.139472,-0.0301 l -0.243569,-0.37772 q -0.05468,-0.0848 0.03012,-0.13947 l 1.738267,-1.12091 q 0.292923,-0.18889 0.531994,-0.26666 0.23907,-0.0778 0.447162,-0.0428 0.206723,0.0413 0.39266,0.19427 0.184569,0.15928 0.363517,0.43679 l 0.427488,0.66293 q 0.178948,0.2775 0.245404,0.5075 0.0626,0.23248 0.01246,0.43398 -0.05151,0.20784 -0.220992,0.39352 -0.166994,0.18954 -0.459917,0.37843 z"
         style="font-style:normal;font-variant:normal;font-weight:600;font-stretch:normal;font-size:4.58611107px;font-family:Conthrax;-inkscape-font-specification:'Conthrax, Semi-Bold';font-variant-ligatures:normal;font-variant-caps:normal;font-variant-numeric:normal;font-feature-settings:normal;text-align:start;writing-mode:lr-tb;text-anchor:start;fill:#316491;fill-opacity:1;stroke-width:0.16459729"
         id="path1276-4" />
      <path
         inkscape:connector-curvature="0"
         d="m 39.637655,187.47149 q -0.346359,0.039 -0.595591,-0.002 -0.253276,-0.0361 -0.420078,-0.16503 -0.170847,-0.12384 -0.264848,-0.34401 -0.094,-0.22018 -0.130923,-0.54831 l -0.0882,-0.78386 q -0.03692,-0.32813 0.0053,-0.56825 0.04272,-0.23556 0.18126,-0.39883 0.134496,-0.1582 0.373413,-0.24969 0.234361,-0.091 0.580719,-0.12996 l 1.408221,-0.15846 q 0.346359,-0.039 0.595078,-0.002 0.248719,0.0366 0.419566,0.16047 0.166802,0.12891 0.26536,0.34858 0.09451,0.22473 0.131436,0.55286 l 0.0882,0.78386 q 0.03692,0.32813 -0.0058,0.56369 -0.04728,0.23607 -0.181773,0.39427 -0.13854,0.16327 -0.3729,0.25426 -0.233848,0.0955 -0.580206,0.13451 z m 1.769061,-2.16046 q -0.02,-0.17774 -0.06119,-0.29771 -0.04523,-0.1149 -0.1218,-0.18013 -0.07605,-0.0607 -0.193576,-0.0797 -0.121568,-0.014 -0.299304,0.006 l -1.353533,0.15231 q -0.177737,0.02 -0.288594,0.0602 -0.114901,0.0452 -0.17557,0.12129 -0.06016,0.0806 -0.07417,0.20217 -0.01806,0.12664 0.0019,0.30438 l 0.07692,0.6836 q 0.02,0.17774 0.06523,0.29264 0.04119,0.11997 0.117242,0.18064 0.07657,0.0652 0.198133,0.0792 0.117524,0.0191 0.29526,-9.2e-4 l 1.353533,-0.15231 q 0.177737,-0.02 0.292639,-0.0652 0.110857,-0.0402 0.171012,-0.12077 0.06067,-0.0761 0.07872,-0.20269 0.01401,-0.12157 -0.006,-0.29931 z"
         style="font-style:normal;font-variant:normal;font-weight:600;font-stretch:normal;font-size:4.58611107px;font-family:Conthrax;-inkscape-font-specification:'Conthrax, Semi-Bold';font-variant-ligatures:normal;font-variant-caps:normal;font-variant-numeric:normal;font-feature-settings:normal;text-align:start;writing-mode:lr-tb;text-anchor:start;fill:#316491;fill-opacity:1;stroke-width:0.16459729"
         id="path1278-8" />
      <path
         inkscape:connector-curvature="0"
         d="m 34.094382,186.48692 q -0.346831,-0.13305 -0.567255,-0.30111 -0.222067,-0.16378 -0.323006,-0.37442 -0.102581,-0.20636 -0.08667,-0.4655 0.01,-0.25651 0.129891,-0.56908 l 0.223391,-0.58233 q 0.119908,-0.31258 0.28568,-0.51423 0.159849,-0.19902 0.375768,-0.28811 0.214276,-0.0848 0.490548,-0.0623 0.27463,0.0268 0.621461,0.15981 l 2.003912,0.76872 q 0.128456,0.0493 0.07918,0.17774 l -1.051248,2.74039 q -0.04928,0.12846 -0.177733,0.0792 z m 2.377375,-1.77977 q 0.02135,-0.0557 -0.03431,-0.077 l -1.404451,-0.53876 q -0.188402,-0.0723 -0.329999,-0.0873 -0.141596,-0.015 -0.248236,0.0325 -0.110922,0.0459 -0.194454,0.16118 -0.08353,0.11531 -0.155806,0.30371 l -0.180683,0.47101 q -0.07227,0.1884 -0.0873,0.33 -0.01502,0.14159 0.03677,0.24988 0.04751,0.10664 0.162823,0.19017 0.115315,0.0835 0.303717,0.1558 l 1.404451,0.53877 q 0.05566,0.0213 0.07866,-0.0386 z"
         style="font-style:normal;font-variant:normal;font-weight:600;font-stretch:normal;font-size:4.58611107px;font-family:Conthrax;-inkscape-font-specification:'Conthrax, Semi-Bold';font-variant-ligatures:normal;font-variant-caps:normal;font-variant-numeric:normal;font-feature-settings:normal;text-align:start;writing-mode:lr-tb;text-anchor:start;fill:#316491;fill-opacity:1;stroke-width:0.16459729"
         id="path1280-0" />
      <path
         inkscape:connector-curvature="0"
         d="m 28.864706,182.43825 q -0.0726,-0.0765 5.92e-4,-0.14596 l 0.31606,-0.29987 q 0.07319,-0.0695 0.145794,0.007 l 1.379413,1.45388 q 0.123106,0.12975 0.228465,0.19415 0.09887,0.0642 0.202611,0.067 0.09725,0.003 0.20602,-0.0627 0.10544,-0.0621 0.235191,-0.18522 l 0.03327,-0.0316 -1.783452,-1.87973 q -0.06944,-0.0732 0.0037,-0.14264 l 0.262829,-0.24937 q 0.07319,-0.0694 0.142637,0.004 l 1.783452,1.87973 0.05656,-0.0537 q 0.129751,-0.12311 0.20064,-0.2283 0.06756,-0.10203 0.07344,-0.20244 -6.01e-4,-0.10058 -0.05623,-0.20585 -0.06211,-0.10544 -0.185214,-0.23519 l -1.379413,-1.45387 q -0.0726,-0.0765 5.92e-4,-0.14597 l 0.31606,-0.29987 q 0.07319,-0.0694 0.145794,0.007 l 1.388883,1.46385 q 0.239898,0.25285 0.360618,0.47337 0.12072,0.22052 0.124907,0.43149 -0.0023,0.2108 -0.118139,0.42186 -0.122326,0.21089 -0.361866,0.43816 l -0.572236,0.54293 q -0.23954,0.22727 -0.453236,0.33519 -0.216852,0.1046 -0.424154,0.0927 -0.213785,-0.0121 -0.42766,-0.14424 -0.217201,-0.12898 -0.457099,-0.38183 z"
         style="font-style:normal;font-variant:normal;font-weight:600;font-stretch:normal;font-size:4.58611107px;font-family:Conthrax;-inkscape-font-specification:'Conthrax, Semi-Bold';font-variant-ligatures:normal;font-variant-caps:normal;font-variant-numeric:normal;font-feature-settings:normal;text-align:start;writing-mode:lr-tb;text-anchor:start;fill:#316491;fill-opacity:1;stroke-width:0.16459729"
         id="path1282-4" />
      <path
         inkscape:connector-curvature="0"
         d="m 26.759349,177.68573 q -0.03282,-0.0954 0.06258,-0.12823 l 0.41198,-0.14174 q 0.09541,-0.0328 0.12823,0.0626 l 0.747486,2.17265 q 0.04327,0.12577 0.126221,0.15543 0.08295,0.0297 0.195706,-0.009 l 0.147445,-0.0507 q 0.242852,-0.0835 0.165268,-0.30906 l -0.559495,-1.62624 q -0.129803,-0.37728 -3.02e-4,-0.63524 0.125164,-0.25645 0.485105,-0.38029 l 0.34693,-0.11936 q 0.316575,-0.10891 0.575879,0.0104 0.259304,0.11934 0.395074,0.51397 l 0.826562,2.4025 q 0.03432,0.0997 -0.06109,0.13256 l -0.41198,0.14174 q -0.09541,0.0328 -0.129722,-0.0669 l -0.783294,-2.27673 q -0.04327,-0.12576 -0.126221,-0.15542 -0.08295,-0.0297 -0.195706,0.009 l -0.177802,0.0612 q -0.242851,0.0836 -0.165268,0.30906 l 0.559496,1.62623 q 0.129803,0.37729 0.0046,0.63375 -0.129501,0.25795 -0.489442,0.38179 l -0.316574,0.10891 q -0.316574,0.10892 -0.575878,-0.0104 -0.259304,-0.11933 -0.395075,-0.51397 z"
         style="font-style:normal;font-variant:normal;font-weight:600;font-stretch:normal;font-size:4.58611107px;font-family:Conthrax;-inkscape-font-specification:'Conthrax, Semi-Bold';font-variant-ligatures:normal;font-variant-caps:normal;font-variant-numeric:normal;font-feature-settings:normal;text-align:start;writing-mode:lr-tb;text-anchor:start;fill:#316491;fill-opacity:1;stroke-width:0.16459729"
         id="path1284-2" />
      <path
         inkscape:connector-curvature="0"
         d="m 26.584631,175.41576 q -0.0046,-0.10079 0.0962,-0.10538 l 3.005378,-0.13678 q 0.10079,-0.005 0.105377,0.0962 l 0.02252,0.49479 q 0.0048,0.10537 -0.096,0.10996 l -3.005378,0.13678 q -0.10079,0.005 -0.105586,-0.10079 z"
         style="font-style:normal;font-variant:normal;font-weight:600;font-stretch:normal;font-size:4.58611107px;font-family:Conthrax;-inkscape-font-specification:'Conthrax, Semi-Bold';font-variant-ligatures:normal;font-variant-caps:normal;font-variant-numeric:normal;font-feature-settings:normal;text-align:start;writing-mode:lr-tb;text-anchor:start;fill:#316491;fill-opacity:1"
         id="path1286-9" />
      <path
         inkscape:connector-curvature="0"
         d="m 26.740394,172.59948 q 0.03216,-0.0956 0.06859,-0.1608 0.03643,-0.0652 0.09309,-0.10417 0.05232,-0.0405 0.130676,-0.0577 0.07547,-0.023 0.194418,-0.0314 l 2.390565,-0.20251 q 0.04497,-0.004 0.05959,-0.0477 l 0.01754,-0.0522 q 0.01462,-0.0435 -0.01866,-0.074 l -1.782477,-1.6058 q -0.08971,-0.0786 -0.13741,-0.13814 -0.05059,-0.0654 -0.06782,-0.12925 -0.02158,-0.0653 -0.0127,-0.13491 0.01035,-0.0739 0.04251,-0.16957 l 0.156407,-0.46512 q 0.07601,-0.22604 0.206649,-0.2692 0.12629,-0.0446 0.374065,0.0387 l 2.495131,0.83904 q 0.09563,0.0322 0.06201,0.13214 l -0.149099,0.44339 q -0.03216,0.0956 -0.127791,0.0635 l -2.269091,-0.76304 q -0.04347,-0.0146 -0.05516,0.0202 l -0.01316,0.0391 q -0.01462,0.0435 0.01577,0.0682 l 1.652145,1.53294 q 0.09983,0.0916 0.163415,0.17591 0.0607,0.0785 0.09094,0.16122 0.0317,0.0784 0.02566,0.1683 -0.0046,0.0855 -0.04112,0.19423 l -0.07016,0.20865 q -0.03654,0.10867 -0.08605,0.18396 -0.04805,0.0709 -0.122136,0.11859 -0.07263,0.0433 -0.169875,0.0735 -0.100132,0.0244 -0.23504,0.0371 l -2.242693,0.22322 q -0.03916,0.001 -0.05378,0.0448 l -0.01316,0.0391 q -0.01169,0.0348 0.03177,0.0494 l 2.269092,0.76303 q 0.09563,0.0322 0.06347,0.12779 l -0.149098,0.44339 q -0.03362,0.1 -0.129253,0.0678 l -2.495131,-0.83905 q -0.247774,-0.0833 -0.321442,-0.19518 -0.07801,-0.11333 -5.41e-4,-0.34371 z"
         style="font-style:normal;font-variant:normal;font-weight:600;font-stretch:normal;font-size:4.58611107px;font-family:Conthrax;-inkscape-font-specification:'Conthrax, Semi-Bold';font-variant-ligatures:normal;font-variant-caps:normal;font-variant-numeric:normal;font-feature-settings:normal;text-align:start;writing-mode:lr-tb;text-anchor:start;fill:#316491;fill-opacity:1"
         id="path1288-6" />
      <path
         inkscape:connector-curvature="0"
         d="m 31.392468,165.26654 q 0.394027,-0.35056 0.72386,-0.32481 0.329833,0.0257 0.640769,0.37523 l 0.225581,0.25355 q 0.310937,0.34948 0.298137,0.68007 -0.0128,0.33059 -0.406826,0.68116 l -1.418498,1.26203 0.585292,0.65786 q 0.06706,0.0754 -0.0083,0.14244 l -0.370043,0.32923 q -0.07881,0.0701 -0.14587,-0.005 l -1.975362,-2.22026 q -0.09145,-0.10279 0.01134,-0.19424 z m -0.339366,2.47496 1.312282,-1.16754 q 0.174743,-0.15547 0.179631,-0.29486 0.0049,-0.1394 -0.13229,-0.29358 l -0.115839,-0.1302 q -0.137178,-0.15419 -0.276195,-0.16555 -0.139018,-0.0114 -0.31376,0.14411 l -1.26774,1.1279 q -0.04454,0.0396 -0.008,0.0807 z"
         style="font-style:normal;font-variant:normal;font-weight:600;font-stretch:normal;font-size:4.58611107px;font-family:Conthrax;-inkscape-font-specification:'Conthrax, Semi-Bold';font-variant-ligatures:normal;font-variant-caps:normal;font-variant-numeric:normal;font-feature-settings:normal;text-align:start;writing-mode:lr-tb;text-anchor:start;fill:#316491;fill-opacity:1"
         id="path1290-1" />
      <path
         inkscape:connector-curvature="0"
         d="m 36.461884,162.9583 q 0.336889,-0.0894 0.589466,-0.0852 0.255833,-0.001 0.439749,0.10158 0.187171,0.0974 0.312466,0.30143 0.125295,0.204 0.209973,0.52315 l 0.202285,0.76244 q 0.08468,0.31915 0.07817,0.56287 -0.0077,0.23927 -0.120767,0.42111 -0.109822,0.17622 -0.332725,0.30179 -0.218471,0.12439 -0.55536,0.21377 l -1.369719,0.36341 q -0.336889,0.0894 -0.58829,0.0897 -0.251401,2.7e-4 -0.438573,-0.0972 -0.183915,-0.10304 -0.313642,-0.30586 -0.126471,-0.20843 -0.211149,-0.52758 l -0.202285,-0.76244 q -0.08468,-0.31916 -0.07699,-0.55843 0.01212,-0.24046 0.121943,-0.41668 0.113079,-0.18184 0.331549,-0.30623 0.217295,-0.12882 0.554184,-0.2182 z m -1.432846,2.39669 q 0.04587,0.17287 0.104217,0.2855 0.06161,0.10702 0.146916,0.1603 0.08413,0.0488 0.203184,0.0505 0.122307,-0.004 0.295185,-0.0498 l 1.316526,-0.34929 q 0.172877,-0.0459 0.276639,-0.10187 0.107019,-0.0616 0.15587,-0.14574 0.04767,-0.0886 0.04369,-0.21087 -7.25e-4,-0.12792 -0.04659,-0.30079 l -0.176411,-0.66492 q -0.04587,-0.17287 -0.107474,-0.27989 -0.05835,-0.11263 -0.142483,-0.16148 -0.08531,-0.0533 -0.207616,-0.0493 -0.119052,-0.002 -0.291929,0.0442 l -1.316526,0.34929 q -0.172877,0.0459 -0.279896,0.10748 -0.103763,0.056 -0.151437,0.14456 -0.04885,0.0841 -0.04812,0.21205 0.004,0.12231 0.04985,0.29518 z"
         style="font-style:normal;font-variant:normal;font-weight:600;font-stretch:normal;font-size:4.58611107px;font-family:Conthrax;-inkscape-font-specification:'Conthrax, Semi-Bold';font-variant-ligatures:normal;font-variant-caps:normal;font-variant-numeric:normal;font-feature-settings:normal;text-align:start;writing-mode:lr-tb;text-anchor:start;fill:#316491;fill-opacity:1"
         id="path1292-0" />
      <path
         inkscape:connector-curvature="0"
         d="m 42.370623,163.17516 q 0.515866,0.10971 0.690548,0.39067 0.174682,0.28096 0.07737,0.73851 l -0.05438,0.25569 q -0.08204,0.38578 -0.286746,0.57668 -0.204702,0.1909 -0.572435,0.17833 l 0.564823,1.11412 q 0.01766,0.0272 -8.52e-4,0.0702 -0.01851,0.0429 -0.08131,0.0296 l -0.578667,-0.12307 q -0.05831,-0.0124 -0.07788,-0.0306 -0.01957,-0.0182 -0.03532,-0.0544 l -0.510324,-1.08377 -1.44891,-0.30814 -0.189845,0.89267 q -0.02099,0.0987 -0.119675,0.0777 l -0.484465,-0.10303 q -0.103174,-0.0219 -0.08219,-0.12063 l 0.618188,-2.90679 q 0.02862,-0.13458 0.163193,-0.10596 z m -2.197692,1.20647 1.718057,0.36538 q 0.228776,0.0487 0.343965,-0.03 0.11519,-0.0786 0.158119,-0.28051 l 0.04007,-0.18841 q 0.04293,-0.20186 -0.03028,-0.32058 -0.07321,-0.11872 -0.301989,-0.16737 l -1.659743,-0.35298 q -0.05832,-0.0124 -0.06976,0.0414 z"
         style="font-style:normal;font-variant:normal;font-weight:600;font-stretch:normal;font-size:4.58611107px;font-family:Conthrax;-inkscape-font-specification:'Conthrax, Semi-Bold';font-variant-ligatures:normal;font-variant-caps:normal;font-variant-numeric:normal;font-feature-settings:normal;text-align:start;writing-mode:lr-tb;text-anchor:start;fill:#316491;fill-opacity:1"
         id="path1294-4" />
      <path
         inkscape:connector-curvature="0"
         d="m 47.887335,166.35265 q 0.0838,0.064 0.02253,0.14421 l -0.272927,0.35708 q -0.06405,0.0838 -0.147859,0.0198 l -1.144114,-0.87448 -1.489958,1.94937 q -0.06127,0.0802 -0.14143,0.0189 l -0.397161,-0.30356 q -0.08016,-0.0613 -0.01889,-0.14143 l 1.489958,-1.94937 -1.144114,-0.87448 q -0.0838,-0.0641 -0.01975,-0.14786 l 0.272927,-0.35708 q 0.06127,-0.0802 0.145074,-0.0161 z"
         style="font-style:normal;font-variant:normal;font-weight:600;font-stretch:normal;font-size:4.58611107px;font-family:Conthrax;-inkscape-font-specification:'Conthrax, Semi-Bold';font-variant-ligatures:normal;font-variant-caps:normal;font-variant-numeric:normal;font-feature-settings:normal;text-align:start;writing-mode:lr-tb;text-anchor:start;fill:#316491;fill-opacity:1"
         id="path1296-2" />
    </g>
    <path
       inkscape:connector-curvature="0"
       style="opacity:0.98000004;fill:#cb6363;fill-opacity:0;stroke:none;stroke-width:0.84955877;stroke-linecap:round;stroke-linejoin:bevel;stroke-miterlimit:4;stroke-dasharray:none;stroke-opacity:1"
       d="m 33.294852,273.52216 a 9.1614323,9.1614323 0 0 1 -12.95622,-10e-6 9.1614323,9.1614323 0 0 1 0,-12.95621 9.1614323,9.1614323 0 0 1 12.95622,-1e-5 9.1614323,9.1614323 0 0 1 0,12.95623 z"
       id="path1401-7-4-2" />
  </g>
</svg>
