<?xml version='1.0' encoding='UTF-8' standalone='no'?>
<svg width="49.9533mm" height="49.9533mm" version="1.2" viewBox="0 0 590 590" xmlns:cc="http://creativecommons.org/ns#" xmlns:xlink="http://www.w3.org/1999/xlink" xmlns="http://www.w3.org/2000/svg" baseProfile="tiny">
 <defs/>
 <g stroke="black" fill-rule="evenodd" stroke-linecap="square" fill="none" stroke-linejoin="bevel" stroke-width="1">
  <g stroke="#000000" font-weight="400" stroke-opacity="1" font-style="normal" stroke-linecap="square" fill="none" stroke-linejoin="bevel" stroke-width="1" font-family="Noto Sans" transform="matrix(1,0,0,1,0,0)" font-size="41.6667"/>
  <g stroke="#000000" font-weight="400" stroke-opacity="1" font-style="normal" stroke-linecap="square" fill="none" stroke-linejoin="bevel" stroke-width="1" font-family="Noto Sans" transform="matrix(1,0,0,1,0,0)" font-size="41.6667"/>
  <g stroke="#000000" font-weight="400" stroke-opacity="1" font-style="normal" stroke-linecap="square" fill="none" stroke-linejoin="bevel" stroke-width="1" font-family="Noto Sans" transform="matrix(11.8,0,0,11.8,0,0)" font-size="41.6667"/>
  <g stroke="#000000" font-weight="400" stroke-opacity="1" font-style="normal" stroke-linecap="square" fill="none" stroke-linejoin="bevel" stroke-width="1" font-family="Noto Sans" transform="matrix(11.8,0,0,11.8,0,0)" font-size="41.6667"/>
  <g stroke="#000000" font-weight="400" stroke-opacity="1" font-style="normal" stroke-linecap="square" fill="none" stroke-linejoin="bevel" stroke-width="1" font-family="Noto Sans" transform="matrix(11.8,0,0,11.8,0,0)" font-size="41.6667"/>
  <g stroke="#000000" font-weight="400" stroke-opacity="1" font-style="normal" stroke-linecap="square" fill="none" stroke-linejoin="bevel" stroke-width="1" font-family="Noto Sans" transform="matrix(11.8,0,0,11.8,0,0)" font-size="41.6667"/>
  <g stroke="#000000" font-weight="400" stroke-opacity="1" font-style="normal" stroke-linecap="square" fill="none" stroke-linejoin="bevel" stroke-width="1" font-family="Noto Sans" transform="matrix(11.8,0,0,11.8,0,0)" font-size="41.6667"/>
  <g stroke="#000000" font-weight="400" stroke-opacity="1" font-style="normal" stroke-linecap="square" fill="none" stroke-linejoin="bevel" stroke-width="1" font-family="Noto Sans" transform="matrix(0.999067,0,0,0.999067,0,0)" font-size="41.6667"/>
  <g stroke="none" font-weight="400" font-style="normal" fill-opacity="1" fill="#ffffff" font-family="Noto Sans" transform="matrix(0.999067,0,0,0.999067,0,0)" font-size="41.6667">
   <path d="M-2,-2 L593,-2 L593,593 L-2,593 L-2,-2" vector-effect="none" fill-rule="evenodd"/>
  </g>
  <g stroke="#000000" font-weight="400" stroke-opacity="1" font-style="normal" stroke-linecap="square" fill="none" stroke-linejoin="bevel" stroke-width="1" font-family="Noto Sans" transform="matrix(0.999067,0,0,0.999067,0,0)" font-size="41.6667"/>
  <g stroke="#000000" font-weight="400" stroke-opacity="1" font-style="normal" stroke-linecap="square" fill="none" stroke-linejoin="bevel" stroke-width="1" font-family="Noto Sans" transform="matrix(11.8,0,0,11.8,0,0)" font-size="41.6667"/>
  <g stroke="#000000" font-weight="400" stroke-opacity="1" font-style="normal" stroke-linecap="square" fill="none" stroke-linejoin="bevel" stroke-width="1" font-family="Noto Sans" transform="matrix(11.8,0,0,11.8,0,0)" font-size="41.6667"/>
  <g stroke="#000000" font-weight="400" stroke-opacity="1" font-style="normal" stroke-linecap="square" fill="none" stroke-linejoin="bevel" stroke-width="1" font-family="Noto Sans" transform="matrix(11.8,0,0,11.8,0,0)" font-size="41.6667"/>
  <g stroke="#000000" font-weight="400" stroke-opacity="1" font-style="normal" stroke-linecap="square" fill="none" stroke-linejoin="bevel" stroke-width="1" font-family="Noto Sans" transform="matrix(11.8,0,0,11.8,0,0)" font-size="41.6667"/>
  <g stroke="#000000" font-weight="400" stroke-opacity="1" font-style="normal" stroke-linecap="square" fill="none" stroke-linejoin="bevel" stroke-width="1" font-family="Noto Sans" transform="matrix(11.8,0,0,11.8,0,0)" font-size="41.6667"/>
  <g stroke="none" font-weight="400" font-style="normal" fill-opacity="1" fill="#ffffff" font-family="Noto Sans" transform="matrix(11.8,0,0,11.8,0,0)" font-size="41.6667">
   <path d="M0,0 L50,0 L50,50 L0,50 L0,0" vector-effect="none" fill-rule="evenodd"/>
  </g>
  <g stroke="#000000" font-weight="400" stroke-opacity="1" font-style="normal" stroke-linecap="square" fill="none" stroke-linejoin="bevel" stroke-width="1" font-family="Noto Sans" transform="matrix(11.8,0,0,11.8,0,0)" font-size="41.6667"/>
  <g stroke="#000000" font-weight="400" stroke-opacity="1" font-style="normal" stroke-linecap="square" fill="none" stroke-linejoin="bevel" stroke-width="1" font-family="Noto Sans" transform="matrix(11.8,0,0,11.8,0,0)" font-size="41.6667"/>
  <g stroke="none" font-weight="400" font-style="normal" fill-opacity="0" fill="#000000" font-family="Noto Sans" transform="matrix(0.999067,0,0,0.999067,0,0)" font-size="41.6667">
   <rect width="591" height="591" y="0" x="0"/>
  </g>
  <g stroke="#000000" font-weight="400" stroke-opacity="1" font-style="normal" stroke-linecap="square" fill="none" stroke-linejoin="bevel" stroke-width="1" font-family="Noto Sans" transform="matrix(0.999067,0,0,0.999067,0,0)" font-size="41.6667"/>
  <g stroke="#000000" font-weight="400" stroke-opacity="1" font-style="normal" stroke-linecap="square" fill="none" stroke-linejoin="bevel" stroke-width="7.79528" font-family="Noto Sans" transform="matrix(0.999067,0,0,0.999067,0,0)" font-size="41.6667">
   <path d="M59.1,295.5 L295.5,59.1 L531.9,295.5 L295.5,531.9 L59.1,295.5" vector-effect="none" fill-rule="evenodd"/>
  </g>
  <g stroke="#000000" font-weight="400" stroke-opacity="1" font-style="normal" stroke-linecap="square" fill="none" stroke-linejoin="bevel" stroke-width="1" font-family="Noto Sans" transform="matrix(0.999067,0,0,0.999067,0,0)" font-size="41.6667"/>
  <g stroke="#ffffff" font-weight="400" stroke-opacity="1" font-style="normal" fill-opacity="1" stroke-linecap="square" fill="#000000" stroke-linejoin="bevel" stroke-width="4.72441" font-family="Noto Sans" transform="matrix(0.999067,0,0,0.999067,0,0)" font-size="41.6667">
   <path d="M319.122,531.9 C319.122,544.946 308.546,555.522 295.5,555.522 C282.454,555.522 271.878,544.946 271.878,531.9 C271.878,518.854 282.454,508.278 295.5,508.278 C308.546,508.278 319.122,518.854 319.122,531.9 " vector-effect="none" fill-rule="evenodd"/>
  </g>
  <g stroke="#232323" font-weight="400" stroke-opacity="1" font-style="normal" fill-opacity="1" stroke-linecap="square" fill="#ffffff" stroke-linejoin="bevel" stroke-width="1" font-family="Noto Sans" transform="matrix(0.999067,0,0,0.999067,0,0)" font-size="41.6667">
   <path d="M307.311,531.9 C307.311,538.423 302.023,543.711 295.5,543.711 C288.977,543.711 283.689,538.423 283.689,531.9 C283.689,525.377 288.977,520.089 295.5,520.089 C302.023,520.089 307.311,525.377 307.311,531.9 " vector-effect="non-scaling-stroke" fill-rule="evenodd"/>
  </g>
  <g stroke="#ffffff" font-weight="400" stroke-opacity="1" font-style="normal" fill-opacity="1" stroke-linecap="square" fill="#000000" stroke-linejoin="bevel" stroke-width="4.72441" font-family="Noto Sans" transform="matrix(0.999067,0,0,0.999067,0,0)" font-size="41.6667">
   <path d="M555.522,295.5 C555.522,308.546 544.946,319.122 531.9,319.122 C518.854,319.122 508.278,308.546 508.278,295.5 C508.278,282.454 518.854,271.878 531.9,271.878 C544.946,271.878 555.522,282.454 555.522,295.5 " vector-effect="none" fill-rule="evenodd"/>
  </g>
  <g stroke="#232323" font-weight="400" stroke-opacity="1" font-style="normal" fill-opacity="1" stroke-linecap="square" fill="#ffffff" stroke-linejoin="bevel" stroke-width="1" font-family="Noto Sans" transform="matrix(0.999067,0,0,0.999067,0,0)" font-size="41.6667">
   <path d="M543.711,295.5 C543.711,302.023 538.423,307.311 531.9,307.311 C525.377,307.311 520.089,302.023 520.089,295.5 C520.089,288.977 525.377,283.689 531.9,283.689 C538.423,283.689 543.711,288.977 543.711,295.5 " vector-effect="non-scaling-stroke" fill-rule="evenodd"/>
  </g>
  <g stroke="#000000" font-weight="400" stroke-opacity="1" font-style="normal" stroke-linecap="square" fill="none" stroke-linejoin="bevel" stroke-width="1" font-family="Noto Sans" transform="matrix(0.999067,0,0,0.999067,0,0)" font-size="41.6667"/>
  <g stroke="#000000" font-weight="400" stroke-opacity="1" font-style="normal" stroke-linecap="square" fill="none" stroke-linejoin="bevel" stroke-width="1" font-family="Noto Sans" transform="matrix(0.999067,0,0,0.999067,0,0)" font-size="41.6667"/>
  <g stroke="#000000" font-weight="400" stroke-opacity="1" font-style="normal" stroke-linecap="square" fill="none" stroke-linejoin="bevel" stroke-width="1" font-family="Noto Sans" transform="matrix(0.319701,2.44701e-16,-2.44701e-16,0.319701,295.224,505.078)" font-size="41.6667"/>
  <g stroke="none" font-weight="400" font-style="normal" fill-opacity="1" fill="#000000" font-family="Noto Sans" transform="matrix(0.999067,2.44701e-16,-2.44701e-16,0.999067,295.224,505.078)" font-size="41.6667">
   <path d="M14.9063,0 L11.2969,0 L11.2969,-20.9688 C11.2969,-22.1667 11.3125,-23.1302 11.3438,-23.8594 C11.375,-24.5885 11.4167,-25.3438 11.4688,-26.125 C11.0208,-25.6771 10.6068,-25.2995 10.2266,-24.9922 C9.84635,-24.6849 9.39063,-24.2917 8.85938,-23.8125 L5.67188,-21.2188 L3.73438,-23.6875 L11.8438,-30 L14.9063,-30 L14.9063,0" vector-effect="none" fill-rule="nonzero"/>
  </g>
  <g stroke="#000000" font-weight="400" stroke-opacity="1" font-style="normal" stroke-linecap="square" fill="none" stroke-linejoin="bevel" stroke-width="1" font-family="Noto Sans" transform="matrix(0.319701,2.44701e-16,-2.44701e-16,0.319701,295.224,505.078)" font-size="41.6667"/>
  <g stroke="#000000" font-weight="400" stroke-opacity="1" font-style="normal" stroke-linecap="square" fill="none" stroke-linejoin="bevel" stroke-width="1" font-family="Noto Sans" transform="matrix(0.999067,0,0,0.999067,0,0)" font-size="41.6667"/>
  <g stroke="#000000" font-weight="400" stroke-opacity="1" font-style="normal" stroke-linecap="square" fill="none" stroke-linejoin="bevel" stroke-width="1" font-family="Noto Sans" transform="matrix(0.319701,2.44701e-16,-2.44701e-16,0.319701,531.404,268.899)" font-size="41.6667"/>
  <g stroke="none" font-weight="400" font-style="normal" fill-opacity="1" fill="#000000" font-family="Noto Sans" transform="matrix(0.999067,2.44701e-16,-2.44701e-16,0.999067,531.404,268.899)" font-size="41.6667">
   <path d="M21.8438,0 L2.01563,0 L2.01563,-3.0625 L9.875,-11 C11.3542,-12.5208 12.6198,-13.8672 13.6719,-15.0391 C14.724,-16.2109 15.5156,-17.3568 16.0469,-18.4766 C16.5781,-19.5964 16.8438,-20.8438 16.8438,-22.2188 C16.8438,-23.875 16.3542,-25.1302 15.375,-25.9844 C14.3958,-26.8385 13.1198,-27.2656 11.5469,-27.2656 C10.0677,-27.2656 8.78125,-27.013 7.6875,-26.5078 C6.59375,-26.0026 5.47396,-25.3021 4.32813,-24.4063 L2.35938,-26.8906 C3.52604,-27.8698 4.875,-28.7005 6.40625,-29.3828 C7.9375,-30.0651 9.65104,-30.4063 11.5469,-30.4063 C14.349,-30.4063 16.5625,-29.6927 18.1875,-28.2656 C19.8125,-26.8385 20.625,-24.8958 20.625,-22.4375 C20.625,-20.8646 20.3021,-19.3932 19.6563,-18.0234 C19.0104,-16.6536 18.1146,-15.2969 16.9688,-13.9531 C15.8229,-12.6094 14.4792,-11.1927 12.9375,-9.70313 L6.67188,-3.53125 L6.67188,-3.35938 L21.8438,-3.35938 L21.8438,0" vector-effect="none" fill-rule="nonzero"/>
  </g>
  <g stroke="#000000" font-weight="400" stroke-opacity="1" font-style="normal" stroke-linecap="square" fill="none" stroke-linejoin="bevel" stroke-width="1" font-family="Noto Sans" transform="matrix(0.319701,2.44701e-16,-2.44701e-16,0.319701,531.404,268.899)" font-size="41.6667"/>
  <g stroke="#000000" font-weight="400" stroke-opacity="1" font-style="normal" stroke-linecap="square" fill="none" stroke-linejoin="bevel" stroke-width="1" font-family="Noto Sans" transform="matrix(0.999067,0,0,0.999067,0,0)" font-size="41.6667"/>
  <g stroke="#000000" font-weight="400" stroke-opacity="1" font-style="normal" stroke-linecap="square" fill="none" stroke-linejoin="bevel" stroke-width="1" font-family="Noto Sans" transform="matrix(11.8,0,0,11.8,0,0)" font-size="41.6667"/>
  <g stroke="#000000" font-weight="400" stroke-opacity="1" font-style="normal" stroke-linecap="square" fill="none" stroke-linejoin="bevel" stroke-width="1" font-family="Noto Sans" transform="matrix(11.8,0,0,11.8,0,0)" font-size="41.6667"/>
  <g stroke="#000000" font-weight="400" stroke-opacity="1" font-style="normal" stroke-linecap="square" fill="none" stroke-linejoin="bevel" stroke-width="1" font-family="Noto Sans" transform="matrix(11.8,0,0,11.8,0,0)" font-size="41.6667"/>
  <g stroke="#000000" font-weight="400" stroke-opacity="1" font-style="normal" stroke-linecap="square" fill="none" stroke-linejoin="bevel" stroke-width="1" font-family="Noto Sans" transform="matrix(1,0,0,1,0,0)" font-size="41.6667"/>
  <g stroke="#000000" font-weight="400" stroke-opacity="1" font-style="normal" stroke-linecap="square" fill="none" stroke-linejoin="bevel" stroke-width="1" font-family="Noto Sans" transform="matrix(11.8,0,0,11.8,0,0)" font-size="41.6667"/>
  <g stroke="#000000" font-weight="400" stroke-opacity="1" font-style="normal" stroke-linecap="square" fill="none" stroke-linejoin="bevel" stroke-width="1" font-family="Noto Sans" transform="matrix(11.8,0,0,11.8,0,0)" font-size="41.6667"/>
  <g stroke="#000000" font-weight="400" stroke-opacity="1" font-style="normal" stroke-linecap="square" fill="none" stroke-linejoin="bevel" stroke-width="1" font-family="Noto Sans" transform="matrix(1,0,0,1,0,0)" font-size="41.6667"/>
 </g>
 <metadata>
  <rdf:RDF xmlns:rdf="http://www.w3.org/1999/02/22-rdf-syntax-ns#" xmlns:rdfs="http://www.w3.org/2000/01/rdf-schema#" xmlns:dc="http://purl.org/dc/elements/1.1/">
   <rdf:Description dc:description="" dc:format="image/svg+xml" dc:identifier="" dc:title="" dc:date="2021-03-30T07:37:29">
    <dc:creator>
     <rdf:Bag>
      <rdf:li>Loïc Bartoletti</rdf:li>
     </rdf:Bag>
    </dc:creator>
    <dc:publisher>
     <rdf:Bag>
      <rdf:li>QGIS 3.18.1-Zürich</rdf:li>
     </rdf:Bag>
    </dc:publisher>
    <dc:subject>
     <rdf:Bag/>
    </dc:subject>
   </rdf:Description>
   <cc:Work rdf:about="">
    <dc:format>image/svg+xml</dc:format>
    <dc:title></dc:title>
    <dc:date>2021-03-30T07:37:29</dc:date>
    <dc:identifier></dc:identifier>
    <dc:description></dc:description>
    <dc:creator>
     <cc:Agent>
      <dc:title>Loïc Bartoletti</dc:title>
     </cc:Agent>
    </dc:creator>
    <dc:publisher>
     <cc:Agent>
      <dc:title>QGIS 3.18.1-Zürich</dc:title>
     </cc:Agent>
    </dc:publisher>
   </cc:Work>
  </rdf:RDF>
 </metadata>
</svg>
