code	source	pathname	dirname	basename	layername	internaltype	displaytype	geometrytype	description	attributes
10	/tmp/LandSurveyCodesImport_1uhzzpvm/demo_eau.gpkg|layername=regard	/tmp/LandSurveyCodesImport_1uhzzpvm/demo_eau.gpkg	/tmp/LandSurveyCodesImport_1uhzzpvm	demo_eau.gpkg	regard	CircleCenterRadius	Circle from center and radius	Polygon		[('dim', '_param')]
20	/tmp/LandSurveyCodesImport_1uhzzpvm/demo_eclairage.gpkg|layername=candelabre	/tmp/LandSurveyCodesImport_1uhzzpvm/demo_eclairage.gpkg	/tmp/LandSurveyCodesImport_1uhzzpvm	demo_eclairage.gpkg	candelabre	Point	Point	Point		[('style', '_att1'), ('nb_lum', '_att2')]
30	/tmp/LandSurveyCodesImport_1uhzzpvm/demo_voirie.gpkg|layername=demo_voirie	/tmp/LandSurveyCodesImport_1uhzzpvm/demo_voirie.gpkg	/tmp/LandSurveyCodesImport_1uhzzpvm	demo_voirie.gpkg	demo_voirie	Line	Line	Line		[('nom', '_att1'), ('long_troncon', ' $length ')]
40	/tmp/LandSurveyCodesImport_1uhzzpvm/demo_voirie.gpkg|layername=surface	/tmp/LandSurveyCodesImport_1uhzzpvm/demo_voirie.gpkg	/tmp/LandSurveyCodesImport_1uhzzpvm	demo_voirie.gpkg	surface	Line	Line	Polygon		[('type', '_att1'), ('surface', '$area')]
50	/tmp/LandSurveyCodesImport_1uhzzpvm/demo_voirie.gpkg|layername=surface	/tmp/LandSurveyCodesImport_1uhzzpvm/demo_voirie.gpkg	/tmp/LandSurveyCodesImport_1uhzzpvm	demo_voirie.gpkg	surface	Circle3Points	Circle from 3 points	Polygon		[('type', '_att1'), ('surface', '$area')]
	/tmp/LandSurveyCodesImport_1uhzzpvm/demo_topo.gpkg|layername=all	/tmp/LandSurveyCodesImport_1uhzzpvm/demo_topo.gpkg	/tmp/LandSurveyCodesImport_1uhzzpvm	demo_topo.gpkg	all	AllPoints	All points		Parameter for all points	True
	/tmp/LandSurveyCodesImport_1uhzzpvm/demo_topo.gpkg|layername=all	/tmp/LandSurveyCodesImport_1uhzzpvm/demo_topo.gpkg	/tmp/LandSurveyCodesImport_1uhzzpvm	demo_topo.gpkg	all	ErrorPoints	Error points		Parameter for error points	True
						CodeSeparator	Code separator		Parameter for code separator	+
						ParameterSeparator	Parameter separator		Parameter for parameter separator	-
