<?xml version="1.0" encoding="UTF-8"?>
<!DOCTYPE svg PUBLIC "-//W3C//DTD SVG 1.1//EN" "http://www.w3.org/Graphics/SVG/1.1/DTD/svg11.dtd">
<!-- Creator:Rod Holcombe, modified from CorelDRAW 2020 (64-Bit) -->
<svg xmlns="http://www.w3.org/2000/svg" xml:space="preserve" width="61.0584mm" height="61.0584mm" version="1.1" style="shape-rendering:geometricPrecision; text-rendering:geometricPrecision; image-rendering:optimizeQuality; fill-rule:evenodd; clip-rule:evenodd"
viewBox="0 0 10000 10000"
 xmlns:xlink="http://www.w3.org/1999/xlink"
 xmlns:xodm="http://www.corel.com/coreldraw/odm/2003">

 <g id="Square_x0020_frame">
  <rect fill="none" x="0" y="0" width="10000" height="10000"/>
  </g>
  <g id="symbol">
  <path fill="none"  stroke="black" stroke-width="70"  d="
  M5000 3950
  l0 2100
  m-1050 -1050
  l2100 0
  m-1050 -1050
  "/>
  <circle stroke="black" stroke-width="70" fill="none" cx="5000" cy="5000" r="1050" />
 </g>
</svg>
