<?xml version="1.0" encoding="UTF-8" standalone="no"?>
<!-- Created with Inkscape (http://www.inkscape.org/) -->

<svg
   width="20"
   height="20"
   viewBox="0 0 5.2916664 5.2916668"
   version="1.1"
   id="svg38609"
   inkscape:version="1.2 (1:1.2.1+202207142221+cd75a1ee6d)"
   sodipodi:docname="import_survey.svg"
   xmlns:inkscape="http://www.inkscape.org/namespaces/inkscape"
   xmlns:sodipodi="http://sodipodi.sourceforge.net/DTD/sodipodi-0.dtd"
   xmlns="http://www.w3.org/2000/svg"
   xmlns:svg="http://www.w3.org/2000/svg">
  <sodipodi:namedview
     id="namedview38611"
     pagecolor="#ffffff"
     bordercolor="#666666"
     borderopacity="1.0"
     inkscape:showpageshadow="false"
     inkscape:pageopacity="0.0"
     inkscape:pagecheckerboard="0"
     inkscape:deskcolor="#d1d1d1"
     inkscape:document-units="px"
     showgrid="false"
     inkscape:zoom="9.448059"
     inkscape:cx="17.410984"
     inkscape:cy="23.179364"
     inkscape:window-width="1920"
     inkscape:window-height="1171"
     inkscape:window-x="1920"
     inkscape:window-y="0"
     inkscape:window-maximized="1"
     inkscape:current-layer="layer1" />
  <defs
     id="defs38606" />
  <g
     inkscape:label="Calque 1"
     inkscape:groupmode="layer"
     id="layer1">
    <rect
       style="fill:#cccccc;fill-opacity:0.00284292;stroke:none;stroke-width:0.472478;stroke-linecap:round;stroke-linejoin:round;stroke-dasharray:none;stroke-opacity:1"
       id="rect1865-2-8-7-1"
       width="5.2916665"
       height="5.2916665"
       x="8.8817842e-16"
       y="0"
       inkscape:export-filename="../../../import_collar.png"
       inkscape:export-xdpi="192"
       inkscape:export-ydpi="192" />
    <g
       id="g47061"
       transform="matrix(0.94466901,0,0,0.94466901,-14.689838,-36.570982)">
      <path
         id="path2644-6-1"
         style="color:#000000;font-style:normal;font-variant:normal;font-weight:normal;font-stretch:normal;font-size:medium;line-height:normal;font-family:sans-serif;font-variant-ligatures:normal;font-variant-position:normal;font-variant-caps:normal;font-variant-numeric:normal;font-variant-alternates:normal;font-feature-settings:normal;text-indent:0;text-align:start;text-decoration:none;text-decoration-line:none;text-decoration-style:solid;text-decoration-color:#000000;letter-spacing:normal;word-spacing:normal;text-transform:none;writing-mode:lr-tb;direction:ltr;text-orientation:mixed;dominant-baseline:auto;baseline-shift:baseline;text-anchor:start;white-space:normal;shape-padding:0;clip-rule:nonzero;display:inline;overflow:visible;visibility:visible;isolation:auto;mix-blend-mode:normal;color-interpolation:sRGB;color-interpolation-filters:linearRGB;solid-color:#000000;solid-opacity:1;fill:#7de45f;fill-opacity:1;fill-rule:nonzero;stroke:none;stroke-width:0.0394173;stroke-linecap:butt;stroke-linejoin:miter;stroke-miterlimit:4;stroke-dasharray:none;stroke-dashoffset:0;stroke-opacity:1;color-rendering:auto;image-rendering:auto;shape-rendering:auto;text-rendering:auto;enable-background:accumulate"
         sodipodi:type="inkscape:offset"
         inkscape:radius="0.084229417"
         inkscape:original="M 5.7617188 31.191406 C 5.7617188 31.191406 5.7299408 31.968314 5.6679688 32.347656 L 5.7070312 32.353516 C 5.7700423 31.967824 5.8007812 31.191406 5.8007812 31.191406 L 5.7617188 31.191406 z "
         d="m 5.7617188,31.107422 a 0.08423784,0.08423784 0 0 0 -0.083984,0.08008 c 0,0 -0.03399,0.780681 -0.09375,1.146484 a 0.08423784,0.08423784 0 0 0 0.072266,0.09766 l 0.039063,0.0059 a 0.08423784,0.08423784 0 0 0 0.095703,-0.07031 c 0.065209,-0.399142 0.09375,-1.171876 0.09375,-1.171876 a 0.08423784,0.08423784 0 0 0 -0.083984,-0.08789 z"
         transform="translate(11.028105,10.469072)"
         inkscape:export-filename="../../../import_survey.png"
         inkscape:export-xdpi="192"
         inkscape:export-ydpi="192" />
      <path
         id="path2642-9-2"
         style="color:#000000;font-style:normal;font-variant:normal;font-weight:normal;font-stretch:normal;font-size:medium;line-height:normal;font-family:sans-serif;font-variant-ligatures:normal;font-variant-position:normal;font-variant-caps:normal;font-variant-numeric:normal;font-variant-alternates:normal;font-feature-settings:normal;text-indent:0;text-align:start;text-decoration:none;text-decoration-line:none;text-decoration-style:solid;text-decoration-color:#000000;letter-spacing:normal;word-spacing:normal;text-transform:none;writing-mode:lr-tb;direction:ltr;text-orientation:mixed;dominant-baseline:auto;baseline-shift:baseline;text-anchor:start;white-space:normal;shape-padding:0;clip-rule:nonzero;display:inline;overflow:visible;visibility:visible;isolation:auto;mix-blend-mode:normal;color-interpolation:sRGB;color-interpolation-filters:linearRGB;solid-color:#000000;solid-opacity:1;fill:#41b71f;fill-opacity:1;fill-rule:nonzero;stroke:none;stroke-width:0.0394173;stroke-linecap:butt;stroke-linejoin:miter;stroke-miterlimit:4;stroke-dasharray:none;stroke-dashoffset:0;stroke-opacity:1;color-rendering:auto;image-rendering:auto;shape-rendering:auto;text-rendering:auto;enable-background:accumulate"
         sodipodi:type="inkscape:offset"
         inkscape:radius="0.08375439"
         inkscape:original="M 5.6679688 32.347656 C 5.6111047 32.695727 5.5167573 33.03717 5.4121094 33.375 L 5.4492188 33.386719 C 5.5541164 33.048087 5.6497145 32.704358 5.7070312 32.353516 L 5.6679688 32.347656 z "
         d="m 5.6796875,32.265625 a 0.08376277,0.08376277 0 0 0 -0.09375,0.06836 c -0.055892,0.342124 -0.1497679,0.67944 -0.2539063,1.015625 a 0.08376277,0.08376277 0 0 0 0.054688,0.105469 l 0.037109,0.01172 a 0.08376277,0.08376277 0 0 0 0.1054688,-0.05469 C 5.6346788,33.071914 5.73076,32.724064 5.7890625,32.367188 a 0.08376277,0.08376277 0 0 0 -0.070312,-0.0957 z"
         transform="translate(11.028105,10.469072)" />
      <path
         id="path2692-4-0"
         style="color:#000000;font-style:normal;font-variant:normal;font-weight:normal;font-stretch:normal;font-size:medium;line-height:normal;font-family:sans-serif;font-variant-ligatures:normal;font-variant-position:normal;font-variant-caps:normal;font-variant-numeric:normal;font-variant-alternates:normal;font-feature-settings:normal;text-indent:0;text-align:start;text-decoration:none;text-decoration-line:none;text-decoration-style:solid;text-decoration-color:#000000;letter-spacing:normal;word-spacing:normal;text-transform:none;writing-mode:lr-tb;direction:ltr;text-orientation:mixed;dominant-baseline:auto;baseline-shift:baseline;text-anchor:start;white-space:normal;shape-padding:0;clip-rule:nonzero;display:inline;overflow:visible;visibility:visible;isolation:auto;mix-blend-mode:normal;color-interpolation:sRGB;color-interpolation-filters:linearRGB;solid-color:#000000;solid-opacity:1;fill:#7de45f;fill-opacity:1;fill-rule:nonzero;stroke:none;stroke-width:0.0394173;stroke-linecap:butt;stroke-linejoin:miter;stroke-miterlimit:4;stroke-dasharray:none;stroke-dashoffset:0;stroke-opacity:1;color-rendering:auto;image-rendering:auto;shape-rendering:auto;text-rendering:auto;enable-background:accumulate"
         sodipodi:type="inkscape:offset"
         inkscape:radius="0.085751079"
         inkscape:original="M 6.6132812 31.185547 C 6.6132812 31.185547 6.5937339 31.742267 6.5605469 32.015625 L 6.5996094 32.019531 C 6.6333424 31.741683 6.6523437 31.1875 6.6523438 31.1875 L 6.6132812 31.185547 z "
         d="m 6.6171875,31.099609 a 0.08575965,0.08575965 0 0 0 -0.089844,0.08203 c 0,0 -0.020741,0.560689 -0.052734,0.824218 a 0.08575965,0.08575965 0 0 0 0.078125,0.0957 l 0.039063,0.0039 a 0.08575965,0.08575965 0 0 0 0.09375,-0.07617 c 0.034913,-0.287566 0.052734,-0.837891 0.052734,-0.837891 A 0.08575965,0.08575965 0 0 0 6.65625,31.101562 Z"
         transform="translate(11.028105,10.369564)" />
      <path
         id="path2690-7-7"
         style="color:#000000;font-style:normal;font-variant:normal;font-weight:normal;font-stretch:normal;font-size:medium;line-height:normal;font-family:sans-serif;font-variant-ligatures:normal;font-variant-position:normal;font-variant-caps:normal;font-variant-numeric:normal;font-variant-alternates:normal;font-feature-settings:normal;text-indent:0;text-align:start;text-decoration:none;text-decoration-line:none;text-decoration-style:solid;text-decoration-color:#000000;letter-spacing:normal;word-spacing:normal;text-transform:none;writing-mode:lr-tb;direction:ltr;text-orientation:mixed;dominant-baseline:auto;baseline-shift:baseline;text-anchor:start;white-space:normal;shape-padding:0;clip-rule:nonzero;display:inline;overflow:visible;visibility:visible;isolation:auto;mix-blend-mode:normal;color-interpolation:sRGB;color-interpolation-filters:linearRGB;solid-color:#000000;solid-opacity:1;fill:#41b71f;fill-opacity:1;fill-rule:nonzero;stroke:none;stroke-width:0.0394173;stroke-linecap:butt;stroke-linejoin:miter;stroke-miterlimit:4;stroke-dasharray:none;stroke-dashoffset:0;stroke-opacity:1;color-rendering:auto;image-rendering:auto;shape-rendering:auto;text-rendering:auto;enable-background:accumulate"
         sodipodi:type="inkscape:offset"
         inkscape:radius="0.096850194"
         inkscape:original="M 6.5605469 32.015625 C 6.5172859 32.371972 6.4526718 32.727032 6.3691406 33.076172 L 6.40625 33.083984 C 6.490124 32.733412 6.5561637 32.377399 6.5996094 32.019531 L 6.5605469 32.015625 z "
         d="m 6.5703125,31.919922 a 0.09685988,0.09685988 0 0 0 -0.1054687,0.08398 c -0.042798,0.352535 -0.1067496,0.703147 -0.1894532,1.048828 a 0.09685988,0.09685988 0 0 0 0.074219,0.119141 l 0.037109,0.0078 A 0.09685988,0.09685988 0 0 0 6.5,33.107422 c 0.08465,-0.353814 0.1513778,-0.714276 0.1953125,-1.076172 A 0.09685988,0.09685988 0 0 0 6.609375,31.923828 Z"
         transform="translate(11.028105,10.369564)" />
      <path
         id="path2688-7-3"
         style="color:#000000;font-style:normal;font-variant:normal;font-weight:normal;font-stretch:normal;font-size:medium;line-height:normal;font-family:sans-serif;font-variant-ligatures:normal;font-variant-position:normal;font-variant-caps:normal;font-variant-numeric:normal;font-variant-alternates:normal;font-feature-settings:normal;text-indent:0;text-align:start;text-decoration:none;text-decoration-line:none;text-decoration-style:solid;text-decoration-color:#000000;letter-spacing:normal;word-spacing:normal;text-transform:none;writing-mode:lr-tb;direction:ltr;text-orientation:mixed;dominant-baseline:auto;baseline-shift:baseline;text-anchor:start;white-space:normal;shape-padding:0;clip-rule:nonzero;display:inline;overflow:visible;visibility:visible;isolation:auto;mix-blend-mode:normal;color-interpolation:sRGB;color-interpolation-filters:linearRGB;solid-color:#000000;solid-opacity:1;fill:#246410;fill-opacity:1;fill-rule:nonzero;stroke:none;stroke-width:0.0394173;stroke-linecap:butt;stroke-linejoin:miter;stroke-miterlimit:4;stroke-dasharray:none;stroke-dashoffset:0;stroke-opacity:1;color-rendering:auto;image-rendering:auto;shape-rendering:auto;text-rendering:auto;enable-background:accumulate"
         sodipodi:type="inkscape:offset"
         inkscape:radius="0.10485307"
         inkscape:original="M 6.3691406 33.076172 C 6.3320156 33.231354 6.2806882 33.382445 6.2304688 33.535156 L 6.2675781 33.548828 C 6.3177651 33.396216 6.3685906 33.241389 6.40625 33.083984 L 6.3691406 33.076172 z "
         d="m 6.390625,32.972656 a 0.10486356,0.10486356 0 0 0 -0.1230469,0.08008 c -0.03562,0.148892 -0.086288,0.295864 -0.1367187,0.449219 a 0.10486356,0.10486356 0 0 0 0.0625,0.130859 l 0.037109,0.01367 a 0.10486356,0.10486356 0 0 0 0.1367187,-0.06445 c 0.050199,-0.152647 0.1016185,-0.311574 0.140625,-0.474609 a 0.10486356,0.10486356 0 0 0 -0.080078,-0.126953 z"
         transform="translate(11.028105,10.369564)" />
      <path
         id="path2666-0-1"
         style="color:#000000;font-style:normal;font-variant:normal;font-weight:normal;font-stretch:normal;font-size:medium;line-height:normal;font-family:sans-serif;font-variant-ligatures:normal;font-variant-position:normal;font-variant-caps:normal;font-variant-numeric:normal;font-variant-alternates:normal;font-feature-settings:normal;text-indent:0;text-align:start;text-decoration:none;text-decoration-line:none;text-decoration-style:solid;text-decoration-color:#000000;letter-spacing:normal;word-spacing:normal;text-transform:none;writing-mode:lr-tb;direction:ltr;text-orientation:mixed;dominant-baseline:auto;baseline-shift:baseline;text-anchor:start;white-space:normal;shape-padding:0;clip-rule:nonzero;display:inline;overflow:visible;visibility:visible;isolation:auto;mix-blend-mode:normal;color-interpolation:sRGB;color-interpolation-filters:linearRGB;solid-color:#000000;solid-opacity:1;fill:#3837d7;fill-opacity:1;fill-rule:nonzero;stroke:none;stroke-width:0.0394173;stroke-linecap:butt;stroke-linejoin:miter;stroke-miterlimit:4;stroke-dasharray:none;stroke-dashoffset:0;stroke-opacity:1;color-rendering:auto;image-rendering:auto;shape-rendering:auto;text-rendering:auto;enable-background:accumulate"
         sodipodi:type="inkscape:offset"
         inkscape:radius="0.096927717"
         inkscape:original="M 7.2070312 31.150391 C 7.2070312 31.150391 7.1577916 31.529244 7.1347656 31.71875 L 7.1738281 31.722656 C 7.1967911 31.533644 7.2460937 31.15625 7.2460938 31.15625 L 7.2070312 31.150391 z "
         d="m 7.2207031,31.054688 a 0.09693741,0.09693741 0 0 0 -0.109375,0.08398 c 0,0 -0.04911,0.377784 -0.072266,0.568359 A 0.09693741,0.09693741 0 0 0 7.125,31.814453 l 0.039063,0.0039 a 0.09693741,0.09693741 0 0 0 0.1054687,-0.08398 c 0.022823,-0.187857 0.072266,-0.566406 0.072266,-0.566406 a 0.09693741,0.09693741 0 0 0 -0.082031,-0.107422 z"
         transform="translate(11.028105,10.369286)" />
      <path
         id="path2664-2-1"
         style="color:#000000;font-style:normal;font-variant:normal;font-weight:normal;font-stretch:normal;font-size:medium;line-height:normal;font-family:sans-serif;font-variant-ligatures:normal;font-variant-position:normal;font-variant-caps:normal;font-variant-numeric:normal;font-variant-alternates:normal;font-feature-settings:normal;text-indent:0;text-align:start;text-decoration:none;text-decoration-line:none;text-decoration-style:solid;text-decoration-color:#000000;letter-spacing:normal;word-spacing:normal;text-transform:none;writing-mode:lr-tb;direction:ltr;text-orientation:mixed;dominant-baseline:auto;baseline-shift:baseline;text-anchor:start;white-space:normal;shape-padding:0;clip-rule:nonzero;display:inline;overflow:visible;visibility:visible;isolation:auto;mix-blend-mode:normal;color-interpolation:sRGB;color-interpolation-filters:linearRGB;solid-color:#000000;solid-opacity:1;fill:#479ed2;fill-opacity:1;fill-rule:nonzero;stroke:none;stroke-width:0.0394173;stroke-linecap:butt;stroke-linejoin:miter;stroke-miterlimit:4;stroke-dasharray:none;stroke-dashoffset:0;stroke-opacity:1;color-rendering:auto;image-rendering:auto;shape-rendering:auto;text-rendering:auto;enable-background:accumulate"
         sodipodi:type="inkscape:offset"
         inkscape:radius="0.099703394"
         inkscape:original="M 7.1347656 31.71875 C 7.0976586 32.024155 7.0601345 32.328348 7.0292969 32.634766 L 7.0683594 32.638672 C 7.0991354 32.332836 7.1367156 32.028105 7.1738281 31.722656 L 7.1347656 31.71875 z "
         d="m 7.1445312,31.619141 a 0.09971336,0.09971336 0 0 0 -0.109375,0.08789 C 6.9980638,32.012316 6.9606737,32.317105 6.9296875,32.625 a 0.09971336,0.09971336 0 0 0 0.089844,0.109375 l 0.039063,0.0039 a 0.09971336,0.09971336 0 0 0 0.109375,-0.08984 c 0.030627,-0.304356 0.068342,-0.608496 0.1054687,-0.914063 a 0.09971336,0.09971336 0 0 0 -0.089844,-0.111328 z"
         transform="translate(11.028105,10.369286)" />
      <path
         id="path2662-1-90"
         style="color:#000000;font-style:normal;font-variant:normal;font-weight:normal;font-stretch:normal;font-size:medium;line-height:normal;font-family:sans-serif;font-variant-ligatures:normal;font-variant-position:normal;font-variant-caps:normal;font-variant-numeric:normal;font-variant-alternates:normal;font-feature-settings:normal;text-indent:0;text-align:start;text-decoration:none;text-decoration-line:none;text-decoration-style:solid;text-decoration-color:#000000;letter-spacing:normal;word-spacing:normal;text-transform:none;writing-mode:lr-tb;direction:ltr;text-orientation:mixed;dominant-baseline:auto;baseline-shift:baseline;text-anchor:start;white-space:normal;shape-padding:0;clip-rule:nonzero;display:inline;overflow:visible;visibility:visible;isolation:auto;mix-blend-mode:normal;color-interpolation:sRGB;color-interpolation-filters:linearRGB;solid-color:#000000;solid-opacity:1;fill:#7de45f;fill-opacity:1;fill-rule:nonzero;stroke:none;stroke-width:0.0394173;stroke-linecap:butt;stroke-linejoin:miter;stroke-miterlimit:4;stroke-dasharray:none;stroke-dashoffset:0;stroke-opacity:1;color-rendering:auto;image-rendering:auto;shape-rendering:auto;text-rendering:auto;enable-background:accumulate"
         sodipodi:type="inkscape:offset"
         inkscape:radius="0.10762136"
         inkscape:original="M 7.0292969 32.634766 C 7.0164179 32.762767 7.0049476 32.939838 6.9941406 33.091797 C 6.9887306 33.167777 6.9835996 33.238658 6.9785156 33.292969 C 6.9734356 33.347279 6.9657916 33.387776 6.9628906 33.396484 L 7.0019531 33.408203 C 7.0089431 33.387233 7.0124381 33.349856 7.0175781 33.294922 C 7.0227181 33.239982 7.0277951 33.171769 7.0332031 33.095703 C 7.0440241 32.943571 7.0556054 32.76541 7.0683594 32.638672 L 7.0292969 32.634766 z "
         d="m 7.0390625,32.527344 a 0.10763212,0.10763212 0 0 0 -0.1171875,0.0957 c -0.013231,0.131505 -0.024387,0.309504 -0.035156,0.460937 -0.0054,0.0759 -0.010725,0.146869 -0.015625,0.199219 -0.0023,0.02464 -0.00531,0.04503 -0.00781,0.06055 -0.00251,0.01551 -0.00736,0.03575 -0.00195,0.01953 A 0.10763212,0.10763212 0 0 0 6.9316406,33.5 l 0.039063,0.01172 a 0.10763212,0.10763212 0 0 0 0.1328125,-0.07031 c 0.015719,-0.04716 0.016345,-0.08179 0.021484,-0.136718 0.0053,-0.05662 0.010202,-0.124894 0.015625,-0.201172 0.010857,-0.152643 0.022758,-0.329927 0.035156,-0.453125 A 0.10763212,0.10763212 0 0 0 7.078125,32.53125 Z"
         transform="translate(11.028105,10.369286)" />
      <g
         id="g2816-1-5"
         transform="matrix(0.01542681,0,0,0.02690601,22.861614,46.973102)">
        <path
           inkscape:connector-curvature="0"
           id="path2758-5-6-6"
           d="m -464.28503,-194.93759 h 245.14527"
           style="fill:none;stroke:#000000;stroke-width:0.265;stroke-linecap:butt;stroke-linejoin:miter;stroke-miterlimit:4;stroke-dasharray:0.265, 1.06;stroke-dashoffset:0;stroke-opacity:1" />
        <path
           inkscape:connector-curvature="0"
           id="path2758-2-93-77"
           d="m -464.28503,-173.00627 h 245.14527"
           style="fill:none;stroke:#000000;stroke-width:0.265;stroke-linecap:butt;stroke-linejoin:miter;stroke-miterlimit:4;stroke-dasharray:0.265, 1.06;stroke-dashoffset:0;stroke-opacity:1" />
        <path
           inkscape:connector-curvature="0"
           id="path2758-5-9-3-4"
           d="m -464.28503,-151.07496 h 245.14527"
           style="fill:none;stroke:#000000;stroke-width:0.265;stroke-linecap:butt;stroke-linejoin:miter;stroke-miterlimit:4;stroke-dasharray:0.265, 1.06;stroke-dashoffset:0;stroke-opacity:1" />
        <path
           inkscape:connector-curvature="0"
           id="path2758-0-8-0"
           d="m -464.28503,-129.14364 h 245.14527"
           style="fill:none;stroke:#000000;stroke-width:0.265;stroke-linecap:butt;stroke-linejoin:miter;stroke-miterlimit:4;stroke-dasharray:0.265, 1.06;stroke-dashoffset:0;stroke-opacity:1" />
      </g>
      <path
         style="fill:none;stroke:#424242;stroke-width:0.107;stroke-linecap:butt;stroke-linejoin:miter;stroke-dasharray:none;stroke-opacity:1"
         d="m 15.662552,41.529731 c 0.881637,0.02272 1.434116,0.101882 2.472387,-0.07532 0.05242,-0.0089 0.01684,0.04551 0.08476,0.02326 0.06188,-0.02027 0.0654,-0.04947 0.139571,-0.07469 0.05085,-0.01729 0.08063,-0.03359 0.136927,-0.02665 0.02171,0.0027 0.04599,-0.0108 0.06124,-0.01241 0.02437,-0.0025 0.05222,0.0075 0.07999,0.0071 0.04561,-6.49e-4 0.09235,-0.01159 0.133119,-0.02098 0.399103,-0.092 0.725687,-0.05436 0.787859,-0.06294"
         id="path2629-6-6"
         inkscape:connector-curvature="0"
         sodipodi:nodetypes="csssssssc" />
    </g>
    <g
       id="g36270-33-5"
       transform="matrix(1.8942038,0,0,1.8942038,-27.525222,-114.70391)">
      <g
         id="g6498-3-3-7-4"
         transform="translate(8.7797198,54.74511)">
        <rect
           style="opacity:1;fill:#808080;fill-opacity:1;stroke:none;stroke-width:0.624999;stroke-linecap:round;stroke-linejoin:round;stroke-dasharray:none;stroke-opacity:1"
           id="rect6268-9-2-3-9"
           width="1.1437849"
           height="1.4697897"
           x="7.3539276"
           y="5.8664718"
           rx="0.2"
           ry="0.2" />
        <rect
           style="opacity:0.902339;fill:#ffffff;fill-opacity:1;stroke:none;stroke-width:0.515508;stroke-linecap:round;stroke-linejoin:round;stroke-dasharray:none;stroke-opacity:1"
           id="rect6268-4-19-1-2-2"
           width="0.9163546"
           height="1.2480963"
           x="7.4676428"
           y="5.9773188"
           rx="0.14"
           ry="0.14" />
      </g>
      <rect
         style="fill:#707070;fill-opacity:1;stroke:none;stroke-width:0.428437;stroke-linecap:round;stroke-linejoin:round;stroke-dasharray:none;stroke-opacity:1"
         id="rect7278-6-5-6-5"
         width="0.23837352"
         height="0.11918676"
         x="16.307632"
         y="60.844265" />
      <rect
         style="fill:#707070;fill-opacity:1;stroke:none;stroke-width:0.428437;stroke-linecap:round;stroke-linejoin:round;stroke-dasharray:none;stroke-opacity:1"
         id="rect7278-7-9-9-5-7"
         width="0.23837352"
         height="0.11918676"
         x="16.586351"
         y="60.844265" />
      <rect
         style="fill:#707070;fill-opacity:1;stroke:none;stroke-width:0.428437;stroke-linecap:round;stroke-linejoin:round;stroke-dasharray:none;stroke-opacity:1"
         id="rect7278-8-33-9-26-4"
         width="0.23837352"
         height="0.11918676"
         x="16.865072"
         y="60.844265" />
      <rect
         style="fill:#707070;fill-opacity:1;stroke:none;stroke-width:0.428437;stroke-linecap:round;stroke-linejoin:round;stroke-dasharray:none;stroke-opacity:1"
         id="rect7278-5-80-1-5-9"
         width="0.23837352"
         height="0.11918676"
         x="16.307632"
         y="61.021309" />
      <rect
         style="fill:#707070;fill-opacity:1;stroke:none;stroke-width:0.428437;stroke-linecap:round;stroke-linejoin:round;stroke-dasharray:none;stroke-opacity:1"
         id="rect7278-7-0-56-4-8-9"
         width="0.23837352"
         height="0.11918676"
         x="16.586351"
         y="61.021309" />
      <rect
         style="fill:#707070;fill-opacity:1;stroke:none;stroke-width:0.428437;stroke-linecap:round;stroke-linejoin:round;stroke-dasharray:none;stroke-opacity:1"
         id="rect7278-8-3-6-9-7-4"
         width="0.23837352"
         height="0.11918676"
         x="16.865072"
         y="61.021309" />
      <rect
         style="fill:#707070;fill-opacity:1;stroke:none;stroke-width:0.428437;stroke-linecap:round;stroke-linejoin:round;stroke-dasharray:none;stroke-opacity:1"
         id="rect7278-1-40-1-9-5"
         width="0.23837352"
         height="0.11918676"
         x="16.307632"
         y="61.198357" />
      <rect
         style="fill:#707070;fill-opacity:1;stroke:none;stroke-width:0.428437;stroke-linecap:round;stroke-linejoin:round;stroke-dasharray:none;stroke-opacity:1"
         id="rect7278-7-06-0-0-6-9"
         width="0.23837352"
         height="0.11918676"
         x="16.586351"
         y="61.198357" />
      <rect
         style="fill:#707070;fill-opacity:1;stroke:none;stroke-width:0.428437;stroke-linecap:round;stroke-linejoin:round;stroke-dasharray:none;stroke-opacity:1"
         id="rect7278-8-32-4-7-0-3"
         width="0.23837352"
         height="0.11918676"
         x="16.865072"
         y="61.198357" />
      <rect
         style="fill:#707070;fill-opacity:1;stroke:none;stroke-width:0.428437;stroke-linecap:round;stroke-linejoin:round;stroke-dasharray:none;stroke-opacity:1"
         id="rect7278-5-6-6-5-4-5"
         width="0.23837352"
         height="0.11918676"
         x="16.307632"
         y="61.375404" />
      <rect
         style="fill:#707070;fill-opacity:1;stroke:none;stroke-width:0.428437;stroke-linecap:round;stroke-linejoin:round;stroke-dasharray:none;stroke-opacity:1"
         id="rect7278-7-0-1-2-8-1-7"
         width="0.23837352"
         height="0.11918676"
         x="16.586351"
         y="61.375404" />
      <rect
         style="fill:#707070;fill-opacity:1;stroke:none;stroke-width:0.428437;stroke-linecap:round;stroke-linejoin:round;stroke-dasharray:none;stroke-opacity:1"
         id="rect7278-8-3-5-6-7-0-0"
         width="0.23837352"
         height="0.11918676"
         x="16.865072"
         y="61.375404" />
      <rect
         style="fill:#707070;fill-opacity:1;stroke:none;stroke-width:0.428437;stroke-linecap:round;stroke-linejoin:round;stroke-dasharray:none;stroke-opacity:1"
         id="rect7278-4-7-0-4-8"
         width="0.23837352"
         height="0.11918676"
         x="16.307632"
         y="61.552452" />
      <rect
         style="fill:#707070;fill-opacity:1;stroke:none;stroke-width:0.428437;stroke-linecap:round;stroke-linejoin:round;stroke-dasharray:none;stroke-opacity:1"
         id="rect7278-7-7-5-4-87-1"
         width="0.23837352"
         height="0.11918676"
         x="16.586351"
         y="61.552452" />
      <rect
         style="fill:#707070;fill-opacity:1;stroke:none;stroke-width:0.428437;stroke-linecap:round;stroke-linejoin:round;stroke-dasharray:none;stroke-opacity:1"
         id="rect7278-8-6-69-8-0-9"
         width="0.23837352"
         height="0.11918676"
         x="16.865072"
         y="61.552452" />
      <rect
         style="fill:#707070;fill-opacity:1;stroke:none;stroke-width:0.428437;stroke-linecap:round;stroke-linejoin:round;stroke-dasharray:none;stroke-opacity:1"
         id="rect7278-5-69-8-0-8-9"
         width="0.23837352"
         height="0.11918676"
         x="16.307632"
         y="61.7295" />
      <rect
         style="fill:#707070;fill-opacity:1;stroke:none;stroke-width:0.428437;stroke-linecap:round;stroke-linejoin:round;stroke-dasharray:none;stroke-opacity:1"
         id="rect7278-7-0-3-7-4-6-7"
         width="0.23837352"
         height="0.11918676"
         x="16.586351"
         y="61.7295" />
      <rect
         style="fill:#707070;fill-opacity:1;stroke:none;stroke-width:0.428437;stroke-linecap:round;stroke-linejoin:round;stroke-dasharray:none;stroke-opacity:1"
         id="rect7278-8-3-7-2-2-2-8"
         width="0.23837352"
         height="0.11918676"
         x="16.865072"
         y="61.7295" />
    </g>
    <g
       id="g36748-4-2"
       transform="translate(-11.85718,-60.548634)">
      <path
         id="path9759-4-6-7-5"
         style="color:#000000;fill:#808080;fill-opacity:1;stroke-width:0.776933;stroke-linecap:round;stroke-linejoin:round"
         d="m 13.648135,62.64788 0.614683,-0.637969 H 13.916733 V 61.49614 c 0,-0.141799 0.10552,-0.245713 0.247318,-0.245713 h 0.475145 v -0.595011 h -0.475145 c -0.460788,0 -0.840723,0.379935 -0.840723,0.840724 v 0.513771 h -0.289876 z"
         sodipodi:nodetypes="cccssccssccc" />
      <path
         id="path9759-4-7-1-9-3"
         style="color:#000000;fill:#4d4d4d;fill-opacity:1;stroke-width:0.776933;stroke-linecap:round;stroke-linejoin:round"
         d="m 13.648135,62.64788 c -0.214198,-0.92868 -0.231872,-1.867578 0.991061,-1.778614 v -0.213849 h -0.475145 c -0.460788,0 -0.840722,0.379934 -0.840722,0.840723 v 0.513771 h -0.289876 z"
         sodipodi:nodetypes="cccssccc" />
    </g>
  </g>
</svg>
