<?xml version="1.0" encoding="UTF-8" standalone="no"?>
<!-- Created with Inkscape (http://www.inkscape.org/) -->

<svg
   width="20"
   height="20"
   viewBox="0 0 5.2916664 5.2916668"
   version="1.1"
   id="svg38609"
   inkscape:version="1.2.2 (b0a8486541, 2022-12-01)"
   sodipodi:docname="define_collar.svg"
   xmlns:inkscape="http://www.inkscape.org/namespaces/inkscape"
   xmlns:sodipodi="http://sodipodi.sourceforge.net/DTD/sodipodi-0.dtd"
   xmlns="http://www.w3.org/2000/svg"
   xmlns:svg="http://www.w3.org/2000/svg">
  <sodipodi:namedview
     id="namedview38611"
     pagecolor="#ffffff"
     bordercolor="#666666"
     borderopacity="1.0"
     inkscape:showpageshadow="false"
     inkscape:pageopacity="0.0"
     inkscape:pagecheckerboard="0"
     inkscape:deskcolor="#d1d1d1"
     inkscape:document-units="px"
     showgrid="false"
     inkscape:zoom="9.448059"
     inkscape:cx="5.450855"
     inkscape:cy="23.232285"
     inkscape:window-width="1920"
     inkscape:window-height="1172"
     inkscape:window-x="1920"
     inkscape:window-y="0"
     inkscape:window-maximized="1"
     inkscape:current-layer="layer1" />
  <defs
     id="defs38606" />
  <g
     inkscape:label="Calque 1"
     inkscape:groupmode="layer"
     id="layer1">
    <rect
       style="fill:#cccccc;fill-opacity:0;stroke:none;stroke-width:0.472478;stroke-linecap:round;stroke-linejoin:round;stroke-dasharray:none;stroke-opacity:1"
       id="rect1865-0-6"
       width="5.2916665"
       height="5.2916665"
       x="-4.4408921e-16"
       y="-4.4408921e-16"
       inkscape:export-filename="../../../define_survey.png"
       inkscape:export-xdpi="192"
       inkscape:export-ydpi="192" />
    <g
       id="g1869-1-6"
       transform="matrix(0.87200118,0,0,0.87200118,-5.0746359,-5.7628354)">
      <path
         sodipodi:type="star"
         style="fill:#ea4600;fill-opacity:1;stroke:#962d00;stroke-width:1.1;stroke-linecap:round;stroke-linejoin:round;stroke-dasharray:none;stroke-opacity:1"
         id="path283-311-0"
         inkscape:flatsided="true"
         sodipodi:sides="3"
         sodipodi:cx="25.23571"
         sodipodi:cy="39.340584"
         sodipodi:r1="6.1420393"
         sodipodi:r2="3.0710196"
         sodipodi:arg1="1.5707963"
         sodipodi:arg2="2.6179939"
         inkscape:rounded="1"
         inkscape:randomized="0"
         d="m 25.23571,45.482623 c -10.638324,0 -10.638324,0 -5.319162,-9.213059 5.319162,-9.213059 5.319162,-9.213059 10.638324,0 5.319162,9.213059 5.319162,9.213059 -5.319162,9.213059 z"
         inkscape:transform-center-y="-0.32771366"
         transform="matrix(0.17073827,0,0,0.17073827,3.3092454,2.0179358)" />
      <path
         id="path283-3-0-2"
         style="fill:#d23f00;stroke-width:0.187812;stroke-linecap:round;stroke-linejoin:round"
         inkscape:transform-center-y="-0.32770535"
         d="m 7.6347255,7.1220775 c -0.033374,-0.00511 -0.064639,0.00157 -0.1140446,0.037015 C 7.471275,7.1944834 7.4098321,7.2593449 7.3399384,7.3535067 7.2001443,7.5418409 7.0249017,7.84472 6.7877066,8.2555518 6.5606612,8.6488061 6.3909813,8.9435212 6.2951665,9.1569302 c -0.047913,0.1067097 -0.07703,0.1927678 -0.087364,0.256774 -0.010347,0.06401 -0.00301,0.1013919 0.012312,0.1280596 0.015403,0.026654 0.044088,0.051659 0.1047057,0.074698 0.060618,0.023039 0.1500656,0.041167 0.2664443,0.053021 0.1838493,0.01873 0.4899807,0.018075 0.8110071,0.019005 C 7.3180253,9.5837299 7.2525784,9.468547 7.2245315,9.337674 7.1803387,9.1314689 7.19734,8.9030509 7.2488677,8.6633908 7.3474697,8.2048113 7.5745845,7.703066 7.7890951,7.2394608 7.7284381,7.179236 7.669785,7.1274987 7.6346967,7.1220761 Z"
         inkscape:transform-center-x="7.6439112e-06" />
    </g>
    <path
       id="path9759-4"
       style="color:#000000;fill:#9c9c9c;fill-opacity:1;stroke-width:0.776933;stroke-linecap:round;stroke-linejoin:round"
       d="m 2.9142642,4.1599274 -0.637969,-0.614683 v 0.346085 h -0.513771 c -0.141799,0 -0.245713,-0.10552 -0.245713,-0.247318 V 3.1688664 H 0.92180116 v 0.475145 c 0,0.460788 0.37993404,0.840723 0.84072304,0.840723 h 0.513771 v 0.289876 z"
       sodipodi:nodetypes="cccssccssccc" />
    <path
       id="path9759-4-7"
       style="color:#000000;fill:#7d7d7d;fill-opacity:1;stroke-width:0.776933;stroke-linecap:round;stroke-linejoin:round"
       d="m 2.9142642,4.1599274 c -0.92868,0.214198 -1.867578,0.231872 -1.778614,-0.991061 H 0.92180116 v 0.475145 c 0,0.460788 0.37993404,0.840723 0.84072304,0.840723 h 0.513771 v 0.289876 z"
       sodipodi:nodetypes="cccssccc" />
    <rect
       style="fill:#d5e8f2;fill-opacity:1;stroke:#2f6f8f;stroke-width:0.232895;stroke-linecap:round;stroke-linejoin:round;stroke-dasharray:none;stroke-opacity:1"
       id="rect10748-0-8"
       width="1.8491607"
       height="1.8491607"
       x="3.2203331"
       y="3.2390671"
       rx="0.22170465"
       ry="0.22170465" />
    <path
       style="fill:none;stroke:#2f6f8f;stroke-width:0.165;stroke-linecap:butt;stroke-linejoin:miter;stroke-dasharray:none;stroke-opacity:1"
       d="m 3.2732772,3.7054444 h 1.723853"
       id="path2236" />
    <path
       style="fill:none;stroke:#2f6f8f;stroke-width:0.165;stroke-linecap:butt;stroke-linejoin:miter;stroke-dasharray:none;stroke-opacity:1"
       d="m 3.7282842,3.3075494 v 1.723853"
       id="path2236-5" />
    <path
       style="fill:none;stroke:#2f6f8f;stroke-width:0.165;stroke-linecap:butt;stroke-linejoin:miter;stroke-dasharray:none;stroke-opacity:1"
       d="m 3.2558452,4.1636474 h 1.758717"
       id="path2238" />
    <path
       style="fill:none;stroke:#2f6f8f;stroke-width:0.165;stroke-linecap:butt;stroke-linejoin:miter;stroke-dasharray:none;stroke-opacity:1"
       d="m 3.2558452,4.6218494 h 1.758717"
       id="path2238-4" />
    <path
       style="fill:none;stroke:#2f6f8f;stroke-width:0.165;stroke-linecap:butt;stroke-linejoin:miter;stroke-dasharray:none;stroke-opacity:1"
       d="m 4.5761022,3.3167624 v 1.723853"
       id="path2236-0" />
  </g>
</svg>
