{
  "highlightTheme": "vs",
  
  "mermaid": {
    "theme": "base",
    "themeVariables": {
      "primaryColor": "#0f0"
    }
  },
  "notesSeparator": "^NOTE.*\n",
  "separator": "^---$",
  "theme": "_assets/oslandia.css",
  "verticalSeparator": "^----$"
}
