{
    "name": "Main",
    "maps": [
        {
            "name": "MainMap",
            "id": "4a3d329e-c1b1-41a5-8389-a7952f9992d2",
            "actions": [
                {
                    "name": "Pointer",
                    "type": "Value",
                    "id": "c7769731-0b2c-4171-b284-69dd60337b3f",
                    "expectedControlType": "",
                    "processors": "",
                    "interactions": "",
                    "initialStateCheck": true
                }
            ],
            "bindings": [
                {
                    "name": "",
                    "id": "56ed1918-52c7-4424-a3f6-f8b885e3a38d",
                    "path": "<Mouse>/press",
                    "interactions": "",
                    "processors": "",
                    "groups": "",
                    "action": "Pointer",
                    "isComposite": false,
                    "isPartOfComposite": false
                },
                {
                    "name": "",
                    "id": "7386356c-a712-4d82-98c8-cdaf7cb72207",
                    "path": "<Mouse>/delta",
                    "interactions": "",
                    "processors": "",
                    "groups": "",
                    "action": "Pointer",
                    "isComposite": false,
                    "isPartOfComposite": false
                },
                {
                    "name": "",
                    "id": "12e91e04-9dfc-4fbd-8819-9221f96ae3cd",
                    "path": "<Pointer>/press",
                    "interactions": "",
                    "processors": "",
                    "groups": "",
                    "action": "Pointer",
                    "isComposite": false,
                    "isPartOfComposite": false
                },
                {
                    "name": "",
                    "id": "57790a29-6d55-40a8-ab94-7c9ea475a328",
                    "path": "<Pointer>/delta",
                    "interactions": "",
                    "processors": "",
                    "groups": "",
                    "action": "Pointer",
                    "isComposite": false,
                    "isPartOfComposite": false
                }
            ]
        }
    ],
    "controlSchemes": []
}