{
  "settings": {
	"index": {
		"number_of_shards": 1,
		"number_of_replicas": 0
	}
  },
  "mappings": {
	"properties": {
		"label": {
			"type": "text"
		},
		"context": {
			"type": "text"
		},
		"description": {
			"type": "text"
		}
	}
}}
