{
  "$schema": "https://docs.renovatebot.com/renovate-schema.json",
  "extends": [
    "config:base",
    ":semanticCommitTypeAll(fix)",
    ":automergeAll"
  ],
  "commitBodyTable": true,
  "separateMajorMinor": false,
  "labels": ["Renovate"],
  "packageRules": [
    {
      "matchFileNames": [
        ".gitlab-ci.yml"
      ],
      "semanticCommitType": "chore"
    }
  ]
}
