{
	"info": {
		"_postman_id": "aae24b33-28f7-4c56-b2ae-38c048bedf56",
		"name": "23-cfs-orders-UserStory-vFW-selector",
		"schema": "https://schema.getpostman.com/json/collection/v2.1.0/collection.json"
	},
	"item": [
		{
			"name": "order vFW 1 add",
			"event": [
				{
					"listen": "test",
					"script": {
						"id": "52d8909c-fefc-45f3-9af6-4ecac8f89337",
						"exec": [
							"pm.test(\"Status code is 201\", function () {",
							"    pm.response.to.have.status(201);",
							"});",
							"",
							"var jsonData = pm.response.json();",
							"",
							"pm.environment.set(\"auto_vFW_cfs_01_id\", \"\"+jsonData.orderItem[0].service.id+\"\");",
							""
						],
						"type": "text/javascript"
					}
				}
			],
			"request": {
				"method": "POST",
				"header": [
					{
						"key": "Content-Type",
						"name": "Content-Type",
						"type": "text",
						"value": "application/json"
					}
				],
				"body": {
					"mode": "raw",
					"raw": "{\n  \"category\": \"vFW service\",\n  \"description\": \"service order for vFW customer service\",\n  \"externalId\": \"BSS_serviceOrder_001\",\n   \"note\": {\n    \"author\": \"Orange\",\n    \"date\": \"Sept 2019\",\n    \"text\": \"\"\n  },\n  \"notificationContact\": \"\",\n  \"orderItem\": [\n    {\n      \"action\": \"add\",\n      \"id\": \"1\",\n      \"service\": {\n        \"name\": \"vFW_01\",\n        \"place\": [\n          {\n            \"id\": \"\",\n            \"name\": \"\",\n            \"role\": \"\"\n          }\n        ],\n        \"relatedParty\": [\n          {\n            \"id\": \"JohnDoe\",\n            \"name\": \"JohnDoe\",\n            \"role\": \"customer\",\n            \"href\": \"\"\n          }\n        ],\n        \"serviceCharacteristic\": [\n          {\n            \"name\": \"featureLevel\",\n            \"value\": \"simple\"\n          }        \t\n        \t],\n        \"serviceSpecification\": {\n          \"id\": \"{{auto_vFW_cfs_spec_id}}\",\n          \"name\": \"vFW\",\n          \"version\": \"1\"\n        },\n        \"serviceState\": \"active\",\n        \"serviceType\": \"\"\n      }\n    }\n  ],\n  \"priority\": \"1\",\n  \"relatedParty\": [\n    {\n      \"id\": \"JohnDoe\",\n      \"name\": \"JohnDoe\",\n      \"role\": \"customer\",\n      \"href\": \"\"\n    }\n  ]\n}"
				},
				"url": {
					"raw": "{{url-serv-resolv-service-order}}/cfsOrder",
					"host": [
						"{{url-serv-resolv-service-order}}"
					],
					"path": [
						"cfsOrder"
					]
				}
			},
			"response": []
		},
		{
			"name": "order vFW 2 add",
			"event": [
				{
					"listen": "test",
					"script": {
						"id": "52d8909c-fefc-45f3-9af6-4ecac8f89337",
						"exec": [
							"pm.test(\"Status code is 201\", function () {",
							"    pm.response.to.have.status(201);",
							"});",
							"",
							"pm.test(\"Status code is 201\", function () {",
							"    pm.response.to.have.status(201);",
							"});",
							"",
							"var jsonData = pm.response.json();",
							"",
							"pm.environment.set(\"auto_vFW_cfs_02_id\", \"\"+jsonData.orderItem[0].service.id+\"\");"
						],
						"type": "text/javascript"
					}
				}
			],
			"request": {
				"method": "POST",
				"header": [
					{
						"key": "Content-Type",
						"name": "Content-Type",
						"type": "text",
						"value": "application/json"
					}
				],
				"body": {
					"mode": "raw",
					"raw": "{\n  \"category\": \"vFW service\",\n  \"description\": \"service order for vFW customer service\",\n  \"externalId\": \"Customer_02\",\n   \"note\": {\n    \"author\": \"Orange\",\n    \"date\": \"May 2019\",\n    \"text\": \"\"\n  },\n  \"notificationContact\": \"\",\n  \"orderItem\": [\n    {\n      \"action\": \"add\",\n      \"id\": \"1\",\n      \"service\": {\n        \"name\": \"vFW_02\",\n        \"place\": [\n          {\n            \"id\": \"\",\n            \"name\": \"\",\n            \"role\": \"\"\n          }\n        ],\n        \"relatedParty\": [\n          {\n            \"id\": \"JohnDoe\",\n            \"name\": \"JohnDoe\",\n            \"role\": \"customer\",\n            \"href\": \"\"\n          }\n        ],\n        \"serviceCharacteristic\": [\n          {\n            \"name\": \"featureLevel\",\n            \"value\": \"rich\"\n          }        \t\n        \t],\n        \"serviceSpecification\": {\n          \"id\": \"{{auto_vFW_cfs_spec_id}}\",\n          \"name\": \"vFW\",\n          \"version\": \"1\"\n        },\n        \"serviceState\": \"active\",\n        \"serviceType\": \"\"\n      }\n    }\n  ],\n  \"priority\": \"1\",\n  \"relatedParty\": [\n    {\n      \"id\": \"JohnDoe\",\n      \"name\": \"JohnDoe\",\n      \"role\": \"customer\",\n      \"href\": \"\"\n    }\n  ]\n}"
				},
				"url": {
					"raw": "{{url-serv-resolv-service-order}}/cfsOrder",
					"host": [
						"{{url-serv-resolv-service-order}}"
					],
					"path": [
						"cfsOrder"
					]
				}
			},
			"response": []
		},
		{
			"name": "order vFW 3 add",
			"event": [
				{
					"listen": "test",
					"script": {
						"id": "52d8909c-fefc-45f3-9af6-4ecac8f89337",
						"exec": [
							"pm.test(\"Status code is 201\", function () {",
							"    pm.response.to.have.status(201);",
							"});",
							"",
							"var jsonData = pm.response.json();",
							"",
							"pm.environment.set(\"auto_vFW_cfs_03_id\", \"\"+jsonData.orderItem[0].service.id+\"\");",
							""
						],
						"type": "text/javascript"
					}
				}
			],
			"request": {
				"method": "POST",
				"header": [
					{
						"key": "Content-Type",
						"name": "Content-Type",
						"type": "text",
						"value": "application/json"
					}
				],
				"body": {
					"mode": "raw",
					"raw": "{\n  \"category\": \"vFW service\",\n  \"description\": \"service order for vFW customer service\",\n  \"externalId\": \"Customer_03\",\n   \"note\": {\n    \"author\": \"Orange\",\n    \"date\": \"May 2019\",\n    \"text\": \"\"\n  },\n  \"notificationContact\": \"\",\n  \"orderItem\": [\n    {\n      \"action\": \"add\",\n      \"id\": \"1\",\n      \"service\": {\n        \"name\": \"vFW_03\",\n        \"place\": [\n          {\n            \"id\": \"\",\n            \"name\": \"\",\n            \"role\": \"\"\n          }\n        ],\n        \"relatedParty\": [\n          {\n            \"id\": \"JohnDoe\",\n            \"name\": \"JohnDoe\",\n            \"role\": \"customer\",\n            \"href\": \"\"\n          }\n        ],\n        \"serviceCharacteristic\": [\n          {\n            \"name\": \"featureLevel\",\n            \"value\": \"rich\"\n          }        \t\n        \t],        \"serviceSpecification\": {\n          \"id\": \"{{auto_vFW_cfs_spec_id}}\",\n          \"name\": \"vFW\",\n          \"version\": \"1\"\n        },\n        \"serviceState\": \"active\",\n        \"serviceType\": \"\"\n      }\n    }\n  ],\n  \"priority\": \"1\",\n  \"relatedParty\": [\n    {\n      \"id\": \"JohnDoe\",\n      \"name\": \"JohnDoe\",\n      \"role\": \"customer\",\n      \"href\": \"\"\n    }\n  ]\n}"
				},
				"url": {
					"raw": "{{url-serv-resolv-service-order}}/cfsOrder",
					"host": [
						"{{url-serv-resolv-service-order}}"
					],
					"path": [
						"cfsOrder"
					]
				}
			},
			"response": []
		},
		{
			"name": "order vFW 4 add",
			"event": [
				{
					"listen": "test",
					"script": {
						"id": "52d8909c-fefc-45f3-9af6-4ecac8f89337",
						"exec": [
							"pm.test(\"Status code is 201\", function () {",
							"    pm.response.to.have.status(201);",
							"});",
							"",
							"var jsonData = pm.response.json();",
							"",
							"pm.environment.set(\"auto_vFW_cfs_04_id\", \"\"+jsonData.orderItem[0].service.id+\"\");",
							"",
							""
						],
						"type": "text/javascript"
					}
				}
			],
			"request": {
				"method": "POST",
				"header": [
					{
						"key": "Content-Type",
						"name": "Content-Type",
						"type": "text",
						"value": "application/json"
					}
				],
				"body": {
					"mode": "raw",
					"raw": "{\n  \"category\": \"vFW service\",\n  \"description\": \"service order for vFW customer service\",\n  \"externalId\": \"Customer_04\",\n   \"note\": {\n    \"author\": \"Orange\",\n    \"date\": \"May 2019\",\n    \"text\": \"\"\n  },\n  \"notificationContact\": \"\",\n  \"orderItem\": [\n    {\n      \"action\": \"add\",\n      \"id\": \"1\",\n      \"service\": {\n        \"name\": \"vFW_04\",\n        \"place\": [\n          {\n            \"id\": \"\",\n            \"name\": \"\",\n            \"role\": \"\"\n          }\n        ],\n        \"relatedParty\": [\n          {\n            \"id\": \"JohnDoe\",\n            \"name\": \"JohnDoe\",\n            \"role\": \"customer\",\n            \"href\": \"\"\n          }\n        ],\n        \"serviceCharacteristic\": [\n          {\n            \"name\": \"featureLevel\",\n            \"value\": \"rich\"\n          }        \t\n        \t],        \"serviceSpecification\": {\n          \"id\": \"{{auto_vFW_cfs_spec_id}}\",\n          \"name\": \"vFW\",\n          \"version\": \"1\"\n        },\n        \"serviceState\": \"active\",\n        \"serviceType\": \"\"\n      }\n    }\n  ],\n  \"priority\": \"1\",\n  \"relatedParty\": [\n    {\n      \"id\": \"JohnDoe\",\n      \"name\": \"JohnDoe\",\n      \"role\": \"customer\",\n      \"href\": \"\"\n    }\n  ]\n}"
				},
				"url": {
					"raw": "{{url-serv-resolv-service-order}}/cfsOrder",
					"host": [
						"{{url-serv-resolv-service-order}}"
					],
					"path": [
						"cfsOrder"
					]
				}
			},
			"response": []
		},
		{
			"name": "order vFW 1 delete",
			"event": [
				{
					"listen": "test",
					"script": {
						"id": "52d8909c-fefc-45f3-9af6-4ecac8f89337",
						"exec": [
							"pm.test(\"Status code is 201\", function () {",
							"    pm.response.to.have.status(201);",
							"});",
							""
						],
						"type": "text/javascript"
					}
				}
			],
			"request": {
				"method": "POST",
				"header": [
					{
						"key": "Content-Type",
						"name": "Content-Type",
						"type": "text",
						"value": "application/json"
					}
				],
				"body": {
					"mode": "raw",
					"raw": "{\n  \"category\": \"vFW service\",\n  \"description\": \"service order for vFW customer service\",\n  \"externalId\": \"Customer_01\",\n   \"note\": {\n    \"author\": \"Orange\",\n    \"date\": \"May 2019\",\n    \"text\": \"\"\n  },\n  \"notificationContact\": \"\",\n  \"orderItem\": [\n    {\n      \"action\": \"delete\",\n      \"id\": \"1\",\n      \"service\": {\n        \"name\": \"vFW_01\",\n        \"id\": \"{{auto_vFW_cfs_01_id}}\",\n        \"place\": [\n          {\n            \"id\": \"\",\n            \"name\": \"\",\n            \"role\": \"\"\n          }\n        ],\n        \"relatedParty\": [\n          {\n            \"id\": \"JohnDoe\",\n            \"name\": \"JohnDoe\",\n            \"role\": \"customer\",\n            \"href\": \"\"\n          }\n        ]\n       }\n    }\n  ],\n  \"priority\": \"1\",\n  \"relatedParty\": [\n    {\n      \"id\": \"JohnDoe\",\n      \"name\": \"JohnDoe\",\n      \"role\": \"customer\",\n      \"href\": \"\"\n    }\n  ]\n}"
				},
				"url": {
					"raw": "{{url-serv-resolv-service-order}}/cfsOrder",
					"host": [
						"{{url-serv-resolv-service-order}}"
					],
					"path": [
						"cfsOrder"
					]
				}
			},
			"response": []
		},
		{
			"name": "order vFW 3 delete",
			"event": [
				{
					"listen": "test",
					"script": {
						"id": "52d8909c-fefc-45f3-9af6-4ecac8f89337",
						"exec": [
							"pm.test(\"Status code is 201\", function () {",
							"    pm.response.to.have.status(201);",
							"});",
							"",
							""
						],
						"type": "text/javascript"
					}
				}
			],
			"request": {
				"method": "POST",
				"header": [
					{
						"key": "Content-Type",
						"name": "Content-Type",
						"type": "text",
						"value": "application/json"
					}
				],
				"body": {
					"mode": "raw",
					"raw": "{\n  \"category\": \"vFW service\",\n  \"description\": \"service order for vFW customer service\",\n  \"externalId\": \"Customer_03\",\n   \"note\": {\n    \"author\": \"Orange\",\n    \"date\": \"May 2019\",\n    \"text\": \"\"\n  },\n  \"notificationContact\": \"\",\n  \"orderItem\": [\n    {\n      \"action\": \"delete\",\n      \"id\": \"1\",\n      \"service\": {\n        \"name\": \"vFW_03\",\n        \"id\": \"{{auto_vFW_cfs_03_id}}\",\n        \"place\": [\n          {\n            \"id\": \"\",\n            \"name\": \"\",\n            \"role\": \"\"\n          }\n        ],\n        \"relatedParty\": [\n          {\n            \"id\": \"JohnDoe\",\n            \"name\": \"JohnDoe\",\n            \"role\": \"customer\",\n            \"href\": \"\"\n          }\n        ]\n       }\n    }\n  ],\n  \"priority\": \"1\",\n  \"relatedParty\": [\n    {\n      \"id\": \"JohnDoe\",\n      \"name\": \"JohnDoe\",\n      \"role\": \"customer\",\n      \"href\": \"\"\n    }\n  ]\n}"
				},
				"url": {
					"raw": "{{url-serv-resolv-service-order}}/cfsOrder",
					"host": [
						"{{url-serv-resolv-service-order}}"
					],
					"path": [
						"cfsOrder"
					]
				}
			},
			"response": []
		},
		{
			"name": "order vFW 2 delete",
			"event": [
				{
					"listen": "test",
					"script": {
						"id": "52d8909c-fefc-45f3-9af6-4ecac8f89337",
						"exec": [
							"pm.test(\"Status code is 201\", function () {",
							"    pm.response.to.have.status(201);",
							"});",
							"",
							""
						],
						"type": "text/javascript"
					}
				}
			],
			"request": {
				"method": "POST",
				"header": [
					{
						"key": "Content-Type",
						"name": "Content-Type",
						"type": "text",
						"value": "application/json"
					}
				],
				"body": {
					"mode": "raw",
					"raw": "{\n  \"category\": \"vFW service\",\n  \"description\": \"service order for vFW customer service\",\n  \"externalId\": \"Customer_02\",\n   \"note\": {\n    \"author\": \"Orange\",\n    \"date\": \"May 2019\",\n    \"text\": \"\"\n  },\n  \"notificationContact\": \"\",\n  \"orderItem\": [\n    {\n      \"action\": \"delete\",\n      \"id\": \"1\",\n      \"service\": {\n        \"name\": \"vFW_02\",\n        \"id\": \"{{auto_vFW_cfs_02_id}}\",\n        \"place\": [\n          {\n            \"id\": \"\",\n            \"name\": \"\",\n            \"role\": \"\"\n          }\n        ],\n        \"relatedParty\": [\n          {\n            \"id\": \"JohnDoe\",\n            \"name\": \"JohnDoe\",\n            \"role\": \"customer\",\n            \"href\": \"\"\n          }\n        ]\n       }\n    }\n  ],\n  \"priority\": \"1\",\n  \"relatedParty\": [\n    {\n      \"id\": \"JohnDoe\",\n      \"name\": \"JohnDoe\",\n      \"role\": \"customer\",\n      \"href\": \"\"\n    }\n  ]\n}"
				},
				"url": {
					"raw": "{{url-serv-resolv-service-order}}/cfsOrder",
					"host": [
						"{{url-serv-resolv-service-order}}"
					],
					"path": [
						"cfsOrder"
					]
				}
			},
			"response": []
		},
		{
			"name": "order vFW 4 delete",
			"event": [
				{
					"listen": "test",
					"script": {
						"id": "52d8909c-fefc-45f3-9af6-4ecac8f89337",
						"exec": [
							"pm.test(\"Status code is 201\", function () {",
							"    pm.response.to.have.status(201);",
							"});",
							"",
							""
						],
						"type": "text/javascript"
					}
				}
			],
			"request": {
				"method": "POST",
				"header": [
					{
						"key": "Content-Type",
						"name": "Content-Type",
						"type": "text",
						"value": "application/json"
					}
				],
				"body": {
					"mode": "raw",
					"raw": "{\n  \"category\": \"vFW service\",\n  \"description\": \"service order for vFW customer service\",\n  \"externalId\": \"Customer_04\",\n   \"note\": {\n    \"author\": \"Orange\",\n    \"date\": \"May 2019\",\n    \"text\": \"\"\n  },\n  \"notificationContact\": \"\",\n  \"orderItem\": [\n    {\n      \"action\": \"delete\",\n      \"id\": \"1\",\n      \"service\": {\n        \"name\": \"vFW_04\",\n        \"id\": \"{{auto_vFW_cfs_04_id}}\",\n        \"place\": [\n          {\n            \"id\": \"\",\n            \"name\": \"\",\n            \"role\": \"\"\n          }\n        ],\n        \"relatedParty\": [\n          {\n            \"id\": \"JohnDoe\",\n            \"name\": \"JohnDoe\",\n            \"role\": \"customer\",\n            \"href\": \"\"\n          }\n        ]\n       }\n    }\n  ],\n  \"priority\": \"1\",\n  \"relatedParty\": [\n    {\n      \"id\": \"JohnDoe\",\n      \"name\": \"JohnDoe\",\n      \"role\": \"customer\",\n      \"href\": \"\"\n    }\n  ]\n}"
				},
				"url": {
					"raw": "{{url-serv-resolv-service-order}}/cfsOrder",
					"host": [
						"{{url-serv-resolv-service-order}}"
					],
					"path": [
						"cfsOrder"
					]
				}
			},
			"response": []
		}
	],
	"event": [
		{
			"listen": "prerequest",
			"script": {
				"id": "bf3359ca-0e25-4f6f-9c2f-2ff5d558dc8c",
				"type": "text/javascript",
				"exec": [
					""
				]
			}
		},
		{
			"listen": "test",
			"script": {
				"id": "c43fa544-fc50-4704-812b-0078bf61003f",
				"type": "text/javascript",
				"exec": [
					""
				]
			}
		}
	]
}