{
	"externalId": "cfs_{{order_item["service"]["id"]}}",
	"priority": "1",
	"description": "{{rfs_spec["name"]}}_instance order",
	"category": "Consumer",
	"requestedStartDate": "2018-04-26T08:33:37.299Z",
	"requestedCompletionDate": "2018-04-26T08:33:37.299Z",
	"relatedParty": [],
	"orderItem": [{
		"id": "1",
		"action": "delete",
		"service": {
			"id": "{{order_item["service"]["id"]}}",
			"name": "{{rfs_spec["name"]}}",
			"serviceState": "active",
			"serviceSpecification": {
				"id": "{{rfs_spec["id"]}}"
			}
		}
	}]
}
