{
	"id": "e72a860e-a4f2-4bd5-9fec-0b620c7c441c",
	"name": "service_resolver",
	"values": [
		{
			"key": "url-sdc",
			"value": "http://sdc.api.fe.simpledemo.onap.org:30205",
			"enabled": true
		},
		{
			"key": "url-sdc2",
			"value": "http://sdc.api.fe.simpledemo.onap.org:30206",
			"enabled": true
		},
		{
			"key": "url-nbi",
			"value": "http://nbi.api.simpledemo.onap.org:30274",
			"enabled": true
		},
		{
			"key": "url-serv-resolv-cfs_spec",
			"value": "http://localhost:6004/serviceResolver/serviceCatalogManagement/api/v1",
			"enabled": true
		},
		{
			"key": "url-serv-resolv-rfs-spec",
			"value": "http://localhost:6001/serviceResolver/serviceCatalogManagement/api/v1",
			"enabled": true
		},
		{
			"key": "url-serv-resolv-service-order",
			"value": "http://localhost:6002/serviceResolver/serviceOrderManagement/api/v1",
			"enabled": true
		},
		{
			"key": "url-serv-resolv-service",
			"value": "http://localhost:6003/serviceResolver/serviceInventoryManagement/api/v1",
			"enabled": true
		},
		{
			"key": "url-instantiation_decision",
			"value": "http://localhost:6006/serviceResolver/instantiationDecisionManagement/api/v1",
			"enabled": true
		}
	],
	"_postman_variable_scope": "environment",
	"_postman_exported_at": "2019-11-07T10:42:53.651Z",
	"_postman_exported_using": "Postman/7.10.0"
}