{
	"info": {
		"_postman_id": "fb3e7b86-7d55-4f22-90a6-0bf570467f66",
		"name": "honeynode_init",
		"schema": "https://schema.getpostman.com/json/collection/v2.1.0/collection.json"
	},
	"item": [
		{
			"name": "Connect honey XPDR-1",
			"event": [
				{
					"listen": "test",
					"script": {
						"exec": [
							"pm.test(\"Status code should be 200 or 201\", function () {",
							"     pm.expect(pm.response.code).to.be.oneOf([200,201]);",
							"});"
						],
						"type": "text/javascript"
					}
				}
			],
			"request": {
				"method": "PUT",
				"header": [
					{
						"key": "Content-Type",
						"value": "application/json"
					},
					{
						"key": "Authorization",
						"value": "Basic YWRtaW46YWRtaW4="
					}
				],
				"body": {
					"mode": "raw",
					"raw": "{\n    \"node\": [\n        {\n            \"node-id\": \"{{transponder_1}}\",\n    \t\t\"netconf-node-topology:tcp-only\": \"false\",\n    \t\t\"netconf-node-topology:reconnect-on-changed-schema\": \"false\",\n    \t\t\"netconf-node-topology:host\": \"{{node_ip}}\",\n    \t\t\"netconf-node-topology:default-request-timeout-millis\": \"60000\",\n    \t\t\"netconf-node-topology:max-connection-attempts\": \"0\",\n\t\t\t\"netconf-node-topology:sleep-factor\": \"1.5\",\n    \t\t\"netconf-node-topology:actor-response-wait-time\": \"5\",\n    \t\t\"netconf-node-topology:concurrent-rpc-limit\": \"0\",\n    \t\t\"netconf-node-topology:between-attempts-timeout-millis\": \"2000\",\n    \t\t\"netconf-node-topology:port\": \"17840\",\n    \t\t\"netconf-node-topology:connection-timeout-millis\": \"20000\",\n    \t\t\"netconf-node-topology:username\": \"admin\",\n    \t\t\"netconf-node-topology:password\": \"admin\",\n    \t\t\"netconf-node-topology:keepalive-delay\": \"120\"\n        }\n    ]\n}"
				},
				"url": {
					"raw": "http://127.0.0.1:8181/restconf/config/network-topology:network-topology/topology/topology-netconf/node/{{transponder_1}}",
					"protocol": "http",
					"host": [
						"127",
						"0",
						"0",
						"1"
					],
					"port": "8181",
					"path": [
						"restconf",
						"config",
						"network-topology:network-topology",
						"topology",
						"topology-netconf",
						"node",
						"{{transponder_1}}"
					]
				},
				"description": "127.0.0.1:17831"
			},
			"response": []
		},
		{
			"name": "Connect honey ROADM-1",
			"event": [
				{
					"listen": "test",
					"script": {
						"exec": [
							"pm.test(\"Status code should be 200 or 201\", function () {",
							"     pm.expect(pm.response.code).to.be.oneOf([200,201]);",
							"});"
						],
						"type": "text/javascript"
					}
				}
			],
			"request": {
				"method": "PUT",
				"header": [
					{
						"key": "Content-Type",
						"value": "application/json"
					},
					{
						"key": "Authorization",
						"value": "Basic YWRtaW46YWRtaW4="
					}
				],
				"body": {
					"mode": "raw",
					"raw": "{\n    \"node\": [\n        {\n            \"node-id\": \"{{roadm_1}}\",\n    \t\t\"netconf-node-topology:tcp-only\": \"false\",\n    \t\t\"netconf-node-topology:reconnect-on-changed-schema\": \"false\",\n    \t\t\"netconf-node-topology:host\": \"{{node_ip}}\",\n    \t\t\"netconf-node-topology:default-request-timeout-millis\": \"60000\",\n    \t\t\"netconf-node-topology:max-connection-attempts\": \"0\",\n\t\t\t\"netconf-node-topology:sleep-factor\": \"1.5\",\n    \t\t\"netconf-node-topology:actor-response-wait-time\": \"5\",\n    \t\t\"netconf-node-topology:concurrent-rpc-limit\": \"0\",\n    \t\t\"netconf-node-topology:between-attempts-timeout-millis\": \"2000\",\n    \t\t\"netconf-node-topology:port\": \"17841\",\n    \t\t\"netconf-node-topology:connection-timeout-millis\": \"20000\",\n    \t\t\"netconf-node-topology:username\": \"admin\",\n    \t\t\"netconf-node-topology:password\": \"admin\",\n    \t\t\"netconf-node-topology:keepalive-delay\": \"120\"\n        }\n    ]\n}"
				},
				"url": {
					"raw": "http://127.0.0.1:8181/restconf/config/network-topology:network-topology/topology/topology-netconf/node/{{roadm_1}}",
					"protocol": "http",
					"host": [
						"127",
						"0",
						"0",
						"1"
					],
					"port": "8181",
					"path": [
						"restconf",
						"config",
						"network-topology:network-topology",
						"topology",
						"topology-netconf",
						"node",
						"{{roadm_1}}"
					]
				},
				"description": "127.0.0.1:17831"
			},
			"response": []
		},
		{
			"name": "Connect honey ROADM-3",
			"event": [
				{
					"listen": "test",
					"script": {
						"exec": [
							"pm.test(\"Status code should be 200 or 201\", function () {",
							"     pm.expect(pm.response.code).to.be.oneOf([200,201]);",
							"});"
						],
						"type": "text/javascript"
					}
				}
			],
			"request": {
				"method": "PUT",
				"header": [
					{
						"key": "Content-Type",
						"value": "application/json"
					},
					{
						"key": "Authorization",
						"value": "Basic YWRtaW46YWRtaW4="
					}
				],
				"body": {
					"mode": "raw",
					"raw": "{\n    \"node\": [\n        {\n            \"node-id\": \"{{roadm_3}}\",\n    \t\t\"netconf-node-topology:tcp-only\": \"false\",\n    \t\t\"netconf-node-topology:reconnect-on-changed-schema\": \"false\",\n    \t\t\"netconf-node-topology:host\": \"{{node_ip}}\",\n    \t\t\"netconf-node-topology:default-request-timeout-millis\": \"60000\",\n    \t\t\"netconf-node-topology:max-connection-attempts\": \"0\",\n\t\t\t\"netconf-node-topology:sleep-factor\": \"1.5\",\n    \t\t\"netconf-node-topology:actor-response-wait-time\": \"5\",\n    \t\t\"netconf-node-topology:concurrent-rpc-limit\": \"0\",\n    \t\t\"netconf-node-topology:between-attempts-timeout-millis\": \"2000\",\n    \t\t\"netconf-node-topology:port\": \"17843\",\n    \t\t\"netconf-node-topology:connection-timeout-millis\": \"20000\",\n    \t\t\"netconf-node-topology:username\": \"admin\",\n    \t\t\"netconf-node-topology:password\": \"admin\",\n    \t\t\"netconf-node-topology:keepalive-delay\": \"120\"\n        }\n    ]\n}"
				},
				"url": {
					"raw": "http://127.0.0.1:8181/restconf/config/network-topology:network-topology/topology/topology-netconf/node/{{roadm_3}}",
					"protocol": "http",
					"host": [
						"127",
						"0",
						"0",
						"1"
					],
					"port": "8181",
					"path": [
						"restconf",
						"config",
						"network-topology:network-topology",
						"topology",
						"topology-netconf",
						"node",
						"{{roadm_3}}"
					]
				},
				"description": "127.0.0.1:17831"
			},
			"response": []
		},
		{
			"name": "Connect honey ROADM-2",
			"event": [
				{
					"listen": "test",
					"script": {
						"exec": [
							"pm.test(\"Status code should be 200 or 201\", function () {",
							"     pm.expect(pm.response.code).to.be.oneOf([200,201]);",
							"});"
						],
						"type": "text/javascript"
					}
				}
			],
			"request": {
				"method": "PUT",
				"header": [
					{
						"key": "Content-Type",
						"value": "application/json"
					},
					{
						"key": "Authorization",
						"value": "Basic YWRtaW46YWRtaW4="
					}
				],
				"body": {
					"mode": "raw",
					"raw": "{\n    \"node\": [\n        {\n            \"node-id\": \"{{roadm_2}}\",\n    \t\t\"netconf-node-topology:tcp-only\": \"false\",\n    \t\t\"netconf-node-topology:reconnect-on-changed-schema\": \"false\",\n    \t\t\"netconf-node-topology:host\": \"{{node_ip}}\",\n    \t\t\"netconf-node-topology:default-request-timeout-millis\": \"60000\",\n    \t\t\"netconf-node-topology:max-connection-attempts\": \"0\",\n\t\t\t\"netconf-node-topology:sleep-factor\": \"1.5\",\n    \t\t\"netconf-node-topology:actor-response-wait-time\": \"5\",\n    \t\t\"netconf-node-topology:concurrent-rpc-limit\": \"0\",\n    \t\t\"netconf-node-topology:between-attempts-timeout-millis\": \"2000\",\n    \t\t\"netconf-node-topology:port\": \"17842\",\n    \t\t\"netconf-node-topology:connection-timeout-millis\": \"20000\",\n    \t\t\"netconf-node-topology:username\": \"admin\",\n    \t\t\"netconf-node-topology:password\": \"admin\",\n    \t\t\"netconf-node-topology:keepalive-delay\": \"120\"\n        }\n    ]\n}"
				},
				"url": {
					"raw": "http://127.0.0.1:8181/restconf/config/network-topology:network-topology/topology/topology-netconf/node/{{roadm_2}}",
					"protocol": "http",
					"host": [
						"127",
						"0",
						"0",
						"1"
					],
					"port": "8181",
					"path": [
						"restconf",
						"config",
						"network-topology:network-topology",
						"topology",
						"topology-netconf",
						"node",
						"{{roadm_2}}"
					]
				},
				"description": "127.0.0.1:17831"
			},
			"response": []
		},
		{
			"name": "Connect honey XPDR-2",
			"event": [
				{
					"listen": "test",
					"script": {
						"exec": [
							"pm.test(\"Status code should be 200 or 201\", function () {",
							"     pm.expect(pm.response.code).to.be.oneOf([200,201]);",
							"});"
						],
						"type": "text/javascript"
					}
				}
			],
			"request": {
				"method": "PUT",
				"header": [
					{
						"key": "Content-Type",
						"value": "application/json"
					},
					{
						"key": "Authorization",
						"value": "Basic YWRtaW46YWRtaW4="
					}
				],
				"body": {
					"mode": "raw",
					"raw": "{\n    \"node\": [\n        {\n            \"node-id\": \"{{transponder_2}}\",\n    \t\t\"netconf-node-topology:tcp-only\": \"false\",\n    \t\t\"netconf-node-topology:reconnect-on-changed-schema\": \"false\",\n    \t\t\"netconf-node-topology:host\": \"{{node_ip}}\",\n    \t\t\"netconf-node-topology:default-request-timeout-millis\": \"60000\",\n    \t\t\"netconf-node-topology:max-connection-attempts\": \"0\",\n\t\t\t\"netconf-node-topology:sleep-factor\": \"1.5\",\n    \t\t\"netconf-node-topology:actor-response-wait-time\": \"5\",\n    \t\t\"netconf-node-topology:concurrent-rpc-limit\": \"0\",\n    \t\t\"netconf-node-topology:between-attempts-timeout-millis\": \"2000\",\n    \t\t\"netconf-node-topology:port\": \"17844\",\n    \t\t\"netconf-node-topology:connection-timeout-millis\": \"20000\",\n    \t\t\"netconf-node-topology:username\": \"admin\",\n    \t\t\"netconf-node-topology:password\": \"admin\",\n    \t\t\"netconf-node-topology:keepalive-delay\": \"120\"\n        }\n    ]\n}"
				},
				"url": {
					"raw": "http://127.0.0.1:8181/restconf/config/network-topology:network-topology/topology/topology-netconf/node/{{transponder_2}}",
					"protocol": "http",
					"host": [
						"127",
						"0",
						"0",
						"1"
					],
					"port": "8181",
					"path": [
						"restconf",
						"config",
						"network-topology:network-topology",
						"topology",
						"topology-netconf",
						"node",
						"{{transponder_2}}"
					]
				},
				"description": "127.0.0.1:17831"
			},
			"response": []
		},
		{
			"name": "Connect honey SPDR-1",
			"event": [
				{
					"listen": "test",
					"script": {
						"exec": [
							"pm.test(\"Status code should be 200 or 201\", function () {",
							"     pm.expect(pm.response.code).to.be.oneOf([200,201]);",
							"});"
						],
						"type": "text/javascript"
					}
				}
			],
			"request": {
				"method": "PUT",
				"header": [
					{
						"key": "Content-Type",
						"value": "application/json"
					},
					{
						"key": "Authorization",
						"value": "Basic YWRtaW46YWRtaW4="
					}
				],
				"body": {
					"mode": "raw",
					"raw": "{\n    \"node\": [\n        {\n            \"node-id\": \"{{switchponder_1}}\",\n    \t\t\"netconf-node-topology:tcp-only\": \"false\",\n    \t\t\"netconf-node-topology:reconnect-on-changed-schema\": \"false\",\n    \t\t\"netconf-node-topology:host\": \"{{node_ip}}\",\n    \t\t\"netconf-node-topology:default-request-timeout-millis\": \"60000\",\n    \t\t\"netconf-node-topology:max-connection-attempts\": \"0\",\n\t\t\t\"netconf-node-topology:sleep-factor\": \"1.5\",\n    \t\t\"netconf-node-topology:actor-response-wait-time\": \"5\",\n    \t\t\"netconf-node-topology:concurrent-rpc-limit\": \"0\",\n    \t\t\"netconf-node-topology:between-attempts-timeout-millis\": \"2000\",\n    \t\t\"netconf-node-topology:port\": \"17845\",\n    \t\t\"netconf-node-topology:connection-timeout-millis\": \"20000\",\n    \t\t\"netconf-node-topology:username\": \"admin\",\n    \t\t\"netconf-node-topology:password\": \"admin\",\n    \t\t\"netconf-node-topology:keepalive-delay\": \"120\"\n        }\n    ]\n}"
				},
				"url": {
					"raw": "http://127.0.0.1:8181/restconf/config/network-topology:network-topology/topology/topology-netconf/node/{{switchponder_1}}",
					"protocol": "http",
					"host": [
						"127",
						"0",
						"0",
						"1"
					],
					"port": "8181",
					"path": [
						"restconf",
						"config",
						"network-topology:network-topology",
						"topology",
						"topology-netconf",
						"node",
						"{{switchponder_1}}"
					]
				},
				"description": "127.0.0.1:17831"
			},
			"response": []
		},
		{
			"name": "Connect honey SPDR-2",
			"event": [
				{
					"listen": "test",
					"script": {
						"exec": [
							"pm.test(\"Status code should be 200 or 201\", function () {",
							"     pm.expect(pm.response.code).to.be.oneOf([200,201]);",
							"});"
						],
						"type": "text/javascript"
					}
				}
			],
			"request": {
				"method": "PUT",
				"header": [
					{
						"key": "Content-Type",
						"value": "application/json"
					},
					{
						"key": "Authorization",
						"value": "Basic YWRtaW46YWRtaW4="
					}
				],
				"body": {
					"mode": "raw",
					"raw": "{\n    \"node\": [\n        {\n            \"node-id\": \"{{switchponder_2}}\",\n    \t\t\"netconf-node-topology:tcp-only\": \"false\",\n    \t\t\"netconf-node-topology:reconnect-on-changed-schema\": \"false\",\n    \t\t\"netconf-node-topology:host\": \"{{node_ip}}\",\n    \t\t\"netconf-node-topology:default-request-timeout-millis\": \"60000\",\n    \t\t\"netconf-node-topology:max-connection-attempts\": \"0\",\n\t\t\t\"netconf-node-topology:sleep-factor\": \"1.5\",\n    \t\t\"netconf-node-topology:actor-response-wait-time\": \"5\",\n    \t\t\"netconf-node-topology:concurrent-rpc-limit\": \"0\",\n    \t\t\"netconf-node-topology:between-attempts-timeout-millis\": \"2000\",\n    \t\t\"netconf-node-topology:port\": \"17846\",\n    \t\t\"netconf-node-topology:connection-timeout-millis\": \"20000\",\n    \t\t\"netconf-node-topology:username\": \"admin\",\n    \t\t\"netconf-node-topology:password\": \"admin\",\n    \t\t\"netconf-node-topology:keepalive-delay\": \"120\"\n        }\n    ]\n}"
				},
				"url": {
					"raw": "http://127.0.0.1:8181/restconf/config/network-topology:network-topology/topology/topology-netconf/node/{{switchponder_2}}",
					"protocol": "http",
					"host": [
						"127",
						"0",
						"0",
						"1"
					],
					"port": "8181",
					"path": [
						"restconf",
						"config",
						"network-topology:network-topology",
						"topology",
						"topology-netconf",
						"node",
						"{{switchponder_2}}"
					]
				},
				"description": "127.0.0.1:17831"
			},
			"response": []
		},
		{
			"name": "XPDR-1 to ROADM-1",
			"event": [
				{
					"listen": "test",
					"script": {
						"exec": [
							"pm.test(\"Status code should be 200\", function () {",
							"    pm.response.to.have.status(200);",
							"});"
						],
						"type": "text/javascript"
					}
				}
			],
			"request": {
				"auth": {
					"type": "basic",
					"basic": [
						{
							"key": "password",
							"value": "admin",
							"type": "string"
						},
						{
							"key": "username",
							"value": "admin",
							"type": "string"
						}
					]
				},
				"method": "POST",
				"header": [
					{
						"key": "Content-Type",
						"value": "application/json"
					},
					{
						"key": "Accept",
						"value": "application/json"
					}
				],
				"body": {
					"mode": "raw",
					"raw": "{\n  \"networkutils:input\": {\n    \"networkutils:links-input\": {\n      \"networkutils:xpdr-node\": \"{{transponder_1}}\",\n      \"networkutils:xpdr-num\": \"1\",\n      \"networkutils:network-num\": \"1\",\n      \"networkutils:rdm-node\": \"{{roadm_1}}\",\n      \"networkutils:srg-num\": \"1\",\n      \"networkutils:termination-point-num\": \"SRG1-PP1-TXRX\"\n    }\n  }\n}"
				},
				"url": {
					"raw": "http://localhost:8181/restconf/operations/transportpce-networkutils:init-xpdr-rdm-links",
					"protocol": "http",
					"host": [
						"localhost"
					],
					"port": "8181",
					"path": [
						"restconf",
						"operations",
						"transportpce-networkutils:init-xpdr-rdm-links"
					]
				}
			},
			"response": []
		},
		{
			"name": "ROADM-1 to XPDR-1",
			"event": [
				{
					"listen": "test",
					"script": {
						"exec": [
							"pm.test(\"Status code should be 200\", function () {",
							"    pm.response.to.have.status(200);",
							"});"
						],
						"type": "text/javascript"
					}
				}
			],
			"request": {
				"auth": {
					"type": "basic",
					"basic": [
						{
							"key": "password",
							"value": "admin",
							"type": "string"
						},
						{
							"key": "username",
							"value": "admin",
							"type": "string"
						}
					]
				},
				"method": "POST",
				"header": [
					{
						"key": "Content-Type",
						"value": "application/json"
					},
					{
						"key": "Accept",
						"value": "application/json"
					}
				],
				"body": {
					"mode": "raw",
					"raw": "{\n  \"networkutils:input\": {\n    \"networkutils:links-input\": {\n      \"networkutils:xpdr-node\": \"{{transponder_1}}\",\n      \"networkutils:xpdr-num\": \"1\",\n      \"networkutils:network-num\": \"1\",\n      \"networkutils:rdm-node\": \"{{roadm_1}}\",\n      \"networkutils:srg-num\": \"1\",\n      \"networkutils:termination-point-num\": \"SRG1-PP1-TXRX\"\n    }\n  }\n}"
				},
				"url": {
					"raw": "http://localhost:8181/restconf/operations/transportpce-networkutils:init-rdm-xpdr-links",
					"protocol": "http",
					"host": [
						"localhost"
					],
					"port": "8181",
					"path": [
						"restconf",
						"operations",
						"transportpce-networkutils:init-rdm-xpdr-links"
					]
				}
			},
			"response": []
		},
		{
			"name": "MUXPONDER-1 to ROADM-1",
			"event": [
				{
					"listen": "test",
					"script": {
						"exec": [
							"pm.test(\"Status code should be 200\", function () {",
							"    pm.response.to.have.status(200);",
							"});"
						],
						"type": "text/javascript"
					}
				}
			],
			"request": {
				"auth": {
					"type": "basic",
					"basic": [
						{
							"key": "password",
							"value": "admin",
							"type": "string"
						},
						{
							"key": "username",
							"value": "admin",
							"type": "string"
						}
					]
				},
				"method": "POST",
				"header": [
					{
						"key": "Content-Type",
						"value": "application/json"
					},
					{
						"key": "Accept",
						"value": "application/json"
					}
				],
				"body": {
					"mode": "raw",
					"raw": "{\n  \"networkutils:input\": {\n    \"networkutils:links-input\": {\n      \"networkutils:xpdr-node\": \"{{switchponder_1}}\",\n      \"networkutils:xpdr-num\": \"1\",\n      \"networkutils:network-num\": \"1\",\n      \"networkutils:rdm-node\": \"{{roadm_1}}\",\n      \"networkutils:srg-num\": \"1\",\n      \"networkutils:termination-point-num\": \"SRG1-PP2-TXRX\"\n    }\n  }\n}"
				},
				"url": {
					"raw": "http://localhost:8181/restconf/operations/transportpce-networkutils:init-xpdr-rdm-links",
					"protocol": "http",
					"host": [
						"localhost"
					],
					"port": "8181",
					"path": [
						"restconf",
						"operations",
						"transportpce-networkutils:init-xpdr-rdm-links"
					]
				}
			},
			"response": []
		},
		{
			"name": "ROADM-1 to MUXPONDER-1",
			"event": [
				{
					"listen": "test",
					"script": {
						"exec": [
							"pm.test(\"Status code should be 200\", function () {",
							"    pm.response.to.have.status(200);",
							"});"
						],
						"type": "text/javascript"
					}
				}
			],
			"request": {
				"auth": {
					"type": "basic",
					"basic": [
						{
							"key": "password",
							"value": "admin",
							"type": "string"
						},
						{
							"key": "username",
							"value": "admin",
							"type": "string"
						}
					]
				},
				"method": "POST",
				"header": [
					{
						"key": "Content-Type",
						"value": "application/json"
					},
					{
						"key": "Accept",
						"value": "application/json"
					}
				],
				"body": {
					"mode": "raw",
					"raw": "{\n  \"networkutils:input\": {\n    \"networkutils:links-input\": {\n      \"networkutils:xpdr-node\": \"{{switchponder_1}}\",\n      \"networkutils:xpdr-num\": \"1\",\n      \"networkutils:network-num\": \"1\",\n      \"networkutils:rdm-node\": \"{{roadm_1}}\",\n      \"networkutils:srg-num\": \"1\",\n      \"networkutils:termination-point-num\": \"SRG1-PP2-TXRX\"\n    }\n  }\n}"
				},
				"url": {
					"raw": "http://localhost:8181/restconf/operations/transportpce-networkutils:init-rdm-xpdr-links",
					"protocol": "http",
					"host": [
						"localhost"
					],
					"port": "8181",
					"path": [
						"restconf",
						"operations",
						"transportpce-networkutils:init-rdm-xpdr-links"
					]
				}
			},
			"response": []
		},
		{
			"name": "SWITCH-PONDER-1 to ROADM-1",
			"event": [
				{
					"listen": "test",
					"script": {
						"exec": [
							"pm.test(\"Status code should be 200\", function () {",
							"    pm.response.to.have.status(200);",
							"});"
						],
						"type": "text/javascript"
					}
				}
			],
			"request": {
				"auth": {
					"type": "basic",
					"basic": [
						{
							"key": "password",
							"value": "admin",
							"type": "string"
						},
						{
							"key": "username",
							"value": "admin",
							"type": "string"
						}
					]
				},
				"method": "POST",
				"header": [
					{
						"key": "Content-Type",
						"value": "application/json"
					},
					{
						"key": "Accept",
						"value": "application/json"
					}
				],
				"body": {
					"mode": "raw",
					"raw": "{\n  \"networkutils:input\": {\n    \"networkutils:links-input\": {\n      \"networkutils:xpdr-node\": \"{{switchponder_1}}\",\n      \"networkutils:xpdr-num\": \"2\",\n      \"networkutils:network-num\": \"1\",\n      \"networkutils:rdm-node\": \"{{roadm_1}}\",\n      \"networkutils:srg-num\": \"1\",\n      \"networkutils:termination-point-num\": \"SRG1-PP3-TXRX\"\n    }\n  }\n}"
				},
				"url": {
					"raw": "http://localhost:8181/restconf/operations/transportpce-networkutils:init-xpdr-rdm-links",
					"protocol": "http",
					"host": [
						"localhost"
					],
					"port": "8181",
					"path": [
						"restconf",
						"operations",
						"transportpce-networkutils:init-xpdr-rdm-links"
					]
				}
			},
			"response": []
		},
		{
			"name": "ROADM-1 to SWITCH-PONDER-1",
			"event": [
				{
					"listen": "test",
					"script": {
						"exec": [
							"pm.test(\"Status code should be 200\", function () {",
							"    pm.response.to.have.status(200);",
							"});"
						],
						"type": "text/javascript"
					}
				}
			],
			"request": {
				"auth": {
					"type": "basic",
					"basic": [
						{
							"key": "password",
							"value": "admin",
							"type": "string"
						},
						{
							"key": "username",
							"value": "admin",
							"type": "string"
						}
					]
				},
				"method": "POST",
				"header": [
					{
						"key": "Content-Type",
						"value": "application/json"
					},
					{
						"key": "Accept",
						"value": "application/json"
					}
				],
				"body": {
					"mode": "raw",
					"raw": "{\n  \"networkutils:input\": {\n    \"networkutils:links-input\": {\n      \"networkutils:xpdr-node\": \"{{switchponder_1}}\",\n      \"networkutils:xpdr-num\": \"2\",\n      \"networkutils:network-num\": \"1\",\n      \"networkutils:rdm-node\": \"{{roadm_1}}\",\n      \"networkutils:srg-num\": \"1\",\n      \"networkutils:termination-point-num\": \"SRG1-PP3-TXRX\"\n    }\n  }\n}"
				},
				"url": {
					"raw": "http://localhost:8181/restconf/operations/transportpce-networkutils:init-rdm-xpdr-links",
					"protocol": "http",
					"host": [
						"localhost"
					],
					"port": "8181",
					"path": [
						"restconf",
						"operations",
						"transportpce-networkutils:init-rdm-xpdr-links"
					]
				}
			},
			"response": []
		},
		{
			"name": "XPDR-2 to ROADM-3",
			"event": [
				{
					"listen": "test",
					"script": {
						"exec": [
							"pm.test(\"Status code should be 200\", function () {",
							"    pm.response.to.have.status(200);",
							"});"
						],
						"type": "text/javascript"
					}
				}
			],
			"request": {
				"auth": {
					"type": "basic",
					"basic": [
						{
							"key": "password",
							"value": "admin",
							"type": "string"
						},
						{
							"key": "username",
							"value": "admin",
							"type": "string"
						}
					]
				},
				"method": "POST",
				"header": [
					{
						"key": "Content-Type",
						"value": "application/json"
					},
					{
						"key": "Accept",
						"value": "application/json"
					}
				],
				"body": {
					"mode": "raw",
					"raw": "{\n  \"networkutils:input\": {\n    \"networkutils:links-input\": {\n      \"networkutils:xpdr-node\": \"{{transponder_2}}\",\n      \"networkutils:xpdr-num\": \"1\",\n      \"networkutils:network-num\": \"1\",\n      \"networkutils:rdm-node\": \"{{roadm_3}}\",\n      \"networkutils:srg-num\": \"1\",\n      \"networkutils:termination-point-num\": \"SRG1-PP1-TXRX\"\n    }\n  }\n}"
				},
				"url": {
					"raw": "http://localhost:8181/restconf/operations/transportpce-networkutils:init-xpdr-rdm-links",
					"protocol": "http",
					"host": [
						"localhost"
					],
					"port": "8181",
					"path": [
						"restconf",
						"operations",
						"transportpce-networkutils:init-xpdr-rdm-links"
					]
				}
			},
			"response": []
		},
		{
			"name": "ROADM-3 to XPDR-2",
			"event": [
				{
					"listen": "test",
					"script": {
						"exec": [
							"pm.test(\"Status code should be 200\", function () {",
							"    pm.response.to.have.status(200);",
							"});"
						],
						"type": "text/javascript"
					}
				}
			],
			"request": {
				"auth": {
					"type": "basic",
					"basic": [
						{
							"key": "password",
							"value": "admin",
							"type": "string"
						},
						{
							"key": "username",
							"value": "admin",
							"type": "string"
						}
					]
				},
				"method": "POST",
				"header": [
					{
						"key": "Content-Type",
						"value": "application/json"
					},
					{
						"key": "Accept",
						"value": "application/json"
					}
				],
				"body": {
					"mode": "raw",
					"raw": "{\n  \"networkutils:input\": {\n    \"networkutils:links-input\": {\n      \"networkutils:xpdr-node\": \"{{transponder_2}}\",\n      \"networkutils:xpdr-num\": \"1\",\n      \"networkutils:network-num\": \"1\",\n      \"networkutils:rdm-node\": \"{{roadm_3}}\",\n      \"networkutils:srg-num\": \"1\",\n      \"networkutils:termination-point-num\": \"SRG1-PP1-TXRX\"\n    }\n  }\n}"
				},
				"url": {
					"raw": "http://localhost:8181/restconf/operations/transportpce-networkutils:init-rdm-xpdr-links",
					"protocol": "http",
					"host": [
						"localhost"
					],
					"port": "8181",
					"path": [
						"restconf",
						"operations",
						"transportpce-networkutils:init-rdm-xpdr-links"
					]
				}
			},
			"response": []
		},
		{
			"name": "MUX-PONDER-2 to ROADM-3",
			"event": [
				{
					"listen": "test",
					"script": {
						"exec": [
							"pm.test(\"Status code should be 200\", function () {",
							"    pm.response.to.have.status(200);",
							"});"
						],
						"type": "text/javascript"
					}
				}
			],
			"request": {
				"auth": {
					"type": "basic",
					"basic": [
						{
							"key": "password",
							"value": "admin",
							"type": "string"
						},
						{
							"key": "username",
							"value": "admin",
							"type": "string"
						}
					]
				},
				"method": "POST",
				"header": [
					{
						"key": "Content-Type",
						"value": "application/json"
					},
					{
						"key": "Accept",
						"value": "application/json"
					}
				],
				"body": {
					"mode": "raw",
					"raw": "{\n  \"networkutils:input\": {\n    \"networkutils:links-input\": {\n      \"networkutils:xpdr-node\": \"{{switchponder_2}}\",\n      \"networkutils:xpdr-num\": \"1\",\n      \"networkutils:network-num\": \"1\",\n      \"networkutils:rdm-node\": \"{{roadm_3}}\",\n      \"networkutils:srg-num\": \"1\",\n      \"networkutils:termination-point-num\": \"SRG1-PP2-TXRX\"\n    }\n  }\n}"
				},
				"url": {
					"raw": "http://localhost:8181/restconf/operations/transportpce-networkutils:init-xpdr-rdm-links",
					"protocol": "http",
					"host": [
						"localhost"
					],
					"port": "8181",
					"path": [
						"restconf",
						"operations",
						"transportpce-networkutils:init-xpdr-rdm-links"
					]
				}
			},
			"response": []
		},
		{
			"name": "ROADM-3 to MUX-PONDER-2",
			"event": [
				{
					"listen": "test",
					"script": {
						"exec": [
							"pm.test(\"Status code should be 200\", function () {",
							"    pm.response.to.have.status(200);",
							"});"
						],
						"type": "text/javascript"
					}
				}
			],
			"request": {
				"auth": {
					"type": "basic",
					"basic": [
						{
							"key": "password",
							"value": "admin",
							"type": "string"
						},
						{
							"key": "username",
							"value": "admin",
							"type": "string"
						}
					]
				},
				"method": "POST",
				"header": [
					{
						"key": "Content-Type",
						"value": "application/json"
					},
					{
						"key": "Accept",
						"value": "application/json"
					}
				],
				"body": {
					"mode": "raw",
					"raw": "{\n  \"networkutils:input\": {\n    \"networkutils:links-input\": {\n      \"networkutils:xpdr-node\": \"{{switchponder_2}}\",\n      \"networkutils:xpdr-num\": \"1\",\n      \"networkutils:network-num\": \"1\",\n      \"networkutils:rdm-node\": \"{{roadm_3}}\",\n      \"networkutils:srg-num\": \"1\",\n      \"networkutils:termination-point-num\": \"SRG1-PP2-TXRX\"\n    }\n  }\n}"
				},
				"url": {
					"raw": "http://localhost:8181/restconf/operations/transportpce-networkutils:init-rdm-xpdr-links",
					"protocol": "http",
					"host": [
						"localhost"
					],
					"port": "8181",
					"path": [
						"restconf",
						"operations",
						"transportpce-networkutils:init-rdm-xpdr-links"
					]
				}
			},
			"response": []
		},
		{
			"name": "SWITCH-PONDER to ROADM-3",
			"event": [
				{
					"listen": "test",
					"script": {
						"exec": [
							"pm.test(\"Status code should be 200\", function () {",
							"    pm.response.to.have.status(200);",
							"});"
						],
						"type": "text/javascript"
					}
				}
			],
			"request": {
				"auth": {
					"type": "basic",
					"basic": [
						{
							"key": "password",
							"value": "admin",
							"type": "string"
						},
						{
							"key": "username",
							"value": "admin",
							"type": "string"
						}
					]
				},
				"method": "POST",
				"header": [
					{
						"key": "Content-Type",
						"value": "application/json"
					},
					{
						"key": "Accept",
						"value": "application/json"
					}
				],
				"body": {
					"mode": "raw",
					"raw": "{\n  \"networkutils:input\": {\n    \"networkutils:links-input\": {\n      \"networkutils:xpdr-node\": \"{{switchponder_2}}\",\n      \"networkutils:xpdr-num\": \"2\",\n      \"networkutils:network-num\": \"1\",\n      \"networkutils:rdm-node\": \"{{roadm_3}}\",\n      \"networkutils:srg-num\": \"1\",\n      \"networkutils:termination-point-num\": \"SRG1-PP3-TXRX\"\n    }\n  }\n}"
				},
				"url": {
					"raw": "http://localhost:8181/restconf/operations/transportpce-networkutils:init-xpdr-rdm-links",
					"protocol": "http",
					"host": [
						"localhost"
					],
					"port": "8181",
					"path": [
						"restconf",
						"operations",
						"transportpce-networkutils:init-xpdr-rdm-links"
					]
				}
			},
			"response": []
		},
		{
			"name": "ROADM-3  to SWITCH-PONDER-2",
			"event": [
				{
					"listen": "test",
					"script": {
						"exec": [
							"pm.test(\"Status code should be 200\", function () {",
							"    pm.response.to.have.status(200);",
							"});"
						],
						"type": "text/javascript"
					}
				}
			],
			"request": {
				"auth": {
					"type": "basic",
					"basic": [
						{
							"key": "password",
							"value": "admin",
							"type": "string"
						},
						{
							"key": "username",
							"value": "admin",
							"type": "string"
						}
					]
				},
				"method": "POST",
				"header": [
					{
						"key": "Content-Type",
						"value": "application/json"
					},
					{
						"key": "Accept",
						"value": "application/json"
					}
				],
				"body": {
					"mode": "raw",
					"raw": "{\n  \"networkutils:input\": {\n    \"networkutils:links-input\": {\n      \"networkutils:xpdr-node\": \"{{switchponder_2}}\",\n      \"networkutils:xpdr-num\": \"2\",\n      \"networkutils:network-num\": \"1\",\n      \"networkutils:rdm-node\": \"{{roadm_3}}\",\n      \"networkutils:srg-num\": \"1\",\n      \"networkutils:termination-point-num\": \"SRG1-PP3-TXRX\"\n    }\n  }\n}"
				},
				"url": {
					"raw": "http://localhost:8181/restconf/operations/transportpce-networkutils:init-rdm-xpdr-links",
					"protocol": "http",
					"host": [
						"localhost"
					],
					"port": "8181",
					"path": [
						"restconf",
						"operations",
						"transportpce-networkutils:init-rdm-xpdr-links"
					]
				}
			},
			"response": []
		},
		{
			"name": "add oms attributes ROADM-1-ROADM-3",
			"event": [
				{
					"listen": "test",
					"script": {
						"exec": [
							"pm.test(\"Status code should be 200 or 201\", function () {",
							"     pm.expect(pm.response.code).to.be.oneOf([200,201]);",
							"});"
						],
						"type": "text/javascript"
					}
				}
			],
			"request": {
				"method": "PUT",
				"header": [
					{
						"key": "Accept",
						"value": "application/json"
					},
					{
						"key": "Authorization",
						"value": "Basic YWRtaW46YWRtaW4="
					},
					{
						"key": "Content-Type",
						"value": "application/json"
					}
				],
				"body": {
					"mode": "raw",
					"raw": "{\"span\": \n\t{\n    \"auto-spanloss\": \"true\",\n    \"spanloss-base\": 11.4,\n    \"spanloss-current\": 12,\n    \"engineered-spanloss\": 12.2,\n    \"link-concatenation\": [{\n        \"SRLG-Id\": 0,\n        \"fiber-type\": \"smf\",\n        \"SRLG-length\": 100000,\n        \"pmd\": 0.5}]\n    }\n}"
				},
				"url": {
					"raw": "http://127.0.0.1:8181/restconf/config/ietf-network:networks/network/openroadm-topology/ietf-network-topology:link/{{roadm_1}}-DEG2-DEG2-TTP-TXRXto{{roadm_3}}-DEG1-DEG1-TTP-TXRX/org-openroadm-network-topology:OMS-attributes/span",
					"protocol": "http",
					"host": [
						"127",
						"0",
						"0",
						"1"
					],
					"port": "8181",
					"path": [
						"restconf",
						"config",
						"ietf-network:networks",
						"network",
						"openroadm-topology",
						"ietf-network-topology:link",
						"{{roadm_1}}-DEG2-DEG2-TTP-TXRXto{{roadm_3}}-DEG1-DEG1-TTP-TXRX",
						"org-openroadm-network-topology:OMS-attributes",
						"span"
					]
				}
			},
			"response": []
		},
		{
			"name": "add oms attributes ROADM-3-ROADM-1",
			"event": [
				{
					"listen": "test",
					"script": {
						"exec": [
							"pm.test(\"Status code should be 200 or 201\", function () {",
							"     pm.expect(pm.response.code).to.be.oneOf([200,201]);",
							"});"
						],
						"type": "text/javascript"
					}
				}
			],
			"request": {
				"method": "PUT",
				"header": [
					{
						"key": "Accept",
						"value": "application/json"
					},
					{
						"key": "Authorization",
						"value": "Basic YWRtaW46YWRtaW4="
					},
					{
						"key": "Content-Type",
						"value": "application/json"
					}
				],
				"body": {
					"mode": "raw",
					"raw": "{\"span\": \n\t{\n    \"auto-spanloss\": \"true\",\n    \"spanloss-base\": 11.4,\n    \"spanloss-current\": 12,\n    \"engineered-spanloss\": 12.2,\n    \"link-concatenation\": [{\n        \"SRLG-Id\": 0,\n        \"fiber-type\": \"smf\",\n        \"SRLG-length\": 100000,\n        \"pmd\": 0.5}]\n    }\n}"
				},
				"url": {
					"raw": "http://127.0.0.1:8181/restconf/config/ietf-network:networks/network/openroadm-topology/ietf-network-topology:link/{{roadm_3}}-DEG1-DEG1-TTP-TXRXto{{roadm_1}}-DEG2-DEG2-TTP-TXRX/org-openroadm-network-topology:OMS-attributes/span",
					"protocol": "http",
					"host": [
						"127",
						"0",
						"0",
						"1"
					],
					"port": "8181",
					"path": [
						"restconf",
						"config",
						"ietf-network:networks",
						"network",
						"openroadm-topology",
						"ietf-network-topology:link",
						"{{roadm_3}}-DEG1-DEG1-TTP-TXRXto{{roadm_1}}-DEG2-DEG2-TTP-TXRX",
						"org-openroadm-network-topology:OMS-attributes",
						"span"
					]
				}
			},
			"response": []
		}
	],
	"event": [
		{
			"listen": "prerequest",
			"script": {
				"type": "text/javascript",
				"exec": [
					""
				]
			}
		},
		{
			"listen": "test",
			"script": {
				"type": "text/javascript",
				"exec": [
					""
				]
			}
		}
	],
	"variable": [
		{
			"key": "transponder_1",
			"value": "XPDR-A1"
		},
		{
			"key": "transponder_2",
			"value": "XPDR-C1"
		},
		{
			"key": "roadm_1",
			"value": "ROADM-A1"
		},
		{
			"key": "roadm_2",
			"value": "ROADM-B1"
		},
		{
			"key": "roadm_3",
			"value": "ROADM-C1"
		},
		{
			"key": "switchponder_1",
			"value": "SPDR-SA1"
		},
		{
			"key": "switchponder_2",
			"value": "SPDR-SC1"
		}
	]
}
