<?xml version="1.0" encoding="UTF-8" standalone="no"?>
<!-- Created with Inkscape (http://www.inkscape.org/) -->

<svg
   xmlns:dc="http://purl.org/dc/elements/1.1/"
   xmlns:cc="http://creativecommons.org/ns#"
   xmlns:rdf="http://www.w3.org/1999/02/22-rdf-syntax-ns#"
   xmlns:svg="http://www.w3.org/2000/svg"
   xmlns="http://www.w3.org/2000/svg"
   xmlns:sodipodi="http://sodipodi.sourceforge.net/DTD/sodipodi-0.dtd"
   xmlns:inkscape="http://www.inkscape.org/namespaces/inkscape"
   width="199.67868mm"
   height="98.248566mm"
   viewBox="0 0 199.67868 98.248566"
   version="1.1"
   id="svg8"
   inkscape:version="0.92.5 (2060ec1f9f, 2020-04-08)"
   sodipodi:docname="switch-network.svg">
  <defs
     id="defs2" />
  <sodipodi:namedview
     id="base"
     pagecolor="#ffffff"
     bordercolor="#666666"
     borderopacity="1.0"
     inkscape:pageopacity="0.0"
     inkscape:pageshadow="2"
     inkscape:zoom="0.7"
     inkscape:cx="-21.752165"
     inkscape:cy="-138.38139"
     inkscape:document-units="mm"
     inkscape:current-layer="layer1"
     showgrid="false"
     inkscape:snap-global="false"
     inkscape:window-width="1920"
     inkscape:window-height="1015"
     inkscape:window-x="0"
     inkscape:window-y="0"
     inkscape:window-maximized="1"
     fit-margin-top="2"
     fit-margin-left="2"
     fit-margin-bottom="2"
     fit-margin-right="2" />
  <metadata
     id="metadata5">
    <rdf:RDF>
      <cc:Work
         rdf:about="">
        <dc:format>image/svg+xml</dc:format>
        <dc:type
           rdf:resource="http://purl.org/dc/dcmitype/StillImage" />
        <dc:title></dc:title>
      </cc:Work>
    </rdf:RDF>
  </metadata>
  <g
     inkscape:label="Calque 1"
     inkscape:groupmode="layer"
     id="layer1"
     transform="translate(-12.230598,-13.218758)">
    <g
       id="g1018"
       transform="translate(0,-6.8035714)">
      <ellipse
         ry="14.930059"
         rx="26.458332"
         cy="79.096718"
         cx="57.83036"
         id="path815"
         style="fill:#afdde9;stroke-width:2.74055529;stroke-miterlimit:4;stroke-dasharray:none" />
      <text
         id="text819"
         y="80.852493"
         x="37.805676"
         style="font-style:normal;font-variant:normal;font-weight:normal;font-stretch:normal;font-size:4.93888903px;line-height:1.25;font-family:sans-serif;-inkscape-font-specification:'sans-serif, Normal';font-variant-ligatures:normal;font-variant-caps:normal;font-variant-numeric:normal;font-feature-settings:normal;text-align:start;letter-spacing:0px;word-spacing:0px;writing-mode:lr-tb;text-anchor:start;fill:#000000;fill-opacity:1;stroke:none;stroke-width:0.26458332"
         xml:space="preserve"><tspan
           style="font-style:normal;font-variant:normal;font-weight:normal;font-stretch:normal;font-size:4.93888903px;font-family:sans-serif;-inkscape-font-specification:'sans-serif, Normal';font-variant-ligatures:normal;font-variant-caps:normal;font-variant-numeric:normal;font-feature-settings:normal;text-align:start;writing-mode:lr-tb;text-anchor:start;stroke-width:0.26458332"
           y="80.852493"
           x="37.805676"
           id="tspan817"
           sodipodi:role="line">192.168.133.0/24</tspan></text>
    </g>
    <g
       id="g954"
       transform="translate(39.309524,0.75595238)">
      <rect
         ry="2.0000012"
         rx="2.0000012"
         y="28.258928"
         x="24.190477"
         height="21.544643"
         width="24.190477"
         id="rect821"
         style="fill:#ffeeaa;stroke:#000000;stroke-width:0.26499999;stroke-miterlimit:4;stroke-dasharray:none" />
      <text
         id="text851"
         y="40.542549"
         x="31.96137"
         style="font-style:normal;font-weight:normal;font-size:10.58333302px;line-height:1.25;font-family:sans-serif;letter-spacing:0px;word-spacing:0px;fill:#000000;fill-opacity:1;stroke:none;stroke-width:0.26458332"
         xml:space="preserve"><tspan
           style="font-size:4.23333311px;stroke-width:0.26458332"
           y="40.542549"
           x="31.96137"
           id="tspan849"
           sodipodi:role="line">LCM</tspan></text>
    </g>
    <g
       id="g959"
       transform="translate(-10.205357,-20.78869)">
      <rect
         ry="2.0000012"
         rx="2.0000012"
         y="108.57887"
         x="24.946428"
         height="21.544643"
         width="24.190477"
         id="rect821-7"
         style="fill:#ffeeaa;stroke:#000000;stroke-width:0.26499999;stroke-miterlimit:4;stroke-dasharray:none" />
      <text
         id="text859"
         y="121.14648"
         x="28.976477"
         style="font-style:normal;font-weight:normal;font-size:4.93888903px;line-height:1.25;font-family:sans-serif;letter-spacing:0px;word-spacing:0px;fill:#000000;fill-opacity:1;stroke:none;stroke-width:0.26458332"
         xml:space="preserve"><tspan
           style="font-size:4.93888903px;stroke-width:0.26458332"
           y="121.14648"
           x="28.976477"
           id="tspan857"
           sodipodi:role="line">service</tspan></text>
    </g>
    <g
       id="g949"
       transform="translate(-79.752976,13.985114)">
      <rect
         ry="2.0000012"
         rx="2.0000012"
         y="20.510416"
         x="94.116074"
         height="21.544643"
         width="24.190477"
         id="rect821-76"
         style="fill:#ffeeaa;stroke:#000000;stroke-width:0.26499999;stroke-miterlimit:4;stroke-dasharray:none" />
      <text
         id="text855"
         y="33.134823"
         x="98.323921"
         style="font-style:normal;font-weight:normal;font-size:10.58333302px;line-height:1.25;font-family:sans-serif;letter-spacing:0px;word-spacing:0px;fill:#000000;fill-opacity:1;stroke:none;stroke-width:0.26458332"
         xml:space="preserve"><tspan
           style="font-size:4.93888903px;stroke-width:0.26458332"
           y="33.134823"
           x="98.323921"
           id="tspan853"
           sodipodi:role="line">broker</tspan></text>
    </g>
    <g
       id="g1060"
       transform="translate(-1.1339286,1.889881)">
      <rect
         ry="2.0000012"
         rx="2.0000012"
         y="58.686012"
         x="186.72023"
         height="21.544643"
         width="24.190477"
         id="rect821-7-3"
         style="fill:#ffeeaa;stroke:#000000;stroke-width:0.26499999;stroke-miterlimit:4;stroke-dasharray:none" />
      <text
         id="text893"
         y="71.310417"
         x="192.46159"
         style="font-style:normal;font-variant:normal;font-weight:normal;font-stretch:normal;font-size:4.93888903px;line-height:1.25;font-family:sans-serif;-inkscape-font-specification:'sans-serif, Normal';font-variant-ligatures:normal;font-variant-caps:normal;font-variant-numeric:normal;font-feature-settings:normal;text-align:start;letter-spacing:0px;word-spacing:0px;writing-mode:lr-tb;text-anchor:start;fill:#000000;fill-opacity:1;stroke:none;stroke-width:0.26458332"
         xml:space="preserve"><tspan
           style="font-style:normal;font-variant:normal;font-weight:normal;font-stretch:normal;font-size:4.93888903px;font-family:sans-serif;-inkscape-font-specification:'sans-serif, Normal';font-variant-ligatures:normal;font-variant-caps:normal;font-variant-numeric:normal;font-feature-settings:normal;text-align:start;writing-mode:lr-tb;text-anchor:start;stroke-width:0.26458332"
           y="71.310417"
           x="192.46159"
           id="tspan891"
           sodipodi:role="line">vmok</tspan></text>
    </g>
    <g
       id="g1055"
       transform="translate(-3.4017857,1.8898809)">
      <rect
         ry="2.0000012"
         rx="2.0000012"
         y="58.686008"
         x="94.116074"
         height="21.544643"
         width="24.190477"
         id="rect821-7-3-5"
         style="fill:#ffeeaa;stroke:#000000;stroke-width:0.26499999;stroke-miterlimit:4;stroke-dasharray:none" />
      <text
         id="text901"
         y="71.310417"
         x="98.921524"
         style="font-style:normal;font-variant:normal;font-weight:normal;font-stretch:normal;font-size:4.93888903px;line-height:1.25;font-family:sans-serif;-inkscape-font-specification:'sans-serif, Normal';font-variant-ligatures:normal;font-variant-caps:normal;font-variant-numeric:normal;font-feature-settings:normal;text-align:start;letter-spacing:0px;word-spacing:0px;writing-mode:lr-tb;text-anchor:start;fill:#000000;fill-opacity:1;stroke:none;stroke-width:0.26458332"
         xml:space="preserve"><tspan
           style="font-style:normal;font-variant:normal;font-weight:normal;font-stretch:normal;font-size:4.93888903px;font-family:sans-serif;-inkscape-font-specification:'sans-serif, Normal';font-variant-ligatures:normal;font-variant-caps:normal;font-variant-numeric:normal;font-feature-settings:normal;text-align:start;writing-mode:lr-tb;text-anchor:start;stroke-width:0.26458332"
           y="71.310417"
           x="98.921524"
           id="tspan899"
           sodipodi:role="line">switch</tspan></text>
    </g>
    <g
       id="g1066"
       transform="translate(-4.1577381,3.4017857)">
      <ellipse
         ry="8.8824406"
         rx="31.561012"
         cy="55.662201"
         cx="153.08037"
         id="path815-4"
         style="fill:#afdde9;stroke-width:2.30870366;stroke-miterlimit:4;stroke-dasharray:none" />
      <text
         id="text819-8"
         y="54.417603"
         x="152.90997"
         style="font-style:normal;font-variant:normal;font-weight:normal;font-stretch:normal;font-size:4.93888903px;line-height:1.25;font-family:sans-serif;-inkscape-font-specification:'sans-serif, Normal';font-variant-ligatures:normal;font-variant-caps:normal;font-variant-numeric:normal;font-feature-settings:normal;text-align:start;letter-spacing:0px;word-spacing:0px;writing-mode:lr-tb;text-anchor:start;fill:#000000;fill-opacity:1;stroke:none;stroke-width:0.26458332"
         xml:space="preserve"><tspan
           style="font-style:normal;font-variant:normal;font-weight:normal;font-stretch:normal;font-size:4.93888903px;font-family:sans-serif;-inkscape-font-specification:'sans-serif, Normal';font-variant-ligatures:normal;font-variant-caps:normal;font-variant-numeric:normal;font-feature-settings:normal;text-align:center;writing-mode:lr-tb;text-anchor:middle;stroke-width:0.26458332"
           y="54.417603"
           x="152.90997"
           id="tspan817-89"
           sodipodi:role="line">vlan 100</tspan><tspan
           id="tspan912"
           style="font-style:normal;font-variant:normal;font-weight:normal;font-stretch:normal;font-size:4.93888903px;font-family:sans-serif;-inkscape-font-specification:'sans-serif, Normal';font-variant-ligatures:normal;font-variant-caps:normal;font-variant-numeric:normal;font-feature-settings:normal;text-align:center;writing-mode:lr-tb;text-anchor:middle;stroke-width:0.26458332"
           y="60.591213"
           x="152.90997"
           sodipodi:role="line">192.168.100.0/24</tspan></text>
    </g>
    <g
       id="g1072"
       transform="translate(-2.2678572,-3.0238096)">
      <ellipse
         ry="8.8824406"
         rx="31.561012"
         cy="84.577385"
         cx="151.19049"
         id="path815-4-3"
         style="fill:#afdde9;stroke-width:2.30870366;stroke-miterlimit:4;stroke-dasharray:none" />
      <text
         id="text819-4"
         y="83.332787"
         x="151.0201"
         style="font-style:normal;font-variant:normal;font-weight:normal;font-stretch:normal;font-size:4.93888903px;line-height:1.25;font-family:sans-serif;-inkscape-font-specification:'sans-serif, Normal';font-variant-ligatures:normal;font-variant-caps:normal;font-variant-numeric:normal;font-feature-settings:normal;text-align:start;letter-spacing:0px;word-spacing:0px;writing-mode:lr-tb;text-anchor:start;fill:#000000;fill-opacity:1;stroke:none;stroke-width:0.26458332"
         xml:space="preserve"><tspan
           style="font-style:normal;font-variant:normal;font-weight:normal;font-stretch:normal;font-size:4.93888903px;font-family:sans-serif;-inkscape-font-specification:'sans-serif, Normal';font-variant-ligatures:normal;font-variant-caps:normal;font-variant-numeric:normal;font-feature-settings:normal;text-align:center;writing-mode:lr-tb;text-anchor:middle;stroke-width:0.26458332"
           y="83.332787"
           x="151.0201"
           id="tspan817-8"
           sodipodi:role="line">vlan144</tspan><tspan
           id="tspan914"
           style="font-style:normal;font-variant:normal;font-weight:normal;font-stretch:normal;font-size:4.93888903px;font-family:sans-serif;-inkscape-font-specification:'sans-serif, Normal';font-variant-ligatures:normal;font-variant-caps:normal;font-variant-numeric:normal;font-feature-settings:normal;text-align:center;writing-mode:lr-tb;text-anchor:middle;stroke-width:0.26458332"
           y="89.506401"
           x="151.0201"
           sodipodi:role="line">192.168.144.0/24</tspan></text>
    </g>
    <g
       id="g1050"
       transform="translate(61.610119,-163.28571)">
      <ellipse
         ry="5.8586302"
         rx="14.363094"
         cy="184.3631"
         cx="83.532738"
         id="path815-46"
         style="fill:#afdde9;stroke-width:1.26487803;stroke-miterlimit:4;stroke-dasharray:none" />
      <text
         id="text819-9"
         y="186.49684"
         x="75.603294"
         style="font-style:normal;font-variant:normal;font-weight:normal;font-stretch:normal;font-size:4.93888903px;line-height:1.25;font-family:sans-serif;-inkscape-font-specification:'sans-serif, Normal';font-variant-ligatures:normal;font-variant-caps:normal;font-variant-numeric:normal;font-feature-settings:normal;text-align:start;letter-spacing:0px;word-spacing:0px;writing-mode:lr-tb;text-anchor:start;fill:#000000;fill-opacity:1;stroke:none;stroke-width:0.26458332"
         xml:space="preserve"><tspan
           style="font-style:normal;font-variant:normal;font-weight:normal;font-stretch:normal;font-size:4.93888903px;font-family:sans-serif;-inkscape-font-specification:'sans-serif, Normal';font-variant-ligatures:normal;font-variant-caps:normal;font-variant-numeric:normal;font-feature-settings:normal;text-align:start;writing-mode:lr-tb;text-anchor:start;stroke-width:0.26458332"
           y="186.49684"
           x="75.603294"
           id="tspan817-2"
           sodipodi:role="line">redfish</tspan></text>
    </g>
    <path
       style="fill:none;stroke:#000000;stroke-width:0.26458332px;stroke-linecap:butt;stroke-linejoin:miter;stroke-opacity:1"
       d="M 27.214285,34.684522 V 19.565476 H 131.53571"
       id="path1074"
       inkscape:connector-curvature="0" />
    <path
       style="fill:none;stroke:#000000;stroke-width:0.26458332px;stroke-linecap:butt;stroke-linejoin:miter;stroke-opacity:1"
       d="m 158.75,19.565476 38.17559,0.377976 0.37798,40.821428"
       id="path1076"
       inkscape:connector-curvature="0" />
    <path
       style="fill:none;stroke:#000000;stroke-width:0.26458332px;stroke-linecap:butt;stroke-linejoin:miter;stroke-opacity:1"
       d="m 76.35119,50.937498 -6.047618,8.693454"
       id="path1078"
       inkscape:connector-curvature="0" />
    <path
       style="fill:none;stroke:#000000;stroke-width:0.26458332px;stroke-linecap:butt;stroke-linejoin:miter;stroke-opacity:1"
       d="m 28.72619,55.473213 6.047619,8.315476"
       id="path1080"
       inkscape:connector-curvature="0" />
    <path
       style="fill:none;stroke:#000000;stroke-width:0.26458332px;stroke-linecap:butt;stroke-linejoin:miter;stroke-opacity:1"
       d="m 29.482142,87.601188 6.803573,-7.937499"
       id="path1082"
       inkscape:connector-curvature="0" />
    <path
       style="fill:none;stroke:#000000;stroke-width:0.26458332px;stroke-linecap:butt;stroke-linejoin:miter;stroke-opacity:1"
       d="m 84.28869,70.970237 h 6.047618"
       id="path1084"
       inkscape:connector-curvature="0" />
    <text
       xml:space="preserve"
       style="font-style:normal;font-weight:normal;font-size:10.58333302px;line-height:1.25;font-family:sans-serif;letter-spacing:0px;word-spacing:0px;fill:#000000;fill-opacity:1;stroke:none;stroke-width:0.26458332"
       x="75.217262"
       y="57.363087"
       id="text1088"><tspan
         sodipodi:role="line"
         id="tspan1086"
         x="75.217262"
         y="57.363087"
         style="font-style:normal;font-variant:normal;font-weight:normal;font-stretch:normal;font-size:4.23333311px;font-family:sans-serif;-inkscape-font-specification:'sans-serif, Normal';font-variant-ligatures:normal;font-variant-caps:normal;font-variant-numeric:normal;font-feature-settings:normal;text-align:start;writing-mode:lr-tb;text-anchor:start;stroke-width:0.26458332">.10</tspan></text>
    <text
       xml:space="preserve"
       style="font-style:normal;font-weight:normal;font-size:10.58333302px;line-height:1.25;font-family:sans-serif;letter-spacing:0px;word-spacing:0px;fill:#000000;fill-opacity:1;stroke:none;stroke-width:0.26458332"
       x="22.287001"
       y="61.513874"
       id="text1088-2"><tspan
         sodipodi:role="line"
         id="tspan1086-4"
         x="22.287001"
         y="61.513874"
         style="font-style:normal;font-variant:normal;font-weight:normal;font-stretch:normal;font-size:4.23333311px;font-family:sans-serif;-inkscape-font-specification:'sans-serif, Normal';font-variant-ligatures:normal;font-variant-caps:normal;font-variant-numeric:normal;font-feature-settings:normal;text-align:start;writing-mode:lr-tb;text-anchor:start;stroke-width:0.26458332">.14</tspan></text>
    <text
       xml:space="preserve"
       style="font-style:normal;font-weight:normal;font-size:10.58333302px;line-height:1.25;font-family:sans-serif;letter-spacing:0px;word-spacing:0px;fill:#000000;fill-opacity:1;stroke:none;stroke-width:0.26458332"
       x="85.409019"
       y="69.073402"
       id="text1088-7"><tspan
         sodipodi:role="line"
         id="tspan1086-7"
         x="85.409019"
         y="69.073402"
         style="font-style:normal;font-variant:normal;font-weight:normal;font-stretch:normal;font-size:4.23333311px;font-family:sans-serif;-inkscape-font-specification:'sans-serif, Normal';font-variant-ligatures:normal;font-variant-caps:normal;font-variant-numeric:normal;font-feature-settings:normal;text-align:start;writing-mode:lr-tb;text-anchor:start;stroke-width:0.26458332">.2</tspan></text>
    <text
       xml:space="preserve"
       style="font-style:normal;font-weight:normal;font-size:10.58333302px;line-height:1.25;font-family:sans-serif;letter-spacing:0px;word-spacing:0px;fill:#000000;fill-opacity:1;stroke:none;stroke-width:0.26458332"
       x="23.04294"
       y="84.570435"
       id="text1088-5"><tspan
         sodipodi:role="line"
         id="tspan1086-48"
         x="23.04294"
         y="84.570435"
         style="font-style:normal;font-variant:normal;font-weight:normal;font-stretch:normal;font-size:4.23333311px;font-family:sans-serif;-inkscape-font-specification:'sans-serif, Normal';font-variant-ligatures:normal;font-variant-caps:normal;font-variant-numeric:normal;font-feature-settings:normal;text-align:start;writing-mode:lr-tb;text-anchor:start;stroke-width:0.26458332">.12</tspan></text>
    <text
       xml:space="preserve"
       style="font-style:normal;font-weight:normal;font-size:10.58333302px;line-height:1.25;font-family:sans-serif;letter-spacing:0px;word-spacing:0px;fill:#000000;fill-opacity:1;stroke:none;stroke-width:0.26458332"
       x="114.13521"
       y="56.600185"
       id="text1088-1"><tspan
         sodipodi:role="line"
         id="tspan1086-2"
         x="114.13521"
         y="56.600185"
         style="font-style:normal;font-variant:normal;font-weight:normal;font-stretch:normal;font-size:4.23333311px;font-family:sans-serif;-inkscape-font-specification:'sans-serif, Normal';font-variant-ligatures:normal;font-variant-caps:normal;font-variant-numeric:normal;font-feature-settings:normal;text-align:start;writing-mode:lr-tb;text-anchor:start;stroke-width:0.26458332">.1</tspan></text>
    <text
       xml:space="preserve"
       style="font-style:normal;font-weight:normal;font-size:10.58333302px;line-height:1.25;font-family:sans-serif;letter-spacing:0px;word-spacing:0px;fill:#000000;fill-opacity:1;stroke:none;stroke-width:0.26458332"
       x="114.18963"
       y="56.95488"
       id="text1088-1-8"><tspan
         sodipodi:role="line"
         id="tspan1086-2-9"
         x="114.18963"
         y="56.95488"
         style="font-style:normal;font-variant:normal;font-weight:normal;font-stretch:normal;font-size:4.23333311px;font-family:sans-serif;-inkscape-font-specification:'sans-serif, Normal';font-variant-ligatures:normal;font-variant-caps:normal;font-variant-numeric:normal;font-feature-settings:normal;text-align:start;writing-mode:lr-tb;text-anchor:start;stroke-width:0.26458332">.1</tspan></text>
    <text
       xml:space="preserve"
       style="font-style:normal;font-weight:normal;font-size:10.58333302px;line-height:1.25;font-family:sans-serif;letter-spacing:0px;word-spacing:0px;fill:#000000;fill-opacity:1;stroke:none;stroke-width:0.26458332"
       x="116.83546"
       y="87.570953"
       id="text1088-1-3"><tspan
         sodipodi:role="line"
         id="tspan1086-2-6"
         x="116.83546"
         y="87.570953"
         style="font-style:normal;font-variant:normal;font-weight:normal;font-stretch:normal;font-size:4.23333311px;font-family:sans-serif;-inkscape-font-specification:'sans-serif, Normal';font-variant-ligatures:normal;font-variant-caps:normal;font-variant-numeric:normal;font-feature-settings:normal;text-align:start;writing-mode:lr-tb;text-anchor:start;stroke-width:0.26458332">.1</tspan></text>
    <path
       style="fill:none;stroke:#000000;stroke-width:0.26458332px;stroke-linecap:butt;stroke-linejoin:miter;stroke-opacity:1"
       d="m 114.90476,70.214285 70.68155,0.377976"
       id="path1158"
       inkscape:connector-curvature="0" />
    <rect
       style="fill:#ffb380;stroke:#000000;stroke-width:0.26499999;stroke-miterlimit:4;stroke-dasharray:none"
       id="rect1168"
       width="9.8273811"
       height="4.9136906"
       x="192.01201"
       y="61.105061"
       rx="2.0000012"
       ry="2.0000012" />
    <text
       xml:space="preserve"
       style="font-style:normal;font-weight:normal;font-size:10.58333302px;line-height:1.25;font-family:sans-serif;letter-spacing:0px;word-spacing:0px;fill:#000000;fill-opacity:1;stroke:none;stroke-width:0.26458332"
       x="193.18665"
       y="64.892387"
       id="text1088-1-80"><tspan
         sodipodi:role="line"
         id="tspan1086-2-2"
         x="193.18665"
         y="64.892387"
         style="font-style:normal;font-variant:normal;font-weight:normal;font-stretch:normal;font-size:4.23333311px;font-family:sans-serif;-inkscape-font-specification:'sans-serif, Normal';font-variant-ligatures:normal;font-variant-caps:normal;font-variant-numeric:normal;font-feature-settings:normal;text-align:start;writing-mode:lr-tb;text-anchor:start;stroke-width:0.26458332">bmc</tspan></text>
  </g>
</svg>
