{
  "name": "ic-reinforced-walls",
  "version": "1.1.3",
  "title": "IndustrialCraft - Reinforced Walls",
  "author": "mimic",
  "description": "Add 4 new walls including gates that will withstand even the strongest enemies.",
  "factorio_version": "2.0",
  "dependencies": [
    "base >= 2.0"
  ]
}