{
	"name": "ic-better-logistic-containers",
	"version": "1.0.9",
	"title": "IndustrialCraft - Better Logistic Containers",
	"author": "mimic",
	"description": "Modifies logistics chests to allow them to teleport items by their own ID. In short, you can set the source and destination IDs of the chest. Items are instantly teleported across entire stacks across all universes.",
	"factorio_version": "2.0",
	"dependencies": [
		"base >= 2.0",
		"? space-age >= 2.0"
  ]
}
