<?xml version="1.0" encoding="UTF-8" standalone="no"?>
<svg
   id="eingklappt_new_Kopie"
   data-name="eingklappt new Kopie"
   viewBox="0 0 516.91998 192.28003"
   version="1.1"
   sodipodi:docname="kultura_floating_b.svg"
   inkscape:version="1.2.1 (9c6d41e, 2022-07-14)"
   width="516.91998"
   height="192.28003"
   xmlns:inkscape="http://www.inkscape.org/namespaces/inkscape"
   xmlns:sodipodi="http://sodipodi.sourceforge.net/DTD/sodipodi-0.dtd"
   xmlns="http://www.w3.org/2000/svg"
   xmlns:svg="http://www.w3.org/2000/svg">
  <sodipodi:namedview
     id="namedview2179"
     pagecolor="#505050"
     bordercolor="#eeeeee"
     borderopacity="1"
     inkscape:showpageshadow="0"
     inkscape:pageopacity="0"
     inkscape:pagecheckerboard="0"
     inkscape:deskcolor="#505050"
     showgrid="false"
     inkscape:zoom="0.28708367"
     inkscape:cx="768.06877"
     inkscape:cy="411.03"
     inkscape:window-width="1728"
     inkscape:window-height="1080"
     inkscape:window-x="0"
     inkscape:window-y="37"
     inkscape:window-maximized="0"
     inkscape:current-layer="layer2" />
  <defs
     id="defs2138">
    <style
       id="style2136">.cls-1{fill:#b72720;}.cls-2{fill:#c9491c;}.cls-3{fill:#166b7f;}.cls-4{fill:#00a59d;}.cls-5{fill:#0e858e;}.cls-6{fill:#a8162b;}.cls-7{fill:#1fb59f;}.cls-8{fill:#8e113b;}.cls-9{fill:#00898c;}.cls-10{fill:#d18b3f;}</style>
  </defs>
  <g
     inkscape:groupmode="layer"
     id="layer1"
     inkscape:label="Layer 1"
     style="display:none">
    <g
       id="g3405"
       transform="translate(-50.799999,-114.01)">
      <rect
         class="cls-3"
         x="432.69"
         y="154.53999"
         width="58.830002"
         height="36.790001"
         transform="rotate(180,462.11,172.935)"
         id="rect2146" />
      <rect
         class="cls-4"
         x="469.48001"
         y="191.33"
         width="58.830002"
         height="36.790001"
         transform="rotate(180,498.895,209.72)"
         id="rect2148" />
      <rect
         class="cls-5"
         x="204.61"
         y="156.75999"
         width="22.379999"
         height="14.34"
         id="rect2150" />
      <rect
         class="cls-3"
         x="305.63"
         y="158.94"
         width="58.830002"
         height="36.790001"
         transform="rotate(90,335.045,177.335)"
         id="rect2152" />
      <rect
         class="cls-7"
         x="772.67999"
         y="184.16"
         width="22.379999"
         height="14.34"
         transform="rotate(-90,783.87,191.33)"
         id="rect2158" />
      <rect
         class="cls-9"
         x="50.799999"
         y="173.55"
         width="22.379999"
         height="14.34"
         id="rect2164" />
      <rect
         class="cls-5"
         x="498.84"
         y="114.01"
         width="58.830002"
         height="36.790001"
         transform="rotate(180,528.255,132.405)"
         id="rect2168" />
      <rect
         class="cls-3"
         x="528.31"
         y="176.92"
         width="22.379999"
         height="36.790001"
         transform="rotate(180,539.505,195.31)"
         id="rect2176" />
    </g>
  </g>
  <g
     inkscape:groupmode="layer"
     id="layer2"
     inkscape:label="Layer 2"
     style="display:inline">
    <g
       id="g3395"
       transform="translate(-1008.68,-63.510027)">
      <rect
         class="cls-1"
         x="1503.22"
         y="85.550003"
         width="22.379999"
         height="36.790001"
         id="rect2140" />
      <rect
         class="cls-2"
         x="1473.5601"
         y="66.970001"
         width="22.379999"
         height="36.939999"
         transform="rotate(90,1484.75,85.44)"
         id="rect2142" />
      <rect
         class="cls-2"
         x="1347.4301"
         y="237.33"
         width="22.379999"
         height="14.54"
         transform="rotate(90,1358.625,244.605)"
         id="rect2144" />
      <rect
         class="cls-1"
         x="1377.12"
         y="193.5"
         width="58.830002"
         height="36.790001"
         transform="rotate(90,1406.53,211.89)"
         id="rect2154" />
      <rect
         class="cls-6"
         x="1307.28"
         y="177.53999"
         width="22.379999"
         height="36.950001"
         transform="rotate(-90,1318.465,196.015)"
         id="rect2156" />
      <rect
         class="cls-10"
         x="1004.67"
         y="191.37"
         width="22.379999"
         height="14.34"
         transform="rotate(90,1015.855,198.535)"
         id="rect2166" />
      <rect
         class="cls-2"
         x="1255.23"
         y="171.28999"
         width="22.379999"
         height="14.34"
         id="rect2172" />
      <rect
         class="cls-1"
         x="1097.47"
         y="74.529999"
         width="58.830002"
         height="36.790001"
         transform="rotate(-90,1126.885,92.925)"
         id="rect2174" />
    </g>
  </g>
</svg>
