<?xml version="1.0" encoding="UTF-8" standalone="no"?>
<!-- Created with Inkscape (http://www.inkscape.org/) -->

<svg
   width="501.59"
   height="109.46"
   viewBox="0 0 132.71236 28.961292"
   version="1.1"
   id="svg220"
   inkscape:version="1.2.1 (9c6d41e, 2022-07-14)"
   sodipodi:docname="logo-white.svg"
   xmlns:inkscape="http://www.inkscape.org/namespaces/inkscape"
   xmlns:sodipodi="http://sodipodi.sourceforge.net/DTD/sodipodi-0.dtd"
   xmlns="http://www.w3.org/2000/svg"
   xmlns:svg="http://www.w3.org/2000/svg">
  <sodipodi:namedview
     id="namedview222"
     pagecolor="#505050"
     bordercolor="#eeeeee"
     borderopacity="1"
     inkscape:showpageshadow="0"
     inkscape:pageopacity="0"
     inkscape:pagecheckerboard="0"
     inkscape:deskcolor="#505050"
     inkscape:document-units="mm"
     showgrid="false"
     inkscape:zoom="0.89541921"
     inkscape:cx="230.05984"
     inkscape:cy="81.52606"
     inkscape:window-width="1728"
     inkscape:window-height="1052"
     inkscape:window-x="0"
     inkscape:window-y="65"
     inkscape:window-maximized="0"
     inkscape:current-layer="layer1" />
  <defs
     id="defs217" />
  <g
     inkscape:label="Layer 1"
     inkscape:groupmode="layer"
     id="layer1">
    <g
       id="g38"
       transform="matrix(0.26458333,0,0,0.26458333,-13.745104,-149.22235)">
      <path
         class="cls-1"
         d="M 67.91,608.64 108.3,567 h 20.98 l -47.12,47.28 47.44,57.14 h -21.29 l -37.26,-46.34 -3.13,3.13 v 43.21 H 51.95 V 567 h 15.97 v 41.64 z"
         id="path24"
         style="fill:#ffffff" />
      <path
         class="cls-1"
         d="m 204.82,567 v 89.39 h 30.68 v 15.03 H 189.31 V 567 h 15.5 z"
         id="path26"
         style="fill:#ffffff" />
      <path
         class="cls-1"
         d="m 370.73,567 c 12.68,0 20.82,1.57 27.55,6.11 11.43,7.67 12.37,20.04 12.37,24.58 0,15.03 -9.24,25.99 -23.17,29.12 l 32.56,44.62 h -19.26 l -29.9,-42.74 h -2.82 V 671.9 H 352.09 V 567.01 h 18.63 z m -2.66,47.91 h 5.01 c 4.39,0 22.23,-0.47 22.23,-17.06 0,-14.72 -13.93,-16.13 -21.76,-16.13 h -5.48 z"
         id="path28"
         style="fill:#ffffff" />
      <path
         class="cls-1"
         d="m 474.67,646.94 h -43.38 l -11.11,24.5 h -16.74 l 50.53,-107.45 48.1,107.45 h -16.74 l -10.65,-24.5 z m -6.24,-14.61 -15.07,-34.4 -15.68,34.4 h 30.74 z"
         id="path30"
         style="fill:#ffffff" />
      <path
         class="cls-1"
         d="m 501.1,615.27 h 18.85 v -18.85 h 14.74 v 18.85 h 18.85 v 13.53 h -18.85 v 18.85 H 519.95 V 628.8 H 501.1 Z"
         id="path32"
         style="fill:#ffffff" />
      <path
         class="cls-1"
         d="m 176.62,655.17 c -3.35,2.12 -7.51,3.57 -12.25,3.57 -9.24,0 -16.28,-5.48 -19.41,-10.8 -3.13,-5.48 -3.29,-12.37 -3.29,-18 V 567 H 125.7 v 67.16 c 0,8.3 1.73,18.32 9.71,27.08 5.48,5.95 14.72,12.21 28.97,12.21 4.59,0 8.65,-0.66 12.25,-1.74 v -16.54 z"
         id="path34"
         style="fill:#ffffff" />
      <path
         class="cls-1"
         d="m 326.91,658.74 c -9.24,0 -16.28,-5.48 -19.41,-10.8 -3.13,-5.48 -3.29,-12.37 -3.29,-18 V 567 h -79.88 v 15.03 h 23.95 v 89.39 h 15.97 v -89.39 h 23.99 v 52.13 c 0,8.3 1.73,18.32 9.71,27.08 5.48,5.95 14.72,12.21 28.97,12.21 4.7,0 8.84,-0.69 12.49,-1.82 V 655 c -3.39,2.21 -7.64,3.73 -12.49,3.73 z"
         id="path36"
         style="fill:#ffffff" />
    </g>
  </g>
</svg>
