﻿Purpose,CP-RC Link,Conservation Practice Asset (from CP-RC Link)
"Alley Cropping - Plant trees and/or shrubs in row(s) with agronomic, horticultural crops or forages growing in the alleys.","1,2,3,4,5,6,7,8,9,10,11,12,13,14,15,16,17,18,19","Alley Cropping,Alley Cropping,Alley Cropping,Alley Cropping,Alley Cropping,Alley Cropping,Alley Cropping,Alley Cropping,Alley Cropping,Alley Cropping,Alley Cropping,Alley Cropping,Alley Cropping,Alley Cropping,Alley Cropping,Alley Cropping,Alley Cropping,Alley Cropping,Alley Cropping"
"Waste Storage Facility - Make an agricultural waste storage impoundment or containment by constructing an embankment, excavating a pit or dugout, or by fabricating a structure.","20,21,22,23","Waste Storage Facility,Waste Storage Facility,Waste Storage Facility,Waste Storage Facility"
"Dry Climate Waste Storage Facility - Make an agricultural waste storage impoundment or containment by constructing an embankment, excavating a pit or dugout, or by fabricating a structure.","24,25,26,27,28,29","Waste Storage Facility,Waste Storage Facility,Waste Storage Facility,Waste Storage Facility,Waste Storage Facility,Waste Storage Facility"
"Brush Management - Remove woody (nonherbaceous or succulent) vegetation including invasive and noxious species using mechanical, chemical and biological methods; either alone or in combination. Brush management will be applied in a manner to achieve the desired control of the target woody species and protection of desired species.","30,31,32,33,34,35","Brush Management,Brush Management,Brush Management,Brush Management,Brush Management,Brush Management"
"Compost Facility - Construct a structure or install a device to contain and facilitate an aerobic microbial ecosystem for the decomposition of manure, other organic material, or both, into a final product sufficiently stable for storage, onfarm use, and application to land as a soil amendment.",36,Composting Facility
Irrigation canal or lateral construction or relocation - Construct a permanent channel to convey irrigation water from the source of supply to one or more irrigated areas with efficient distribution,"37,38,39","Irrigation Canal or Lateral,Irrigation Canal or Lateral,Irrigation Canal or Lateral"
Deep Till - Perform tillage operations below the normal tillage depth to modify adverse physical or chemical properties of the soil which inhibit plant growth.,"40,41,42,43,44","Deep Tillage,Deep Tillage,Deep Tillage,Deep Tillage,Deep Tillage"
"Clear and Snag - Remove vegetation along the bank (clearing) and selectively remove snags, drifts, or other obstructions (snagging) from natural or improved channels and streams.","45,46","Clearing and Snagging,Clearing and Snagging"
CRP Re-enrollment - Maintain existing permanent conservation cover to meet the planned CRP objectives.,"47,48,49,50","Conservation Cover,Conservation Cover,Conservation Cover,Conservation Cover"
"General Cover - Establish and/or maintain permanent vegetation to reduce wind and water erosion, delivery of sediment to surface water, to reduce particulate matter and precursors, and reduce greenhouse gases.","51,52,53,54,55,56,57,58,59,60,61,62,63,64,65,66,67,68,69,70,71,72,73,74,75,76,77","Conservation Cover,Conservation Cover,Conservation Cover,Conservation Cover,Conservation Cover,Conservation Cover,Conservation Cover,Conservation Cover,Conservation Cover,Conservation Cover,Conservation Cover,Conservation Cover,Conservation Cover,Conservation Cover,Conservation Cover,Conservation Cover,Conservation Cover,Conservation Cover,Conservation Cover,Conservation Cover,Conservation Cover,Conservation Cover,Conservation Cover,Conservation Cover,Conservation Cover,Conservation Cover,Conservation Cover"
Wildlife Cover - Establish and/or maintain permanent vegetation to benefit wildlife species of concern.,"78,79,80,81,82,83,84,85,86,87,88,89,90,91,92,93,94,95,96,97,98","Conservation Cover,Conservation Cover,Conservation Cover,Conservation Cover,Conservation Cover,Conservation Cover,Conservation Cover,Conservation Cover,Conservation Cover,Conservation Cover,Conservation Cover,Conservation Cover,Conservation Cover,Conservation Cover,Conservation Cover,Conservation Cover,Conservation Cover,Conservation Cover,Conservation Cover,Conservation Cover,Conservation Cover"
"Crop Rotation - Plan a sequence of crops grown on the same ground over a period of time to maintain or increase soil health, organic matter content, reduce erosion losses and reduce water quality degradation.","99,100,101,102,103,104,105,106,107,108,109,110,111,112,113,114,115,116,117,118,119,120,121","Conservation Crop Rotation,Conservation Crop Rotation,Conservation Crop Rotation,Conservation Crop Rotation,Conservation Crop Rotation,Conservation Crop Rotation,Conservation Crop Rotation,Conservation Crop Rotation,Conservation Crop Rotation,Conservation Crop Rotation,Conservation Crop Rotation,Conservation Crop Rotation,Conservation Crop Rotation,Conservation Crop Rotation,Conservation Crop Rotation,Conservation Crop Rotation,Conservation Crop Rotation,Conservation Crop Rotation,Conservation Crop Rotation,Conservation Crop Rotation,Conservation Crop Rotation,Conservation Crop Rotation,Conservation Crop Rotation"
"Sloping Crop Land - Align ridges, furrows, and roughness formed by tillage, planting and other operations at a grade near the contour to alter the velocity or the direction of water flow.","122,123,124,125,126,127,128,129,130,131","Contour Farming,Contour Farming,Contour Farming,Contour Farming,Contour Farming,Contour Farming,Contour Farming,Contour Farming,Contour Farming,Contour Farming"
"Perennial - Plant orchards, vineyards, or other perennial crops so that all cultural operations are done on or near the contour.","132,133,134,135,136,137,138,139,140,141","Contour Orchard and Other Perennial Cro,Contour Orchard and Other Perennial Cro,Contour Orchard and Other Perennial Cro,Contour Orchard and Other Perennial Cro,Contour Orchard and Other Perennial Cro,Contour Orchard and Other Perennial Cro,Contour Orchard and Other Perennial Cro,Contour Orchard and Other Perennial Cro,Contour Orchard and Other Perennial Cro,Contour Orchard and Other Perennial Cro"
CRP Re-enrollment - Maintain existing contour buffer strips to meet the planned CRP objectives.,"142,143,144,145","Contour Buffer Strips,Contour Buffer Strips,Contour Buffer Strips,Contour Buffer Strips"
"Buffer Strips - Establish narrow strips of permanent, herbaceous vegetative cover around the hill slope, and alternated down the slope with wider cropped strips that are farmed on the contour.","146,147,148,149,150,151,152,153,154,155,156,157,158,159","Contour Buffer Strips,Contour Buffer Strips,Contour Buffer Strips,Contour Buffer Strips,Contour Buffer Strips,Contour Buffer Strips,Contour Buffer Strips,Contour Buffer Strips,Contour Buffer Strips,Contour Buffer Strips,Contour Buffer Strips,Contour Buffer Strips,Contour Buffer Strips,Contour Buffer Strips"
Prescribed Burning - Conduct a prescribed burn according to a prescribed burn plan in order to meet management objectives.,"160,161,162,163,164,165,166,167,168,169","Prescribed Burning,Prescribed Burning,Prescribed Burning,Prescribed Burning,Prescribed Burning,Prescribed Burning,Prescribed Burning,Prescribed Burning,Prescribed Burning,Prescribed Burning"
"Basic cover crop- Planting grasses, legumes, and/or forbs for seasonal vegetative cover- post harvest of the cash crop- to address natural resource concerns.Â  Termination of the cover crop is timed to reduce delay of planting the next cash crop.","170,171,172,173,174,175,176,177,178,179,180,181,182,183,184,185,186,187,188,189,190,191,192,193,194,195","Cover Crop,Cover Crop,Cover Crop,Cover Crop,Cover Crop,Cover Crop,Cover Crop,Cover Crop,Cover Crop,Cover Crop,Cover Crop,Cover Crop,Cover Crop,Cover Crop,Cover Crop,Cover Crop,Cover Crop,Cover Crop,Cover Crop,Cover Crop,Cover Crop,Cover Crop,Cover Crop,Cover Crop,Cover Crop,Cover Crop"
"Longer growth- Seasonal planting of grasses, legumes, and/or forbs.Â  Cover crop species or mix are selected to allow plant establishment and growth as early as possible or at fall harvest of cash crop.Â  Termination in the spring allows more plant growth as close as possible to the termination date by zone following the termination guidelines.","196,197,198,199,200,201,202,203,204,205,206,207,208,209,210,211,212,213,214,215","Cover Crop,Cover Crop,Cover Crop,Cover Crop,Cover Crop,Cover Crop,Cover Crop,Cover Crop,Cover Crop,Cover Crop,Cover Crop,Cover Crop,Cover Crop,Cover Crop,Cover Crop,Cover Crop,Cover Crop,Cover Crop,Cover Crop,Cover Crop"
Stabilize sites - Establish permanent vegetation on sites known to have high erosion rates or conditions that prevent the establishment of vegetation with normal seed/planting methods.,"216,217,218,219,220,221,222,223,224","Critical Area Planting,Critical Area Planting,Critical Area Planting,Critical Area Planting,Critical Area Planting,Critical Area Planting,Critical Area Planting,Critical Area Planting,Critical Area Planting"
Diversion Dam - Build a structure to divert all or part of the water from a waterway or a stream.,"225,226,227,228","""Dam, Diversion"",""Dam, Diversion"",""Dam, Diversion"",""Dam, Diversion"""
"Sediment Basin - Construct a basin with an engineered outlet, formed by constructing an embankment, excavating a dugout, or a combination of both.","229,230,231,232,233,234","Sediment Basin,Sediment Basin,Sediment Basin,Sediment Basin,Sediment Basin,Sediment Basin"
"Decommission - Seal and permanently close an inactive, abandoned, or unusable water or monitoring well.",235,Well Decommissioning
"Dike - Construct an earthen embankment to either keep water off the landscape and protect land and infrastructure from flooding, or to retain water on the landscape for wetlands, fish and wildlife, or irrigation and drainage water management.","236,237,238,239,240,241","Dike and Levee,Dike and Levee,Dike and Levee,Dike and Levee,Dike and Levee,Dike and Levee"
Treatment Lagoon - Build a waste treatment impoundment by constructing an embankment and/or excavating a pit or dugout.,"242,243,244,245","Waste Treatment Lagoon,Waste Treatment Lagoon,Waste Treatment Lagoon,Waste Treatment Lagoon"
"Waste Facility Closure - Decommission a facility where agricultural waste has been treated or stored, and is no longer used for the intended purpose.   The facility is closed with removed waste applied according to nutrient management plan and the site has been stabilized for erosion control.","246,247,248,249","Waste Facility Closure,Waste Facility Closure,Waste Facility Closure,Waste Facility Closure"
"Reduce Erosion - Construct a channel generally across the slope with a supporting ridge on the lower side to reduce erosion and runoff on crop, urban or developing areas and at construction or mining sites.","250,251,252,253","Diversion,Diversion,Diversion,Diversion"
"Collect Water - Construct a channel generally across the slope with a supporting ridge on the lower side to collect or direct water for storage, water-spreading, water-harvesting systems, or supplement water management.","254,255,256","Diversion,Diversion,Diversion"
Intercept Flow - Construct a channel generally across the slope with a supporting ridge on the lower side to intercept surface and shallow subsurface flow.,"257,258,259,260","Diversion,Diversion,Diversion,Diversion"
"Divert WQ Contaminants - Construct a channel generally across the slope with a supporting ridge on the lower side to divert concentrated and nonpoint source of nutrients, pesticides or pathogens.","261,262,263,264,265,266,267","Diversion,Diversion,Diversion,Diversion,Diversion,Diversion,Diversion"
"Pond - Create a water impoundment by constructing an embankment, excavating a dugout or by a combination of both.","268,269,270,271,272,273,274,275,276","Pond,Pond,Pond,Pond,Pond,Pond,Pond,Pond,Pond"
CRP Re-enrollment - Maintain existing trees/shrubs in linear configurations to meet the planned CRP objectives.,"277,278,279,280","Windbreak/Shelterbelt Est/Renovation,Windbreak/Shelterbelt Est/Renovation,Windbreak/Shelterbelt Est/Renovation,Windbreak/Shelterbelt Est/Renovation"
Establishment - Plant trees/shrubs in linear configurations to meet conservation objectives.,"281,282,283,284,285,286,287,288,289,290,291,292,293,294,295,296,297,298,299,300,301,302,303","Windbreak/Shelterbelt Est/Renovation,Windbreak/Shelterbelt Est/Renovation,Windbreak/Shelterbelt Est/Renovation,Windbreak/Shelterbelt Est/Renovation,Windbreak/Shelterbelt Est/Renovation,Windbreak/Shelterbelt Est/Renovation,Windbreak/Shelterbelt Est/Renovation,Windbreak/Shelterbelt Est/Renovation,Windbreak/Shelterbelt Est/Renovation,Windbreak/Shelterbelt Est/Renovation,Windbreak/Shelterbelt Est/Renovation,Windbreak/Shelterbelt Est/Renovation,Windbreak/Shelterbelt Est/Renovation,Windbreak/Shelterbelt Est/Renovation,Windbreak/Shelterbelt Est/Renovation,Windbreak/Shelterbelt Est/Renovation,Windbreak/Shelterbelt Est/Renovation,Windbreak/Shelterbelt Est/Renovation,Windbreak/Shelterbelt Est/Renovation,Windbreak/Shelterbelt Est/Renovation,Windbreak/Shelterbelt Est/Renovation,Windbreak/Shelterbelt Est/Renovation,Windbreak/Shelterbelt Est/Renovation"
Fence - Install fence to meet management objectives.,"304,305,306,307","Fence,Fence,Fence,Fence"
Field Border - Establish strips of permanent vegetation at the edge of or around the perimeter of a field.,"308,309,310,311,312,313,314,315,316,317,318,319,320","Field Border,Field Border,Field Border,Field Border,Field Border,Field Border,Field Border,Field Border,Field Border,Field Border,Field Border,Field Border,Field Border"
"Irrigation field ditch - Construct a permanent irrigation ditch in or with earth materials, to convey water from the source of supply to a field or fields in an irrigation system to improve distribution uniformity and/or improve irrigation efficiency.","321,322,323,324,325","Irrigation Field Ditch,Irrigation Field Ditch,Irrigation Field Ditch,Irrigation Field Ditch,Irrigation Field Ditch"
CRP Re-enrollment - Maintain existing riparian herbaceous cover to meet the planned CRP objectives.,"326,327,328,329","Riparian Herbaceous Cover,Riparian Herbaceous Cover,Riparian Herbaceous Cover,Riparian Herbaceous Cover"
"Riparian Herbaceous Cover Designed for Fish and Wildlife - Restore, improve or maintain plant communities that are tolerant of intermittent flooding or saturated soils within the transitional zone between upland and aquatic habitats to achieve one or more of the following fish and wildlife habitat related purposes:  provide or improve food and cover for fish and wildlife; establish and maintain habitat corridors; and enhance pollen, nectar and nesting habitat for pollinators.","330,331,332,333,334,335","Riparian Herbaceous Cover,Riparian Herbaceous Cover,Riparian Herbaceous Cover,Riparian Herbaceous Cover,Riparian Herbaceous Cover,Riparian Herbaceous Cover"
Basic Riparian Herbaceous Cover - Plant vegetation tolerant of intermittent flooding or saturated soils in the transitional zone between upland and aquatic areas to achieve one or more of the following purposes:  maintain or improve water quality; increase water storage on floodplains; reduce erosion and improve stability to stream banks and shorelines; increase net carbon storage in the biomass and soil; dissipate stream energy and trap sediment; and enhance stream bank protection.,"336,337,338,339,340,341,342,343,344,345,346,347,348,349,350,351,352,353,354","Riparian Herbaceous Cover,Riparian Herbaceous Cover,Riparian Herbaceous Cover,Riparian Herbaceous Cover,Riparian Herbaceous Cover,Riparian Herbaceous Cover,Riparian Herbaceous Cover,Riparian Herbaceous Cover,Riparian Herbaceous Cover,Riparian Herbaceous Cover,Riparian Herbaceous Cover,Riparian Herbaceous Cover,Riparian Herbaceous Cover,Riparian Herbaceous Cover,Riparian Herbaceous Cover,Riparian Herbaceous Cover,Riparian Herbaceous Cover,Riparian Herbaceous Cover,Riparian Herbaceous Cover"
CRP Re-enrollment - Maintain existing riparian forest buffer to meet the planned CRP objectives.,"355,356,357,358","Riparian Forest Buffer,Riparian Forest Buffer,Riparian Forest Buffer,Riparian Forest Buffer"
"Riparian Forest Buffer - Establish, restore or enhance woody plant communities located adjacent to watercourses or water bodies.","359,360,361,362,363,364,365,366,367,368,369,370,371,372,373,374,375,376,377","Riparian Forest Buffer,Riparian Forest Buffer,Riparian Forest Buffer,Riparian Forest Buffer,Riparian Forest Buffer,Riparian Forest Buffer,Riparian Forest Buffer,Riparian Forest Buffer,Riparian Forest Buffer,Riparian Forest Buffer,Riparian Forest Buffer,Riparian Forest Buffer,Riparian Forest Buffer,Riparian Forest Buffer,Riparian Forest Buffer,Riparian Forest Buffer,Riparian Forest Buffer,Riparian Forest Buffer,Riparian Forest Buffer"
CRP Re-enrollment - Maintain existing filter strip to meet the planned CRP objectives.,"378,379,380,381","Filter Strip,Filter Strip,Filter Strip,Filter Strip"
"Sediment Retention - Establish permanent herbaceous vegetation to remove contaminates from overland flow to protect environmentally sensitive areas from sediment, and suspended solids.  Design filter strip based on amount of sediment delivery, filter strip flow length and length of flow path from contributing area.","382,383,384,385,386,387,388,389","Filter Strip,Filter Strip,Filter Strip,Filter Strip,Filter Strip,Filter Strip,Filter Strip,Filter Strip"
Dissolved Contaminants - Establish permanent herbaceous vegetation as wider strips or flow length to remove dissolved contaminates from overland flow. ,"390,391,392,393,394,395,396,397,398,399","Filter Strip,Filter Strip,Filter Strip,Filter Strip,Filter Strip,Filter Strip,Filter Strip,Filter Strip,Filter Strip,Filter Strip"
Firebreak â€“ Establish bare ground or vegetation to manage or control fire.,"400,401,402,403,404","Firebreak,Firebreak,Firebreak,Firebreak,Firebreak"
"Floodplain and Riparian Habitat Improvement - Improve floodplain & riparian habitat through structural, vegetative and/or management activities.","405,406","Stream Habitat Improvement and Management,Stream Habitat Improvement and Management"
Instream Habitat Improvement - Improve instream habitat through structural and/or management activities.,407,Stream Habitat Improvement and Management
General Aquatic Organism Passage - Improve or provide passage for aquatic organisms by modifying or removing barriers that restrict or impede movement of aquatic organisms.,"408,409","Aquatic Organism Passage,Aquatic Organism Passage"
General Fishpond Mgmt. - Provide favorable habitat for fish and other aquatic organisms to develop and maintain a desired species composition and ratio of fish.,"410,411","Fishpond Management,Fishpond Management"
Dam - Install a dam to impound water for one or more beneficial purposes.,"412,413,414,415,416,417,418","Dam,Dam,Dam,Dam,Dam,Dam,Dam"
Stabilization - Install a structure to control the grade in natural or constructed channels.,"419,420,421,422,423,424","Grade Stabilization Structure,Grade Stabilization Structure,Grade Stabilization Structure,Grade Stabilization Structure,Grade Stabilization Structure,Grade Stabilization Structure"
CRP Re-enrollment - Maintain existing grassed waterway to meet the planned CRP objectives.,"425,426,427,428","Grassed Waterway,Grassed Waterway,Grassed Waterway,Grassed Waterway"
Waterway - Establish a shaped or graded channel with suitable vegetation to convey surface water at a nonerosive velocity using a broad and shallow cross section to a stable outlet.,"429,430,431,432,433,434,435,436,437,438,439,440","Grassed Waterway,Grassed Waterway,Grassed Waterway,Grassed Waterway,Grassed Waterway,Grassed Waterway,Grassed Waterway,Grassed Waterway,Grassed Waterway,Grassed Waterway,Grassed Waterway,Grassed Waterway"
"Wildlife Hedgerow - Establish dense vegetation in a linear design to provide one or more of the following fish and wildlife habitat components:  food, cover and corridors for terrestrial wildlife; enhanced pollen, nectar and nesting habitat for pollinators; food, cover and shade for aquatic organisms that lie in adjacent streams or water courses.","441,442,443,444,445","Hedgerow Planting,Hedgerow Planting,Hedgerow Planting,Hedgerow Planting,Hedgerow Planting"
Beetle Bank - Establish dense vegetation in a linear design to provide substrate for predaceous and beneficial invertebrates as a component of integrated pest management.,"446,447,448","Hedgerow Planting,Hedgerow Planting,Hedgerow Planting"
"Hedgerow Screen - Establish dense vegetation in a linear design to achieve one or more of the following:  intercept airborne particulate matter, reduce chemical drift or odor movement, provide screen and barrier to noise and dust; and increase carbon storage in biomass and soils.","449,450,451,452,453,454,455,456,457,458","Hedgerow Planting,Hedgerow Planting,Hedgerow Planting,Hedgerow Planting,Hedgerow Planting,Hedgerow Planting,Hedgerow Planting,Hedgerow Planting,Hedgerow Planting,Hedgerow Planting"
"Ditch - Construct a channel that has a supporting ridge on the lower side, across the slope at defined gradient and horizontal or vertical interval, with or without a vegetative barrier.","459,460,461","Hillside Ditch,Hillside Ditch,Hillside Ditch"
Install a non-reinforced concrete lined ditch or canal to prevent soil water logging and reduce irrigation water loss from seepage.,"462,463,464","""IWM -- Canal Lining, Plain Concrete"",""IWM -- Canal Lining, Plain Concrete"",""IWM -- Canal Lining, Plain Concrete"""
Install buried membrane linings in ditch or canal to prevent soil water logging and reduce water loss from seepage.,"465,466,467","""IWM -- Canal Lining, Flexible Membrane"",""IWM -- Canal Lining, Flexible Membrane"",""IWM -- Canal Lining, Flexible Membrane"""
Install galvanized steel lining for ditch or canal to prevent soil water logging and reduce water loss from seepage.,"468,469,470","""IWM -- Canal Lining, Galvanized Steel"",""IWM -- Canal Lining, Galvanized Steel"",""IWM -- Canal Lining, Galvanized Steel"""
Install underground pipeline and appurtenances to reduce erosion and seepage.,"471,472,473,474,475,476,477,478,479,480,481,482,483,484,485,486,487,488,489,490,491","""IWC, Pipeline, Aluminum Tubing"",""IWC, Pipeline, Aluminum Tubing"",""IWC, Pipeline, Aluminum Tubing"",""Irrigation Water Conveyance, Pipeline, A"",""Irrigation Water Conveyance, Pipeline, A"",""Irrigation Water Conveyance, Pipeline, A"",""Irrigation Water Conveyance, Pipeline, N"",""Irrigation Water Conveyance, Pipeline, N"",""Irrigation Water Conveyance, Pipeline, N"",""Irrigation Water Conveyance, Pipeline, H"",""Irrigation Water Conveyance, Pipeline, H"",""Irrigation Water Conveyance, Pipeline, H"",""Irrigation Water Conveyance, Pipeline, L"",""Irrigation Water Conveyance, Pipeline, L"",""Irrigation Water Conveyance, Pipeline, L"",""Irrigation Water Conveyance, Pipeline, S"",""Irrigation Water Conveyance, Pipeline, S"",""Irrigation Water Conveyance, Pipeline, S"",""Irrigation Water Conveyance, Pipeline, R"",""Irrigation Water Conveyance, Pipeline, R"",""Irrigation Water Conveyance, Pipeline, R"""
Dry Hydrant - Install a nonpressurized permanent pipe assembly into a water source that permits the withdrawal of water by suction.,"492,493,494","Dry Hydrant,Dry Hydrant,Dry Hydrant"
"Irrigation Reservoir - Construct an irrigation water storage structure by constructing a dam, embankment, pit, or tank.","495,496,497,498,499","Irrigation Reservoir,Irrigation Reservoir,Irrigation Reservoir,Irrigation Reservoir,Irrigation Reservoir"
"Microirrigation system - Install an irrigation system for frequent, efficient, and uniform application of small quantities of water on or below the soil surface: as drops, tiny streams, or miniature spray through emitters or applicators placed along a water delivery line.","500,501,502,503,504,505,506,507,508,509","""Irrigation System, Microirrigation"",""Irrigation System, Microirrigation"",""Irrigation System, Microirrigation"",""Irrigation System, Microirrigation"",""Irrigation System, Microirrigation"",""Irrigation System, Microirrigation"",""Irrigation System, Microirrigation"",""Irrigation System, Microirrigation"",""Irrigation System, Microirrigation"",""Irrigation System, Microirrigation"""
Sprinkler System - Install a distribution system that applies water by means of nozzles operated under pressure to accomplish efficient and uniform application of water on irrigated lands.,"510,511,512,513,514,515,516,517,518,519,520,521,522,523","Sprinkler System,Sprinkler System,Sprinkler System,Sprinkler System,Sprinkler System,Sprinkler System,Sprinkler System,Sprinkler System,Sprinkler System,Sprinkler System,Sprinkler System,Sprinkler System,Sprinkler System,Sprinkler System"
"Surface and subsurface irrigation system - Install a system in which all necessary earthwork, multioutlet pipelines, and water-control structures are installed for distribution of water by surface or subsurface means through water table control.","524,525,526,527,528","""Irrigation System, Surface and Subsurfa"",""Irrigation System, Surface and Subsurfa"",""Irrigation System, Surface and Subsurfa"",""Irrigation System, Surface and Subsurfa"",""Irrigation System, Surface and Subsurfa"""
"Tailwater Recovery - Install a system to collect, store, and convey irrigation tailwater, rainfall runoff, field drain water, or a combination thereof for reuse in irrigation.","529,530,531,532,533,534,535,536","Irrigation and Drainage Tailwater Recov,Irrigation and Drainage Tailwater Recov,Irrigation and Drainage Tailwater Recov,Irrigation and Drainage Tailwater Recov,Irrigation and Drainage Tailwater Recov,Irrigation and Drainage Tailwater Recov,Irrigation and Drainage Tailwater Recov,Irrigation and Drainage Tailwater Recov"
"Irrigation Water Management - Manage irrigation water by determining and controlling the volume, frequency, and application rate of irrigation water to improve irrigation water use efficiency, minimize irrigation induced soil erosion, decrease degradation of surface and groundwater resources, manage salts in the crop root zone, manage air, soil, or plant micro-climate, or reduce energy use.","537,538,539,540,541,542,543,544,545,546,547,548,549,550,551,552,553,554,555,556,557","Irrigation Water Management,Irrigation Water Management,Irrigation Water Management,Irrigation Water Management,Irrigation Water Management,Irrigation Water Management,Irrigation Water Management,Irrigation Water Management,Irrigation Water Management,Irrigation Water Management,Irrigation Water Management,Irrigation Water Management,Irrigation Water Management,Irrigation Water Management,Irrigation Water Management,Irrigation Water Management,Irrigation Water Management,Irrigation Water Management,Irrigation Water Management,Irrigation Water Management,Irrigation Water Management"
PAM - Apply water-soluble anionic polyacrylamide (PAM) to meet a resource concern.,"558,559,560,561,562,563,564,565,566,567","Anionic Polyacrylamide (PAM) Applicatio,Anionic Polyacrylamide (PAM) Applicatio,Anionic Polyacrylamide (PAM) Applicatio,Anionic Polyacrylamide (PAM) Applicatio,Anionic Polyacrylamide (PAM) Applicatio,Anionic Polyacrylamide (PAM) Applicatio,Anionic Polyacrylamide (PAM) Applicatio,Anionic Polyacrylamide (PAM) Applicatio,Anionic Polyacrylamide (PAM) Applicatio,Anionic Polyacrylamide (PAM) Applicatio"
"Landslide Treatment - Manage in-place natural materials, mine spoil, mine waste or overburden to reduce down-slope movement.","568,569,570","""Land Reclamation, Landslide Treatment"",""Land Reclamation, Landslide Treatment"",""Land Reclamation, Landslide Treatment"""
"Mine Closing - Close an underground mine opening by filling, plugging, capping, installing barriers, gating or fencing.","571,572","Mine Shaft and Adit Closing,Mine Shaft and Adit Closing"
"Land Clearing - Remove trees, stumps, and other vegetation from wooded areas to achieve a conservation objective.","573,574","Land Clearing,Land Clearing"
Land Forming - Reshape the surface of land to planned grades.,"575,576,577,578,579,580","Precision Land Forming and Smoothing,Precision Land Forming and Smoothing,Precision Land Forming and Smoothing,Precision Land Forming and Smoothing,Precision Land Forming and Smoothing,Precision Land Forming and Smoothing"
"Irrigation land leveling - Reshape the surface of land to be irrigated, to planned lines and grades to facilitate the efficient use of water on irrigated land.","581,582,583,584,585,586,587","Irrigation Land Leveling,Irrigation Land Leveling,Irrigation Land Leveling,Irrigation Land Leveling,Irrigation Land Leveling,Irrigation Land Leveling,Irrigation Land Leveling"
"Waterway or Outlet - Install a waterway or protected outlet section having an erosion-resistant lining of concrete, stone, synthetic turf reinforcement fabrics, or other permanent material.","588,589,590,591,592,593","Lined Waterway or Outlet,Lined Waterway or Outlet,Lined Waterway or Outlet,Lined Waterway or Outlet,Lined Waterway or Outlet,Lined Waterway or Outlet"
"Temporary Exclusion - Exclude animals, people, vehicles, and/or equipment to achieve and maintain desired resource conditions.","594,595,596,597,598,599,600,601,602","Access Control,Access Control,Access Control,Access Control,Access Control,Access Control,Access Control,Access Control,Access Control"
"Permanent Exclusion - Exclude animals, people, vehicles, and/or equipment to achieve and maintain desired resource conditions.","603,604,605,606,607,608,609,610,611,612,613,614","Access Control,Access Control,Access Control,Access Control,Access Control,Access Control,Access Control,Access Control,Access Control,Access Control,Access Control,Access Control"
An underground conduit constructed by pulling a bullet-shaped cylinder through the soil.,"615,616,617","Mole Drain,Mole Drain,Mole Drain"
Basic Mulching - Apply plant residues or other suitable materials evenly over the land surface to achieve a minimum of 70% ground cover.,"618,619,620,621,622,623,624,625,626,627,628,629,630,631,632,633,634","Mulching,Mulching,Mulching,Mulching,Mulching,Mulching,Mulching,Mulching,Mulching,Mulching,Mulching,Mulching,Mulching,Mulching,Mulching,Mulching,Mulching"
Moisture Management - Apply plant residues or other suitable materials evenly over the land surface to achieve a minimum of 90% ground cover.,"635,636,637,638,639,640,641,642,643,644,645,646,647,648,649,650,651","Mulching,Mulching,Mulching,Mulching,Mulching,Mulching,Mulching,Mulching,Mulching,Mulching,Mulching,Mulching,Mulching,Mulching,Mulching,Mulching,Mulching"
Site Preparation - Treat area to support establishment of woody plant species.,"652,653,654,655,656,657,658","Tree/Shrub Site Preparation,Tree/Shrub Site Preparation,Tree/Shrub Site Preparation,Tree/Shrub Site Preparation,Tree/Shrub Site Preparation,Tree/Shrub Site Preparation,Tree/Shrub Site Preparation"
"Obstruction Removal - Remove and dispose of buildings, structures, other works of improvement, vegetation, debris or other materials.","659,660,661,662","Obstruction Removal,Obstruction Removal,Obstruction Removal,Obstruction Removal"
"Forage Harvest - Cut and remove forages from the fields as hay, green-chop or silage in a timely manner in order to meet management objectives.","663,664,665,666,667,668,669,670,671,672,673,674,675,676,677,678,679,680,681,682,683","Forage Harvest Management,Forage Harvest Management,Forage Harvest Management,Forage Harvest Management,Forage Harvest Management,Forage Harvest Management,Forage Harvest Management,Forage Harvest Management,Forage Harvest Management,Forage Harvest Management,Forage Harvest Management,Forage Harvest Management,Forage Harvest Management,Forage Harvest Management,Forage Harvest Management,Forage Harvest Management,Forage Harvest Management,Forage Harvest Management,Forage Harvest Management,Forage Harvest Management,Forage Harvest Management"
CRP Re-enrollment - Maintain existing permanent vegetation to meet the planned CRP objectives.,"684,685,686,687,753,754,755,756","Pasture and Hay Planting,Pasture and Hay Planting,Pasture and Hay Planting,Pasture and Hay Planting,Range Planting,Range Planting,Range Planting,Range Planting"
"Forage Planting - Establish adapted and/or compatible species, varieties, or cultivars of herbaceous species suitable for pasture, hay or biomass production to meet management objectives.","688,689,690,691,692,693,694,695,696,697,698,699,700,701,702,703,704,705,706,707,708,709,710","Pasture and Hay Planting,Pasture and Hay Planting,Pasture and Hay Planting,Pasture and Hay Planting,Pasture and Hay Planting,Pasture and Hay Planting,Pasture and Hay Planting,Pasture and Hay Planting,Pasture and Hay Planting,Pasture and Hay Planting,Pasture and Hay Planting,Pasture and Hay Planting,Pasture and Hay Planting,Pasture and Hay Planting,Pasture and Hay Planting,Pasture and Hay Planting,Pasture and Hay Planting,Pasture and Hay Planting,Pasture and Hay Planting,Pasture and Hay Planting,Pasture and Hay Planting,Pasture and Hay Planting,Pasture and Hay Planting"
Livestock Pipeline - Install a pipeline to convey water for livestock or wildlife.,"711,712,713","Livestock Pipeline,Livestock Pipeline,Livestock Pipeline"
"Install a fixed lining of flexible impervious material such as plastic, rubber or similar material to reduce seepage to an acceptable level.","714,715,716,717,718","""Pond Sealing or Lining, Flexible Membran"",""Pond Sealing or Lining, Flexible Membran"",""Pond Sealing or Lining, Flexible Membran"",""Pond Sealing or Lining, Flexible Membran"",""Pond Sealing or Lining, Flexible Membran"""
Apply sealing chemicals to reduce seepage to an acceptable level.,"719,720,721,722","""Pond Sealing or Lining, Soil Dispersant"",""Pond Sealing or Lining, Soil Dispersant"",""Pond Sealing or Lining, Soil Dispersant"",""Pond Sealing or Lining, Soil Dispersant"""
Apply lining of bentonite clay or similar material to reduce seepage losses in pond to an acceptable level.,"723,724,725,726","""Pond Sealing or Lining, Bentonite Seal"",""Pond Sealing or Lining, Bentonite Seal"",""Pond Sealing or Lining, Bentonite Seal"",""Pond Sealing or Lining, Bentonite Seal"""
"Pumping plant facility - Install a pumping facility that delivers water at a designed pressure and flow rate for irrigation, watering facilities, wetlands, fire protection, removal of excessive subsurface or surface water, provide efficient use of water on irrigated land, transfer animal waste as part of a manure transfer system, and reduce energy use.","727,728,729,730,731,732,733,734,735,736,737","Pumping Plant,Pumping Plant,Pumping Plant,Pumping Plant,Pumping Plant,Pumping Plant,Pumping Plant,Pumping Plant,Pumping Plant,Pumping Plant,Pumping Plant"
Abandoned Mine - Reclaim land and water areas adversely affected by past mining activities.,"738,739,740,741,742","""Land Reclamation, Abandoned Mined Land"",""Land Reclamation, Abandoned Mined Land"",""Land Reclamation, Abandoned Mined Land"",""Land Reclamation, Abandoned Mined Land"",""Land Reclamation, Abandoned Mined Land"""
Currently Mined - Reclaim currently mined land to an acceptable form and planned use.,"743,744,745,746,747,748","""Land Reclamation, Currently Mined Land"",""Land Reclamation, Currently Mined Land"",""Land Reclamation, Currently Mined Land"",""Land Reclamation, Currently Mined Land"",""Land Reclamation, Currently Mined Land"",""Land Reclamation, Currently Mined Land"""
Grazing Land Mechanical Treatment - Modify physical soil and/or plant conditions with mechanical tools to meet management objectives.,"749,750,751,752","Grazing Land Mechanical Treatment,Grazing Land Mechanical Treatment,Grazing Land Mechanical Treatment,Grazing Land Mechanical Treatment"
Wildlife Range Planting â€“ Establish adapted and/or compatible species to meet the needs of the target wildlife species.,"757,758,759","Range Planting,Range Planting,Range Planting"
Range Planting - Establish adapted and/or compatible species to meet management objectives.,"760,761,762,763,764,765","Range Planting,Range Planting,Range Planting,Range Planting,Range Planting,Range Planting"
Drainage Water Management - Manage the drainage volume and water table elevation by regulating the flow from a surface or subsurface agricultural drainage system.,"766,767,768,769,770,771,772,773,774,775,776,777,778,779,780","Drainage Water Management,Drainage Water Management,Drainage Water Management,Drainage Water Management,Drainage Water Management,Drainage Water Management,Drainage Water Management,Drainage Water Management,Drainage Water Management,Drainage Water Management,Drainage Water Management,Drainage Water Management,Drainage Water Management,Drainage Water Management,Drainage Water Management"
Rock Barrier - Construct a rock retaining wall across the slope to form and support a bench terrace that will control the flow of water and check erosion on sloping land.,"781,782,783","Rock Wall Terrace,Rock Wall Terrace,Rock Wall Terrace"
"Row Arrangement - Implement a system of crop rows on planned directions, grades and lengths.","784,785,786,787,788,789,790,791,792,793,794","Row Arrangement,Row Arrangement,Row Arrangement,Row Arrangement,Row Arrangement,Row Arrangement,Row Arrangement,Row Arrangement,Row Arrangement,Row Arrangement,Row Arrangement"
"Roof Gutter - Install a structure that will collect, control, and convey precipitation runoff from a roof.","795,796,797,798,799,800,801,802,803","Roof Runoff Structure,Roof Runoff Structure,Roof Runoff Structure,Roof Runoff Structure,Roof Runoff Structure,Roof Runoff Structure,Roof Runoff Structure,Roof Runoff Structure,Roof Runoff Structure"
"Gutter and Storage - Install a structure that will collect, control, and convey precipitation runoff from a roof to storage for later use.","804,805,806,807,808,809,810","Roof Runoff Structure,Roof Runoff Structure,Roof Runoff Structure,Roof Runoff Structure,Roof Runoff Structure,Roof Runoff Structure,Roof Runoff Structure"
"Access Road - Construct a fixed route for vehicular travel to allow management of timber, livestock, agriculture, wildlife habitat, and other conservation enterprises.  Control, divert and direct water flow off the road; install surface treatment if required by traffic needs.","811,812,813","Access Road,Access Road,Access Road"
Stabilization - Stabilize or protect an intensively used area.,"814,815,816,817,818,819","Heavy Use Area Protection,Heavy Use Area Protection,Heavy Use Area Protection,Heavy Use Area Protection,Heavy Use Area Protection,Heavy Use Area Protection"
Recreation land grading and shaping is reshaping the surface of the land to support recreational land use.,820,Recreation Land Improvement/Protection
Stormwater Runoff - Control the quantity and quality of stormwater runoff.,"821,822,823,824,825,826","Stormwater Runoff Control,Stormwater Runoff Control,Stormwater Runoff Control,Stormwater Runoff Control,Stormwater Runoff Control,Stormwater Runoff Control"
Spoil Spreading - Dispose of surplus excavated materials.,827,Spoil Disposal
Water source development - Collect and use water from springs or seeps to provide water for livestock and wildlife.,"828,829,830,831,832,833,834","Spring Development,Spring Development,Spring Development,Spring Development,Spring Development,Spring Development,Spring Development"
"Trail or Walkway - Construct a trail with a vegetated or earthen surface or a walkway with an artificial surface to facilitate the movement of animals, people, or off-road vehicles.","835,836,837,838,839,840,841,842","Trails and Walkways,Trails and Walkways,Trails and Walkways,Trails and Walkways,Trails and Walkways,Trails and Walkways,Trails and Walkways,Trails and Walkways"
"Stream and Shoreline Protection - Install treatments to stabilize and protect banks of streams or constructed channels, and shorelines of lakes reservoirs, or estuaries.","843,844,845,846,847,848","Streambank and Shoreline Protection,Streambank and Shoreline Protection,Streambank and Shoreline Protection,Streambank and Shoreline Protection,Streambank and Shoreline Protection,Streambank and Shoreline Protection"
Open Channel - Open or construct a natural or artificial channel in which water flows with a free surface. ,"849,850,851,852,853,854,855","Open Channel,Open Channel,Open Channel,Open Channel,Open Channel,Open Channel,Open Channel"
Stabilization - Use measures to stabilize the bed or bottom of a channel.,"856,857,858,859,860","Channel Bed Stabilization,Channel Bed Stabilization,Channel Bed Stabilization,Channel Bed Stabilization,Channel Bed Stabilization"
Cropland Strips - Plan rotations of erosion-resistant and erosion susceptible crops or fallow in a systematic arrangement oriented perpendicular to the critical wind or water direction/flow.,"861,862,863,864,865,866,867,868,869,870,871,872","Stripcropping,Stripcropping,Stripcropping,Stripcropping,Stripcropping,Stripcropping,Stripcropping,Stripcropping,Stripcropping,Stripcropping,Stripcropping,Stripcropping"
"Water Control - Construct or install a structure in a water management system that conveys water, controls the direction of flow, rate of flow, maintains a desired water surface elevation, or measures water.","873,874,875,876,877,878,879,880,881,882,883,884","Structure for Water Control,Structure for Water Control,Structure for Water Control,Structure for Water Control,Structure for Water Control,Structure for Water Control,Structure for Water Control,Structure for Water Control,Structure for Water Control,Structure for Water Control,Structure for Water Control,Structure for Water Control"
"NM Level 1 - Apply nutrients based on right source, rate, time, and place (4Rs) not to exceed Land Grant University nutrient recommendations or equivalent, utilizing soil testing and other nutrient monitoring to manage nutrient application for the crop rotation.","885,886,887,888,889,890,891,892,893,894,895,896,897,898,899,900","Nutrient Management,Nutrient Management,Nutrient Management,Nutrient Management,Nutrient Management,Nutrient Management,Nutrient Management,Nutrient Management,Nutrient Management,Nutrient Management,Nutrient Management,Nutrient Management,Nutrient Management,Nutrient Management,Nutrient Management,Nutrient Management"
"NM Level 2 - Apply nutrients based on right source, rate, time, and place (4Rs) not to exceed Land Grant University nutrient recommendations, utilizing soil testing and other nutrient monitoring to manage nutrient application crop by crop.","901,902,903,904,905,906,907,908,909,910,911,912,913,914,915,916","Nutrient Management,Nutrient Management,Nutrient Management,Nutrient Management,Nutrient Management,Nutrient Management,Nutrient Management,Nutrient Management,Nutrient Management,Nutrient Management,Nutrient Management,Nutrient Management,Nutrient Management,Nutrient Management,Nutrient Management,Nutrient Management"
"NM Level 3 - Apply nutrients based on right source, rate, time, and place (4Rs) not to exceed Land Grant University nutrient recommendations, utilizing soil testing and other nutrient monitoring to optimize nutrient use efficiency by dynamically refining each nutrient application throughout a cropâ€™s growing season.","917,918,919,920,921,922,923,924,925,926,927,928,929,930,931,932","Nutrient Management,Nutrient Management,Nutrient Management,Nutrient Management,Nutrient Management,Nutrient Management,Nutrient Management,Nutrient Management,Nutrient Management,Nutrient Management,Nutrient Management,Nutrient Management,Nutrient Management,Nutrient Management,Nutrient Management,Nutrient Management"
"NM Level 4 - Apply nutrients based on right source, rate, time, and place (4Rs) not to exceed Land Grant University nutrient recommendations, optimizing all 4Rs for mitigating site-specific risk for nutrient loss.","933,934,935,936,937,938,939,940,941,942,943,944,945,946,947,948","Nutrient Management,Nutrient Management,Nutrient Management,Nutrient Management,Nutrient Management,Nutrient Management,Nutrient Management,Nutrient Management,Nutrient Management,Nutrient Management,Nutrient Management,Nutrient Management,Nutrient Management,Nutrient Management,Nutrient Management,Nutrient Management"
"Pathogens - Prevent excess pathogens and chemicals from manure, biosolids or compost applications by reducing their quantity and viability in manure.","949,950,951,952","Feed Management,Feed Management,Feed Management,Feed Management"
"Nutrients - Manipulate and control quantity and quality of nutrients fed to livestock and poultry to prevent excess nutrients in surface and groundwater by reducing the quantity of nitrogen, phosphorus, sulfur, salts, and other nutrients excreted in the manure.","953,954,955,956","Feed Management,Feed Management,Feed Management,Feed Management"
"Plant Health PAMS - Implement a Pest Management Plan based on Land Grant University standards to reduce plant pest pressure while utilizing prevention, avoidance, monitoring and suppression strategies.","957,958,959,960,961,962,963,964","Pest Management Conservation System,Pest Management Conservation System,Pest Management Conservation System,Pest Management Conservation System,Pest Management Conservation System,Pest Management Conservation System,Pest Management Conservation System,Pest Management Conservation System"
Pesticide Mitigation - Implement a Pest Management plan based on Land Grant University standards.  Assess pesticide hazards and implement activities to reduce potential off-site movement of pesticides.,"965,966,967,968,969,970,971,972","Pest Management Conservation System,Pest Management Conservation System,Pest Management Conservation System,Pest Management Conservation System,Pest Management Conservation System,Pest Management Conservation System,Pest Management Conservation System,Pest Management Conservation System"
"Plant Health PAMS and MitigationÂ - Implement a Pest Management plan based on Land Grant University standards.   Reduce plant pest pressure while utilizing prevention, avoidance, monitoring and suppression strategies.  Assess pesticide hazards and implement activities to reduce the potential for off-site movement of pesticides.","973,974,975,976,977,978,979,980","Pest Management Conservation System,Pest Management Conservation System,Pest Management Conservation System,Pest Management Conservation System,Pest Management Conservation System,Pest Management Conservation System,Pest Management Conservation System,Pest Management Conservation System"
"Precision Pest Management - Implement a Precision Pest Management plan based on Land Grant University standards to reduce plant pest pressure and potential off-site movement of pesticides. Implement prevention, avoidance, monitoring, suppression and pesticide mitigation strategies. Activities may include:Â  GPS, variable rate application, weed sensing, autonomous robotics and use of smart sprayers.","981,982,983,984,985,986,987,988","Pest Management Conservation System,Pest Management Conservation System,Pest Management Conservation System,Pest Management Conservation System,Pest Management Conservation System,Pest Management Conservation System,Pest Management Conservation System,Pest Management Conservation System"
"Invertebrate Habitat - Implement a Pest Management plan based on Land Grant University standards.  Reduce injury to beneficial organisms and reduce potential off-site movement of pesticides. Implement prevention, avoidance, monitoring, suppression and pesticide mitigation strategies.","989,990,991,992,993,994,995,996,997","Pest Management Conservation System,Pest Management Conservation System,Pest Management Conservation System,Pest Management Conservation System,Pest Management Conservation System,Pest Management Conservation System,Pest Management Conservation System,Pest Management Conservation System,Pest Management Conservation System"
"Terrace - Construct an earth embankment, or a combination ridge and channel, across the field slope.","998,999,1000,1001,1002,1003,1004,1005,1006,1007,1008,1009,1010","Terrace,Terrace,Terrace,Terrace,Terrace,Terrace,Terrace,Terrace,Terrace,Terrace,Terrace,Terrace,Terrace"
"Seeded or Planted Vegetation - Establish permanent strips of stiff, dense vegetation along the general contour of slopes or across concentrated flow areas to reduce sheet and rill erosion and trap sediment.","1011,1012,1013,1014,1015,1016,1017","Vegetative Barrier,Vegetative Barrier,Vegetative Barrier,Vegetative Barrier,Vegetative Barrier,Vegetative Barrier,Vegetative Barrier"
Wind Barrier - Establish herbaceous vegetation in narrow strips within the field to reduce wind speed and wind erosion.,"1018,1019,1020,1021,1022,1023,1024","Herbaceous Wind Barriers,Herbaceous Wind Barriers,Herbaceous Wind Barriers,Herbaceous Wind Barriers,Herbaceous Wind Barriers,Herbaceous Wind Barriers,Herbaceous Wind Barriers"
"Subsurface drain - Install a conduit beneath the ground surface to collect and convey excess water to remove or distribute excessive soil water, remove salts and other contaminants from the soil profile, or mitigate degraded plant condition, undesirable plant productivity, and health due to saturated soil, or ponding, and flooding.","1025,1026,1027,1028,1029,1030","Subsurface Drain,Subsurface Drain,Subsurface Drain,Subsurface Drain,Subsurface Drain,Subsurface Drain"
Field ditch - Install a graded channel on the field surface for the interception of excess surface and shallow subsurface water from a field and conveyance to a surface main or lateral; or for the purpose of collecting excess irrigation water for a tailwater recovery system. ,"1031,1032,1033,1034,1035","""Surface Drain, Field Ditch"",""Surface Drain, Field Ditch"",""Surface Drain, Field Ditch"",""Surface Drain, Field Ditch"",""Surface Drain, Field Ditch"""
Main or lateral - Install an open drainage ditch for moving the excess water collected by a field ditch or subsurface drain to a safe outlet.,"1036,1037,1038,1039,1040,1041","""Surface Drain, Main or Lateral"",""Surface Drain, Main or Lateral"",""Surface Drain, Main or Lateral"",""Surface Drain, Main or Lateral"",""Surface Drain, Main or Lateral"",""Surface Drain, Main or Lateral"""
Wind Erosion - Perform tillage operations that create random surface roughness if there is a high potential for wind erosion due to lack of surface cover. ,"1042,1043,1044","Surface Roughening,Surface Roughening,Surface Roughening"
CRP Re-enrollment - Maintain existing woody plants to meet the planned CRP objectives.,"1045,1046,1047,1048","Tree/Shrub Establishment,Tree/Shrub Establishment,Tree/Shrub Establishment,Tree/Shrub Establishment"
"Natural Regeneration - Establish, restore or enhance woody plant communities through natural regeneration methods.","1049,1050,1051,1052,1053,1054,1055,1056,1057,1058,1059,1060,1061,1062,1063,1064,1065,1066,1067,1068,1069,1070,1071,1072,1073,1074","Tree/Shrub Establishment,Tree/Shrub Establishment,Tree/Shrub Establishment,Tree/Shrub Establishment,Tree/Shrub Establishment,Tree/Shrub Establishment,Tree/Shrub Establishment,Tree/Shrub Establishment,Tree/Shrub Establishment,Tree/Shrub Establishment,Tree/Shrub Establishment,Tree/Shrub Establishment,Tree/Shrub Establishment,Tree/Shrub Establishment,Tree/Shrub Establishment,Tree/Shrub Establishment,Tree/Shrub Establishment,Tree/Shrub Establishment,Tree/Shrub Establishment,Tree/Shrub Establishment,Tree/Shrub Establishment,Tree/Shrub Establishment,Tree/Shrub Establishment,Tree/Shrub Establishment,Tree/Shrub Establishment,Tree/Shrub Establishment"
"Artificial Regeneration - Establish, restore or enhance woody plant communities using hand tools or equipment.","1075,1076,1077,1078,1079,1080,1081,1082,1083,1084,1085,1086,1087,1088,1089,1090,1091,1092,1093,1094,1095,1096,1097,1098,1099,1100","Tree/Shrub Establishment,Tree/Shrub Establishment,Tree/Shrub Establishment,Tree/Shrub Establishment,Tree/Shrub Establishment,Tree/Shrub Establishment,Tree/Shrub Establishment,Tree/Shrub Establishment,Tree/Shrub Establishment,Tree/Shrub Establishment,Tree/Shrub Establishment,Tree/Shrub Establishment,Tree/Shrub Establishment,Tree/Shrub Establishment,Tree/Shrub Establishment,Tree/Shrub Establishment,Tree/Shrub Establishment,Tree/Shrub Establishment,Tree/Shrub Establishment,Tree/Shrub Establishment,Tree/Shrub Establishment,Tree/Shrub Establishment,Tree/Shrub Establishment,Tree/Shrub Establishment,Tree/Shrub Establishment,Tree/Shrub Establishment"
Watering Facility - Install a watering facility to provide drinking water for livestock or wildlife.,"1101,1102,1103,1104,1105,1106,1107,1108,1109","Watering Facility,Watering Facility,Watering Facility,Watering Facility,Watering Facility,Watering Facility,Watering Facility,Watering Facility,Watering Facility"
Underground Outlet - Install a conduit or system of conduits beneath the surface of the ground to convey surface water to a suitable outlet.,"1110,1111,1112,1113,1114","Underground Outlet,Underground Outlet,Underground Outlet,Underground Outlet,Underground Outlet"
"Vertical Drain - Install a well, pipe or pit or bore in porous underground strata in which drainage water can be discharged without contaminating groundwater resources.","1115,1116","Vertical Drain,Vertical Drain"
"Waste Recycling - Utilize nonagricultural waste by-products for on-farm uses, or agricultural waste by-products for off-farm uses.","1117,1118,1119,1120,1121,1122,1123,1124,1125,1126,1127","Waste Recycling,Waste Recycling,Waste Recycling,Waste Recycling,Waste Recycling,Waste Recycling,Waste Recycling,Waste Recycling,Waste Recycling,Waste Recycling,Waste Recycling"
"Waste Transfer - Install a system using structures, pipes or conduits to convey wastes or waste byproducts from the agricultural production site to storage/treatment or application site.","1128,1129,1130,1131","Waste Transfer,Waste Transfer,Waste Transfer,Waste Transfer"
Vegetated Treatment Area - Establish and maintain an area of permanent vegetation for agricultural wastewater treatment.,"1132,1133,1134,1135,1136,1137,1138","Vegetated Treatment Area,Vegetated Treatment Area,Vegetated Treatment Area,Vegetated Treatment Area,Vegetated Treatment Area,Vegetated Treatment Area,Vegetated Treatment Area"
"Water harvesting catchment - Install a facility for collecting and storing runoff from precipitation to provide water for livestock, fish, wildlife, or other conservation purposes.","1139,1140,1141","Water Harvesting Catchment,Water Harvesting Catchment,Water Harvesting Catchment"
WASCOB - Construct an earth embankment or a combination ridge and channel across the slope of a minor drainageway.,"1142,1143,1144,1145,1146,1147,1148,1149,1150,1151,1152","Water and Sediment Control Basin,Water and Sediment Control Basin,Water and Sediment Control Basin,Water and Sediment Control Basin,Water and Sediment Control Basin,Water and Sediment Control Basin,Water and Sediment Control Basin,Water and Sediment Control Basin,Water and Sediment Control Basin,Water and Sediment Control Basin,Water and Sediment Control Basin"
"Waterspreading - Install a system of dams, dikes, ditches, or other means to divert or collect runoff from natural channels, gullies, or streams and spread it over relatively flat areas.","1153,1154,1155,1156,1157,1158,1159,1160","Waterspreading,Waterspreading,Waterspreading,Waterspreading,Waterspreading,Waterspreading,Waterspreading,Waterspreading"
Well - Install a water well into an aquifer for water supply.,"1161,1162,1163,1164,1165,1166,1167","Water Well,Water Well,Water Well,Water Well,Water Well,Water Well,Water Well"
"Restoration of Rare or Declining Communities - Reestablish abiotic (physical and chemical) and biotic (biological) conditions necessary to support rare or declining natural assemblages of native plants and animals in situations where it is not possible to meet target conditions solely through implementation of annual management actions such as prescribed burning, prescribed grazing, forest stand improvement, or pest management.","1168,1169,1170","Restoration of Rare or Declining Natura,Restoration of Rare or Declining Natura,Restoration of Rare or Declining Natura"
CRP Re-enrollment - Maintain existing rare or declining natural communities to meet the planned CRP objectives.,"1171,1172,1173,1174","Restoration of Rare or Declining Natura,Restoration of Rare or Declining Natura,Restoration of Rare or Declining Natura,Restoration of Rare or Declining Natura"
Wetland Wildlife Habitat Management; Low - Enable movement and / or provide food and cover to sustain wildlife that are wetland dependent.  Application of this practice will meet wildlife habitat planning criteria.,"1175,1176","Wetland Wildlife Habitat Management,Wetland Wildlife Habitat Management"
Wetland Wildlife Habitat Management; High - Enable movement and / or provide food and cover to sustain wildlife that are wetland dependent.  Application of this practice will exceed and improve upon minimum planning criteria for wildlife habitat; improvement is required even if wildlife habitat evaluation score already exceeds planning criteria.,"1177,1178,1179","Wetland Wildlife Habitat Management,Wetland Wildlife Habitat Management,Wetland Wildlife Habitat Management"
Upland Wildlife Habitat Management; Low - Enable movement and / or provide food and cover to sustain wildlife that inhabit uplands.  Application of this practice will meet wildlife habitat planning criteria.,"1180,1181","Upland Wildlife Habitat Management,Upland Wildlife Habitat Management"
Upland Wildlife Habitat Management; High - Enable movement and / or provide food and cover to sustain wildlife that inhabit uplands. Application of this practice will exceed and improve upon minimum planning criteria for wildlife habitat wildlife habitat; improvement is required even if wildlife habitat evaluation score already exceeds planning criteria.,1182,Upland Wildlife Habitat Management
CRP Re-enrollment - Maintain the existing shallow water development to meet planned CRP objectives.,"1183,1184,1185,1186","Shallow Water Development and Managemen,Shallow Water Development and Managemen,Shallow Water Development and Managemen,Shallow Water Development and Managemen"
"Shallow Water Habitat - Inundate lands to provide habitat for fish and / or wildlife to provide habitat for wildlife such as shorebirds, waterfowl, wading birds, mammals, fish, reptiles, amphibians and other species that require shallow water for at least a part of their life cycle.  Implementation is on lands where water can be impounded or regulated by diking, excavating, ditching and /or flooding and on floodplain areas that provide refuge habitats for native fish during high flow periods.","1187,1188,1189","Shallow Water Development and Managemen,Shallow Water Development and Managemen,Shallow Water Development and Managemen"
CRP Re-enrollment - Maintain the existing early successional habitat to meet planned CRP objectives.,"1190,1191,1192,1193","Early Successional Habitat Development-,Early Successional Habitat Development-,Early Successional Habitat Development-,Early Successional Habitat Development-"
Early Successional Habitat - Manage plant succession to develop and maintain early successional habitat that benefits desired wildlife and / or natural communities.,"1194,1195","Early Successional Habitat Development-,Early Successional Habitat Development-"
Renovation â€“ Restore or enhance the original planned function of an existing windbreak or shelterbelt.,"1196,1197,1198,1199,1200,1201,1202,1203,1204,1205,1206,1207,1208,1209,1210,1211,1212,1213,1214,1215,1216,1217","Windbreak/Shelterbelt Renovation,Windbreak/Shelterbelt Renovation,Windbreak/Shelterbelt Renovation,Windbreak/Shelterbelt Renovation,Windbreak/Shelterbelt Renovation,Windbreak/Shelterbelt Renovation,Windbreak/Shelterbelt Renovation,Windbreak/Shelterbelt Renovation,Windbreak/Shelterbelt Renovation,Windbreak/Shelterbelt Renovation,Windbreak/Shelterbelt Renovation,Windbreak/Shelterbelt Renovation,Windbreak/Shelterbelt Renovation,Windbreak/Shelterbelt Renovation,Windbreak/Shelterbelt Renovation,Windbreak/Shelterbelt Renovation,Windbreak/Shelterbelt Renovation,Windbreak/Shelterbelt Renovation,Windbreak/Shelterbelt Renovation,Windbreak/Shelterbelt Renovation,Windbreak/Shelterbelt Renovation,Windbreak/Shelterbelt Renovation"
CRP Re-enrollment - Maintain and manage the existing constructed wetland(s) to meet planned CRP objectives.,"1218,1219,1220,1221","Constructed Wetland,Constructed Wetland,Constructed Wetland,Constructed Wetland"
Constructed Wetland - Install an artificial wetland ecosystem with hydrophytic vegetation for biological treatment of water.,"1222,1223,1224,1225,1226,1227,1228,1229,1230","Constructed Wetland,Constructed Wetland,Constructed Wetland,Constructed Wetland,Constructed Wetland,Constructed Wetland,Constructed Wetland,Constructed Wetland,Constructed Wetland"
CRP Re-enrollment - Maintain and manage the existing natural wetland(s) to meet the planned CRP objectives.,"1231,1232,1233,1234","Wetland Restoration,Wetland Restoration,Wetland Restoration,Wetland Restoration"
Restoration - Restore a wetland and its functions to a close approximation of its original condition as it existed prior to disturbance on a former or degraded wetland site.,"1235,1236,1237,1238,1239,1240,1241,1242,1243,1244,1245,1246,1247,1248","Wetland Restoration,Wetland Restoration,Wetland Restoration,Wetland Restoration,Wetland Restoration,Wetland Restoration,Wetland Restoration,Wetland Restoration,Wetland Restoration,Wetland Restoration,Wetland Restoration,Wetland Restoration,Wetland Restoration,Wetland Restoration"
CRP Re-enrollment - Maintain and manage the existing created wetland(s) to meet the planned CRP objectives.,"1249,1250,1251,1252","Wetland Creation,Wetland Creation,Wetland Creation,Wetland Creation"
"Creation - Establish wetland hydrology, hydrophytic vegetation, and desired wetland functions on a site that is capable of supporting wetland characteristics and was historically a non-wetland.","1253,1254,1255,1256,1257,1258,1259,1260,1261,1262,1263","Wetland Creation,Wetland Creation,Wetland Creation,Wetland Creation,Wetland Creation,Wetland Creation,Wetland Creation,Wetland Creation,Wetland Creation,Wetland Creation,Wetland Creation"
"Enhancement - Augment wetland functions beyond the original natural conditions on a former, degraded, or naturally functioning wetland site to increase the capacity of specific wetland functions.","1264,1265,1266,1267,1268,1269,1270,1271,1272,1273","Wetland Enhancement,Wetland Enhancement,Wetland Enhancement,Wetland Enhancement,Wetland Enhancement,Wetland Enhancement,Wetland Enhancement,Wetland Enhancement,Wetland Enhancement,Wetland Enhancement"
Above Ground - Remove branches and leaders to meet conservation objectives.,"1274,1275,1276","Tree-Shrub Pruning,Tree-Shrub Pruning,Tree-Shrub Pruning"
Below Ground - Treat roots to meet conservation objectives.,"1277,1278,1279","Tree-Shrub Pruning,Tree-Shrub Pruning,Tree-Shrub Pruning"
"Rain Exclusion Cover - Place a rigid, semirigid, or flexible manufactured membrane, composite material, or roof structure over a waste management facility, agrichemical handling facility, or an on-farm secondary containment facility to divert clean rainwater.","1280,1281,1282,1283,1284,1285,1286,1287,1288,1289","Roofs and Covers,Roofs and Covers,Roofs and Covers,Roofs and Covers,Roofs and Covers,Roofs and Covers,Roofs and Covers,Roofs and Covers,Roofs and Covers,Roofs and Covers"
"Prescribed Grazing - Manage the harvest of vegetation with grazing and/or browsing animals with the intent to achieve specific ecological, economic and management objectives.","1290,1291,1292,1293,1294,1295,1296,1297,1298,1299,1300,1301,1302,1303,1304,1305,1306,1307,1308,1309,1310,1311,1312,1313,1314","Prescribed Grazing,Prescribed Grazing,Prescribed Grazing,Prescribed Grazing,Prescribed Grazing,Prescribed Grazing,Prescribed Grazing,Prescribed Grazing,Prescribed Grazing,Prescribed Grazing,Prescribed Grazing,Prescribed Grazing,Prescribed Grazing,Prescribed Grazing,Prescribed Grazing,Prescribed Grazing,Prescribed Grazing,Prescribed Grazing,Prescribed Grazing,Prescribed Grazing,Prescribed Grazing,Prescribed Grazing,Prescribed Grazing,Prescribed Grazing,Prescribed Grazing"
"Access to Land - Provide a stabilized area or structure constructed across a stream to provide access to another land unit for livestock grazing, cropping, or haying.",1315,Stream Crossing
"Water Quality Improvement - Provide a stabilized area or structure constructed across a stream to improve water quality by reducing sediment, nutrient, organic, and inorganic loading of the stream.","1316,1317","Stream Crossing,Stream Crossing"
Streambank Erosion Reduction -  Provide a stabilized area or structure constructed across a stream to reduce streambank and streambed erosion.,1318,Stream Crossing
Fuel Break - Treat and/or remove living or dead biomass to reduce wildfire risk.,"1319,1320,1321","Fuel Break,Fuel Break,Fuel Break"
Use of compacted soil without soil amendments to seal a pond or waste storage impoundment.,"1322,1323,1324,1325","Pond Sealing -  Clay Treatment,Pond Sealing -  Clay Treatment,Pond Sealing -  Clay Treatment,Pond Sealing -  Clay Treatment"
Canopy Treatment - Manage existing tree canopy and forage resources for livestock.,"1326,1327,1328,1329,1330","Silvopasture,Silvopasture,Silvopasture,Silvopasture,Silvopasture"
Establishment - Establish desired woody plant species and forage resources for livestock.,"1331,1332,1333,1334,1335,1336,1337","Silvopasture,Silvopasture,Silvopasture,Silvopasture,Silvopasture,Silvopasture,Silvopasture"
"By-Product Transfer - Install a crop by-product conveyance system using structures, conduits, or equipment.","1338,1339,1340,1341","Crop By-Product Transfer,Crop By-Product Transfer,Crop By-Product Transfer,Crop By-Product Transfer"
On-site Retention - Treat woody biomass from management or a natural disturbance. Woody biomass is retained on-site.,"1342,1343,1344,1345,1346","Woody Residue Treatment,Woody Residue Treatment,Woody Residue Treatment,Woody Residue Treatment,Woody Residue Treatment"
Off-site Removal - Treat woody biomass from management or a natural disturbance. Woody biomass is removed off-site.,"1347,1348,1349,1350,1351","Woody Residue Treatment,Woody Residue Treatment,Woody Residue Treatment,Woody Residue Treatment,Woody Residue Treatment"
Solid Separation - Install a filtration or screening device used to partition solids and/or nutrients from a waste stream.,"1352,1353,1354,1355","Waste Separation Facility,Waste Separation Facility,Waste Separation Facility,Waste Separation Facility"
"Waste Treatment - Use unique or innovative mechanical, chemical or biological technologies that change the characteristics of manure and agricultural waste.","1356,1357,1358,1359,1360,1361","Waste Treatment,Waste Treatment,Waste Treatment,Waste Treatment,Waste Treatment,Waste Treatment"
CRP Re-enrollment - Maintain existing permanent salt tolerant vegetation to meet the planned CRP objectives.,"1362,1363,1364,1365","Salinity and Sodic Soil Management,Salinity and Sodic Soil Management,Salinity and Sodic Soil Management,Salinity and Sodic Soil Management"
"Salinity and sodic soil management - Manage the land, water and plants to reduce accumulations of salts and/or sodium on the soil surface and in the crop rooting zone.","1366,1367,1368,1369,1370,1371,1372,1373","Salinity and Sodic Soil Management,Salinity and Sodic Soil Management,Salinity and Sodic Soil Management,Salinity and Sodic Soil Management,Salinity and Sodic Soil Management,Salinity and Sodic Soil Management,Salinity and Sodic Soil Management,Salinity and Sodic Soil Management"
"No-till - Minimize soil disturbance by limiting tillage to only planting and manage the amount, orientation and distribution of all residues to provide cover on the soil surface throughout the year.","1374,1375,1376,1377,1378,1379,1380,1381,1382,1383,1384,1385,1386,1387,1388,1389,1390,1391,1392,1393,1394,1395,1396,1397","""Residue and Tillage Management, No Till"",""Residue and Tillage Management, No Till"",""Residue and Tillage Management, No Till"",""Residue and Tillage Management, No Till"",""Residue and Tillage Management, No Till"",""Residue and Tillage Management, No Till"",""Residue and Tillage Management, No Till"",""Residue and Tillage Management, No Till"",""Residue and Tillage Management, No Till"",""Residue and Tillage Management, No Till"",""Residue and Tillage Management, No Till"",""Residue and Tillage Management, No Till"",""Residue and Tillage Management, No Till"",""Residue and Tillage Management, No Till"",""Residue and Tillage Management, No Till"",""Residue and Tillage Management, No Till"",""Residue and Tillage Management, No Till"",""Residue and Tillage Management, No Till"",""Residue and Tillage Management, No Till"",""Residue and Tillage Management, No Till"",""Residue and Tillage Management, No Till"",""Residue and Tillage Management, No Till"",""Residue and Tillage Management, No Till"",""Residue and Tillage Management, No Till"""
"Strip-till - Minimize soil disturbance by limiting tillage to only in-row narrow tillage prior to planting and during planting and manage the amount, orientation and distribution of all residues to provide cover on the soil surface throughout the year.","1398,1399,1400,1401,1402,1403,1404,1405,1406,1407,1408,1409,1410,1411,1412,1413,1414,1415,1416,1417,1418,1419","""Residue and Tillage Management, No Till"",""Residue and Tillage Management, No Till"",""Residue and Tillage Management, No Till"",""Residue and Tillage Management, No Till"",""Residue and Tillage Management, No Till"",""Residue and Tillage Management, No Till"",""Residue and Tillage Management, No Till"",""Residue and Tillage Management, No Till"",""Residue and Tillage Management, No Till"",""Residue and Tillage Management, No Till"",""Residue and Tillage Management, No Till"",""Residue and Tillage Management, No Till"",""Residue and Tillage Management, No Till"",""Residue and Tillage Management, No Till"",""Residue and Tillage Management, No Till"",""Residue and Tillage Management, No Till"",""Residue and Tillage Management, No Till"",""Residue and Tillage Management, No Till"",""Residue and Tillage Management, No Till"",""Residue and Tillage Management, No Till"",""Residue and Tillage Management, No Till"",""Residue and Tillage Management, No Till"""
"Reduced tillage - Minimize soil disturbance by reducing the number and type of yearly tillage operations to manage the amount, orientation and distribution of crop and plant residues.","1420,1421,1422,1423,1424,1425,1426,1427,1428,1429,1430,1431,1432,1433,1434,1435,1436,1437,1438,1439,1440,1441,1442","""Residue and Tillage Management, Reduced"",""Residue and Tillage Management, Reduced"",""Residue and Tillage Management, Reduced"",""Residue and Tillage Management, Reduced"",""Residue and Tillage Management, Reduced"",""Residue and Tillage Management, Reduced"",""Residue and Tillage Management, Reduced"",""Residue and Tillage Management, Reduced"",""Residue and Tillage Management, Reduced"",""Residue and Tillage Management, Reduced"",""Residue and Tillage Management, Reduced"",""Residue and Tillage Management, Reduced"",""Residue and Tillage Management, Reduced"",""Residue and Tillage Management, Reduced"",""Residue and Tillage Management, Reduced"",""Residue and Tillage Management, Reduced"",""Residue and Tillage Management, Reduced"",""Residue and Tillage Management, Reduced"",""Residue and Tillage Management, Reduced"",""Residue and Tillage Management, Reduced"",""Residue and Tillage Management, Reduced"",""Residue and Tillage Management, Reduced"",""Residue and Tillage Management, Reduced"""
"Existing Vegetation Treatment - Manage or manipulate existing vegetation to support desired plant composition and/or structure, resulting in a multi-layered cropping system.","1443,1444,1445,1446,1447,1448,1449,1450,1451,1452","Forest Farming,Forest Farming,Forest Farming,Forest Farming,Forest Farming,Forest Farming,Forest Farming,Forest Farming,Forest Farming,Forest Farming"
Establishment - Establish desired woody plant species to develop a multi-layered cropping system.,"1453,1454,1455,1456,1457,1458,1459,1460,1461,1462","Forest Farming,Forest Farming,Forest Farming,Forest Farming,Forest Farming,Forest Farming,Forest Farming,Forest Farming,Forest Farming,Forest Farming"
Sinkhole Treatment - Treat the existing sinkhole(s) to reduce erosion and contamination of surface and groundwater resources.,"1463,1464,1465,1466","Sinkhole Treatment,Sinkhole Treatment,Sinkhole Treatment,Sinkhole Treatment"
Concrete storage and handling pad - Construct a facility with an impervious surface to provide an environmentally safe area for the handling of on-farm agrichemicals.,"1467,1468","Agrichemical Handling Facility,Agrichemical Handling Facility"
"Field Operations - Form ridges by tillage, planting, or other operations aligned perpendicular to prevailing wind direction during critical wind erosion periods to reduce wind erosion, improve plant productivity and health, and reduce emission of particulate matter from windblown dust.","1469,1470,1471,1472,1473","Crosswind Ridges,Crosswind Ridges,Crosswind Ridges,Crosswind Ridges,Crosswind Ridges"
"Closure and Treatment - Close roads, trails and/or landings to meet conservation objectives.","1474,1475,1476,1477,1478,1479,1480,1481,1482,1483,1484","Road/Trail/Landing Closure and Treatment,Road/Trail/Landing Closure and Treatment,Road/Trail/Landing Closure and Treatment,Road/Trail/Landing Closure and Treatment,Road/Trail/Landing Closure and Treatment,Road/Trail/Landing Closure and Treatment,Road/Trail/Landing Closure and Treatment,Road/Trail/Landing Closure and Treatment,Road/Trail/Landing Closure and Treatment,Road/Trail/Landing Closure and Treatment,Road/Trail/Landing Closure and Treatment"
"Irrigation ditch lining - Install a lining of impervious material or chemical treatment in an irrigation ditch, canal, or lateral.","1485,1486,1487,1488,1489,1490","Irrigation Ditch Lining,Irrigation Ditch Lining,Irrigation Ditch Lining,Irrigation Ditch Lining,Irrigation Ditch Lining,Irrigation Ditch Lining"
"Irrigation pipeline - Install a pipeline and appurtenances to convey water for storage or application, reduce energy use, or develop renewable energy systems as part of an irrigation water system.","1491,1492,1493,1494","Irrigation Pipeline,Irrigation Pipeline,Irrigation Pipeline,Irrigation Pipeline"
"Mobile engine replacement, repower, or retrofit - Replace, repower, or retrofit an existing mobile engine to reduce air emissions.","1495,1496,1497","Combustion System Improvement,Combustion System Improvement,Combustion System Improvement"
"Stationary engine to engine replacement, repower, or retrofit - Replace or repower an existing stationary engine with a lower-emitting stationary engine or retrofit an existing stationary engine to reduce air emissions.","1498,1499,1500","Combustion System Improvement,Combustion System Improvement,Combustion System Improvement"
"Non-engine combustion source air emissions improvement - Replace, repower, or retrofit an existing non-engine combustion system with a lower-emissions alternative combustion system.","1501,1502,1503","Combustion System Improvement,Combustion System Improvement,Combustion System Improvement"
Stationary engine to electric motor replacement or repower - Replace or repower an existing stationary engine with an electric motor.,"1504,1505,1506,1507","Combustion System Improvement,Combustion System Improvement,Combustion System Improvement,Combustion System Improvement"
Non-engine combustion source energy efficiency improvement - Install a replacement non-engine combustion system on a product processing operation such as a coffee conveyance system or reverse osmosis system for tree sap processing.,1508,Combustion System Improvement
Dust suppressant application - Apply a dust suppressant on an unpaved road or other vehicle travel surface to reduce dust emissions from vehicle and machinery traffic or wind action.,"1509,1510","Dust Control on Unpaved Roads and Surfa,Dust Control on Unpaved Roads and Surfa"
"Herbaceous Weed Treatment - Remove or treat herbaceous weeds including invasive, noxious and prohibited plants using chemical, biological or mechanical methods, either alone or in combination to meet management objectives.","1511,1512,1513,1514","Herbaceous Weed Treatment,Herbaceous Weed Treatment,Herbaceous Weed Treatment,Herbaceous Weed Treatment"
General - Install an energy efficient device in an agricultural operation.,"1515,1516,1517,1518,1519,1520,1521","Energy Efficient Agricultural Operation,Energy Efficient Agricultural Operation,Energy Efficient Agricultural Operation,Energy Efficient Agricultural Operation,Energy Efficient Agricultural Operation,Energy Efficient Agricultural Operation,Energy Efficient Agricultural Operation"
Greenhouse Heating - Replace forced air with a radiant heating device in a greenhouse operation.,"1522,1523,1524,1525,1526,1527,1528","Energy Efficient Agricultural Operation,Energy Efficient Agricultural Operation,Energy Efficient Agricultural Operation,Energy Efficient Agricultural Operation,Energy Efficient Agricultural Operation,Energy Efficient Agricultural Operation,Energy Efficient Agricultural Operation"
Grain Dryer - Replace an existing grain dryer with an energy efficient grain dryer on a crop based agricultural operation.,"1529,1530,1531,1532,1533,1534,1535","Energy Efficient Agricultural Operation,Energy Efficient Agricultural Operation,Energy Efficient Agricultural Operation,Energy Efficient Agricultural Operation,Energy Efficient Agricultural Operation,Energy Efficient Agricultural Operation,Energy Efficient Agricultural Operation"
Cooler - Install a scroll compressor on a cooler.,"1536,1537,1538,1539,1540,1541,1542","Energy Efficient Agricultural Operation,Energy Efficient Agricultural Operation,Energy Efficient Agricultural Operation,Energy Efficient Agricultural Operation,Energy Efficient Agricultural Operation,Energy Efficient Agricultural Operation,Energy Efficient Agricultural Operation"
Dairy Parlor - Install a vacuum pump VSD or plate cooler in a dairy operation.,"1543,1544,1545,1546,1547,1548,1549","Energy Efficient Agricultural Operation,Energy Efficient Agricultural Operation,Energy Efficient Agricultural Operation,Energy Efficient Agricultural Operation,Energy Efficient Agricultural Operation,Energy Efficient Agricultural Operation,Energy Efficient Agricultural Operation"
Poultry or Swine Heating - Replace forced air with a radiant heating device in a poultry or swine operation.,"1550,1551,1552,1553,1554,1555,1556","Energy Efficient Agricultural Operation,Energy Efficient Agricultural Operation,Energy Efficient Agricultural Operation,Energy Efficient Agricultural Operation,Energy Efficient Agricultural Operation,Energy Efficient Agricultural Operation,Energy Efficient Agricultural Operation"
Syrup Processing - Replace an existing tree sap processing device with a high efficiency device.,"1557,1558,1559,1560,1561,1562,1563","Energy Efficient Agricultural Operation,Energy Efficient Agricultural Operation,Energy Efficient Agricultural Operation,Energy Efficient Agricultural Operation,Energy Efficient Agricultural Operation,Energy Efficient Agricultural Operation,Energy Efficient Agricultural Operation"
General - Install an energy efficient lighting system or lighting component on an agricultural operation. Lighting system consists of one or more interior or exterior lights.,1564,Energy Efficient Lighting System
"Poultry or Swine - Install an energy efficient lighting system on a swine, poultry, or turkey operation where animals are housed.",1565,Energy Efficient Lighting System
Dairy - Install an energy efficient lighting system on a dairy where animals are housed.,1566,Energy Efficient Lighting System
Greenhouse - Install an energy efficient lighting system in a greenhouse.,1567,Energy Efficient Lighting System
General - Retrofit an agricultural structure with an energy efficient building envelope application.,1568,Energy Efficient Building Envelope
Greenhouse Insulation - Retrofit a greenhouse with wall insulation.,1569,Energy Efficient Building Envelope
Greenhouse Energy Screens - Retrofit a greenhouse with energy screens.,1570,Energy Efficient Building Envelope
Poultry Insulation - Retrofit poultry housing by adding wall or ceiling insulation.,1571,Energy Efficient Building Envelope
Poultry Air Leakage - Retrofit poultry housing by sealing air leaks.,1572,Energy Efficient Building Envelope
"Distribution - Install livestock shelter structure to improve the distribution of grazing animals, to enhance wildlife habitat, reduce over-used areas, or correct other resource concerns resulting from improper animal distribution.",1573,Livestock Shelter Structure
Secondary Containment - Construct a permanent facility to provide secondary containment of oil and oil productsÂ used onfarm.,"1574,1575","On-Farm Secondary Containment Facility,On-Farm Secondary Containment Facility"
"Short Term Storage - Use temporary, nonstructural measures to store solid or semisolid organic agricultural waste or manure (stackable livestock and poultry manure, bedding, litter, spilled feed, or soil mixed with manure) on a short-term basis between collection and utilization.","1576,1577","Short Term Storage of Animal Waste and Byproducts,Short Term Storage of Animal Waste and Byproducts"
"Structures for Wildlife - Install a structure to replace or modify a missing or deficient wildlife habitat component.  This includes installing structures to provide loafing, escape, nesting, rearing, roosting, perching and / or basking habitat and modification of existing structures to minimize the risks of injury or mortality to wildlife.","1578,1579","Structures for Wildlife,Structures for Wildlife"
"High Tunnel - Install a High Tunnel System to cover and protect crops from sun, wind, excessive rainfall, or cold, to extend the growing season in an environmentally safe manner.","1580,1581","High Tunnel System,High Tunnel System"
Burial - Manage animal carcasses from catastrophic mortality events by burial.,"1582,1583","Emergency Animal Mortality Management,Emergency Animal Mortality Management"
"Offsite - Move animal carcasses from catastrophic mortality events offsite where mortality is treated via landfill, rendering, or other methods.","1584,1585,1586,1587","Emergency Animal Mortality Management,Emergency Animal Mortality Management,Emergency Animal Mortality Management,Emergency Animal Mortality Management"
Composting - Manage animal carcasses from catastrophic mortality events by composting.,"1588,1589,1590,1591","Emergency Animal Mortality Management,Emergency Animal Mortality Management,Emergency Animal Mortality Management,Emergency Animal Mortality Management"
Burning - Manage animal carcasses from catastrophic mortality events by incineration or open burning.,"1592,1593,1594,1595","Emergency Animal Mortality Management,Emergency Animal Mortality Management,Emergency Animal Mortality Management,Emergency Animal Mortality Management"
Denitrifying Bioreactor - Install a structure that uses a carbon source to reduce the concentration of nitrate nitrogen in subsurface agriculture drainage flow via enhanced denitrification. ,"1596,1597","Denitrifying Bioreactor,Denitrifying Bioreactor"
Improve Infiltration - Apply gypsum (calcium sulfate dihydrate) products to change the physical and/or chemical properties of soil to increase infiltration and improve soil health (aggregate stability) and improve plant vigor.,"1598,1599,1600,1601,1602,1603,1604","Amending Soil Properties with Gypsum Pr,Amending Soil Properties with Gypsum Pr,Amending Soil Properties with Gypsum Pr,Amending Soil Properties with Gypsum Pr,Amending Soil Properties with Gypsum Pr,Amending Soil Properties with Gypsum Pr,Amending Soil Properties with Gypsum Pr"
Dissolved phosphorus - Apply gypsum (calcium sulfate dihydrate) products to change the physical and/or chemical properties of soil to reduce dissolved phosphorus in surface water runoff or in subsurface tile drainage.  ,"1605,1606,1607,1608,1609,1610,1611,1612","Amending Soil Properties with Gypsum Pr,Amending Soil Properties with Gypsum Pr,Amending Soil Properties with Gypsum Pr,Amending Soil Properties with Gypsum Pr,Amending Soil Properties with Gypsum Pr,Amending Soil Properties with Gypsum Pr,Amending Soil Properties with Gypsum Pr,Amending Soil Properties with Gypsum Pr"
Controlled traffic - Confine all high load wheel/track traffic from farm equipment to specific lanes or tramlines (traffic pattern) in crop fields year after year. ,"1613,1614,1615,1616","Controlled Traffic Farming,Controlled Traffic Farming,Controlled Traffic Farming,Controlled Traffic Farming"
"PM Reduction - Adjust field operations to reduce particulate matter emissions from field operations.  Utilize methods such as combined tillage operations, equipment adjustments, operating procedures, irrigation chemical or nutrient application and similar.","1617,1618,1619,1620","Field Operations Emissions Reduction,Field Operations Emissions Reduction,Field Operations Emissions Reduction,Field Operations Emissions Reduction"
Compacted Soil Lining Petroleum - Install a compacted soil liner in a constructed containment impoundment.,1621,"""Pond Sealing or Lining, Compacted Soil """
Compacted Soil Lining Fresh Water - Install a compacted soil liner in a constructed fresh water impoundment.,"1622,1623,1624,1625,1626","""Pond Sealing or Lining, Compacted Soil "",""Pond Sealing or Lining, Compacted Soil "",""Pond Sealing or Lining, Compacted Soil "",""Pond Sealing or Lining, Compacted Soil "",""Pond Sealing or Lining, Compacted Soil """
Compacted Soil Lining Waste Water - Install a compacted soil liner in a constructed waste water impoundment.,"1627,1628,1629","""Pond Sealing or Lining, Compacted Soil "",""Pond Sealing or Lining, Compacted Soil "",""Pond Sealing or Lining, Compacted Soil """
Concrete Lining Fresh - Install a concrete liner in a constructed fresh water impoundment.,"1630,1631,1632,1633","Pond Sealing or Lining - Concrete,Pond Sealing or Lining - Concrete,Pond Sealing or Lining - Concrete,Pond Sealing or Lining - Concrete"
Concrete Lining Petroleum - Install a concrete liner in a constructed containment impoundment.,1634,Pond Sealing or Lining - Concrete
Concrete Lining added to EXISTING Waste storage - Install a concrete liner in an EXISTING constructed waste water impoundment.,"1635,1636","Pond Sealing or Lining - Concrete,Pond Sealing or Lining - Concrete"
Concrete Lining Waste Water - Install a concrete liner in a constructed waste water impoundment.,"1637,1638,1639","Pond Sealing or Lining - Concrete,Pond Sealing or Lining - Concrete,Pond Sealing or Lining - Concrete"
"Subsurface distribution for buffers - Install a subsurface, perforated distribution pipe used to divert and spread drainage system discharge to a vegetated area to increase soil saturation, reduce nitrate loading from subsurface drain outlets and/or enhance or restore saturated soil conditions in riverine, lacustrine fringe, slope, or depression hydrogeomorphic landscape classes.","1640,1641,1642,1643,1644","Saturated Buffer,Saturated Buffer,Saturated Buffer,Saturated Buffer,Saturated Buffer"
"Wildlife Habitat Planting - Establish wildlife habitat by planting herbaceous vegetation or shrubs when wildlife habitat evaluation indicates a benefit in altering the current vegetative conditions (species diversity, richness, structure and pattern).  Implementation will meet minimum NRCS planning criteria of '50' percent of the habitat potential for the species of concern'' as identified in a State-approved habitat evaluation protocol (e.g., Wildlife Habitat Evaluation Guide).","1645,1646,1647,1648,1649,1650,1651,1652","Wildlife Habitat Planting,Wildlife Habitat Planting,Wildlife Habitat Planting,Wildlife Habitat Planting,Wildlife Habitat Planting,Wildlife Habitat Planting,Wildlife Habitat Planting,Wildlife Habitat Planting"
Add Liner to EXISTING Waste storage - Install a geomembrane or geoclay liner in an EXISTING constructed waste water impoundment.,"1653,1654","""Pond Sealing or Lining, Geomembrane or "",""Pond Sealing or Lining, Geomembrane or """
Pond Liner - Install a geomembrane or geosynthetic clay liner in a constructed fresh water impoundment.,"1655,1656,1657,1658,1659","""Pond Sealing or Lining, Geomembrane or "",""Pond Sealing or Lining, Geomembrane or "",""Pond Sealing or Lining, Geomembrane or "",""Pond Sealing or Lining, Geomembrane or "",""Pond Sealing or Lining, Geomembrane or """
Liner Waste water - Install a geomembrane or geosynthetic clay liner in a constructed waste water impoundment.,"1660,1661,1662,1663","""Pond Sealing or Lining, Geomembrane or "",""Pond Sealing or Lining, Geomembrane or "",""Pond Sealing or Lining, Geomembrane or "",""Pond Sealing or Lining, Geomembrane or """
CRP Re-enrollment - Maintain existing cross wind trap strips to meet the planned CRP objectives.,"1664,1665,1666,1667","Cross Wind Trap Strips,Cross Wind Trap Strips,Cross Wind Trap Strips,Cross Wind Trap Strips"
General - Establish herbaceous vegetation in one or more strips typically perpendicular to the most erosive wind direction.,"1668,1669,1670,1671,1672,1673,1674,1675","Cross Wind Trap Strips,Cross Wind Trap Strips,Cross Wind Trap Strips,Cross Wind Trap Strips,Cross Wind Trap Strips,Cross Wind Trap Strips,Cross Wind Trap Strips,Cross Wind Trap Strips"