[
    {
      "type": "farmos",
      "time": 1685991029676,
      "entity": {
        "type": "quantity--standard",
        "id": "19931bb7-f0a2-4a01-acdd-ec9783d03c1a",
        "attributes": {
          "relationships": {
            "units": {
              "data": [
                {
                  "type": "taxonomy_term--unit",
                  "name": "%"
                }
              ]
            }
          },
          "value": {
            "decimal": 100
          },
          "label": "area"
        }
      }
    },
    {
      "type": "farmos",
      "farmosType": "log",
      "time": 1685991029676,
      "entity": {
        "type": "log--activity",
        "attributes": {
          "name": "start grazing  a",
          "status": "done",
          "notes": {
            "value": " ",
            "format": "default"
          },
          "timestamp": 1685937600
        },
        "relationships": {
          "asset": {
            "data": [
              {
                "type": "asset--plant"
              }
            ]
          },
          "category": {
            "data": [
              {
                "type": "taxonomy_term--log_category",
                "name": "grazing"
              }
            ]
          },
          "quantity": {
            "data": [
              {
                "type": "quantity--standard",
                "id": "19931bb7-f0a2-4a01-acdd-ec9783d03c1a"
              }
            ]
          }
        }
      }
    },
    {
      "type": "farmos",
      "time": 1685991029676,
      "entity": {
        "type": "quantity--standard",
        "id": "b63d5fe5-a27a-41af-8720-950555acde07",
        "attributes": {
          "relationships": {
            "units": {
              "data": [
                {
                  "type": "taxonomy_term--unit",
                  "name": "%"
                }
              ]
            }
          },
          "value": {
            "decimal": 100
          },
          "label": "area"
        }
      }
    },
    {
      "type": "farmos",
      "farmosType": "log",
      "time": 1685991029676,
      "entity": {
        "type": "log--activity",
        "attributes": {
          "name": "end grazing  a",
          "status": "done",
          "notes": {
            "value": " ",
            "format": "default"
          },
          "timestamp": 1687320000
        },
        "relationships": {
          "asset": {
            "data": [
              {
                "type": "asset--plant"
              }
            ]
          },
          "category": {
            "data": [
              {
                "type": "taxonomy_term--log_category",
                "name": "grazing"
              }
            ]
          },
          "quantity": {
            "data": [
              {
                "type": "quantity--standard",
                "id": "b63d5fe5-a27a-41af-8720-950555acde07"
              }
            ]
          }
        }
      }
    }
  ]