[
    {
      "type": "farmos",
      "url": "oursci.farmos.net",
      "time": 1685991773977,
      "entity": {
        "type": "asset--plant",
        "id": "20b5cc46-db44-414d-985c-42b7ef2cd5c1",
        "attributes": {
          "name": "23-06-05 evercrisp, alfalfa",
          "status": "active",
          "geometry": null,
          "notes": {
            "value": "blah",
            "format": "default"
          },
          "flag": [
            "regenerative"
          ]
        },
        "relationships": {
          "plant_type": {
            "data": [
              {
                "type": "taxonomy_term--plant_type",
                "name": "alfalfa"
              },
              {
                "type": "taxonomy_term--plant_type",
                "name": "evercrisp"
              }
            ]
          },
          "season": {
            "data": [
              {
                "type": "taxonomy_term--season",
                "name": "2023"
              }
            ]
          }
        }
      }
    },
    {
      "type": "farmos",
      "url": "oursci.farmos.net",
      "time": 1685991773977,
      "entity": {
        "type": "log--seeding",
        "attributes": {
          "timestamp": "1685851200",
          "name": "seeding evercrisp, alfalfa",
          "status": "done",
          "is_movement": false,
          "notes": {
            "value": "blah",
            "format": "default"
          },
          "seed_source": "sementes vivas"
        },
        "relationships": {
          "asset": {
            "data": [
              {
                "type": "asset--plant",
                "id": "20b5cc46-db44-414d-985c-42b7ef2cd5c1"
              }
            ]
          },
          "category": {
            "data": [
              {
                "type": "taxonomy_term--log_category",
                "name": "seeding"
              }
            ]
          }
        }
      }
    },
    {
      "type": "farmos",
      "url": "oursci.farmos.net",
      "time": 1685991773978,
      "entity": {
        "type": "quantity--standard",
        "id": "9940bb70-51e6-47d3-9b0d-c0bf00f42fa5",
        "attributes": {
          "relationships": {
            "units": {
              "data": [
                {
                  "type": "taxonomy_term--unit",
                  "name": "%"
                }
              ]
            }
          },
          "value": {
            "decimal": 1
          },
          "label": "area"
        }
      }
    },
    {
      "type": "farmos",
      "url": "oursci.farmos.net",
      "time": 1685991773978,
      "entity": {
        "type": "quantity--standard",
        "id": "b9ca19ef-f8f4-4223-b76f-f8d9ac8d1f60",
        "attributes": {
          "relationships": {
            "units": {
              "data": [
                {
                  "type": "taxonomy_term--unit",
                  "name": "ft"
                }
              ]
            }
          },
          "value": {
            "decimal": 1
          },
          "label": "bed_width"
        }
      }
    },
    {
      "type": "farmos",
      "url": "oursci.farmos.net",
      "time": 1685991773978,
      "entity": {
        "type": "quantity--standard",
        "id": "247c4437-4636-45c2-8b22-64dd2a8f59f7",
        "attributes": {
          "relationships": {
            "units": {
              "data": [
                {
                  "type": "taxonomy_term--unit",
                  "name": "lbs_per_ac"
                }
              ]
            }
          },
          "value": {
            "decimal": 1
          },
          "label": "seeding_rate"
        }
      }
    },
    {
      "type": "farmos",
      "url": "oursci.farmos.net",
      "time": 1685991773977,
      "entity": {
        "type": "log--transplanting",
        "attributes": {
          "timestamp": "1685937600",
          "name": "transplanting alfalfa to City 19",
          "status": "done",
          "is_movement": true,
          "notes": {
            "value": "blah",
            "format": "default"
          }
        },
        "relationships": {
          "asset": {
            "data": [
              {
                "type": "asset--plant",
                "id": "20b5cc46-db44-414d-985c-42b7ef2cd5c1"
              }
            ]
          },
          "category": {
            "data": [
              {
                "type": "taxonomy_term--log_category",
                "name": "transplanting"
              }
            ]
          },
          "location": {
            "data": [
              {
                "type": "asset--land",
                "id": "5a169bc0-06a5-48a8-8f50-bbc6e70eebc3"
              }
            ]
          },
          "quantity": {
            "data": [
              {
                "type": "quantity--standard",
                "id": "9940bb70-51e6-47d3-9b0d-c0bf00f42fa5"
              },
              {
                "type": "quantity--standard",
                "id": "b9ca19ef-f8f4-4223-b76f-f8d9ac8d1f60"
              },
              {
                "type": "quantity--standard",
                "id": "247c4437-4636-45c2-8b22-64dd2a8f59f7"
              }
            ]
          }
        }
      }
    },
    {
      "type": "farmos",
      "url": "oursci.farmos.net",
      "time": 1685991773978,
      "entity": {
        "type": "quantity--material",
        "id": "d30e849f-2432-4e16-a219-4c16eb43cfb8",
        "attributes": {
          "relationships": {
            "material_type": {
              "data": [
                {
                  "type": "taxonomy_term--material_type",
                  "name": "basalt"
                }
              ]
            }
          }
        }
      }
    },
    {
      "type": "farmos",
      "url": "oursci.farmos.net",
      "time": 1685991773978,
      "entity": {
        "type": "log--input",
        "attributes": {
          "timestamp": "1685937600",
          "name": "seedling treatment basalt",
          "status": "done",
          "notes": {
            "value": "blah",
            "format": "default"
          }
        },
        "relationships": {
          "asset": {
            "data": [
              {
                "type": "asset--plant",
                "id": "20b5cc46-db44-414d-985c-42b7ef2cd5c1"
              }
            ]
          },
          "category": {
            "data": [
              {
                "type": "taxonomy_term--log_category",
                "name": "seeding"
              },
              {
                "type": "taxonomy_term--log_category",
                "name": "amendment"
              }
            ]
          },
          "quantity": {
            "data": [
              {
                "type": "quantity--material",
                "id": "d30e849f-2432-4e16-a219-4c16eb43cfb8"
              }
            ]
          }
        }
      }
    },
    {
      "type": "farmos",
      "url": "oursci.farmos.net",
      "time": 1685991773978,
      "entity": {
        "type": "quantity--material",
        "id": "11ef1477-ac8e-453a-89c3-ccdbb32b582b",
        "attributes": {
          "relationships": {
            "material_type": {
              "data": [
                {
                  "type": "taxonomy_term--material_type",
                  "name": "bark_dust"
                }
              ]
            }
          }
        }
      }
    },
    {
      "type": "farmos",
      "url": "oursci.farmos.net",
      "time": 1685991773978,
      "entity": {
        "type": "log--input",
        "attributes": {
          "timestamp": "1685851200",
          "name": "seed treatment bark dust, fungicide",
          "status": "done",
          "notes": {
            "value": "blah",
            "format": "default"
          }
        },
        "relationships": {
          "asset": {
            "data": [
              {
                "type": "asset--plant",
                "id": "20b5cc46-db44-414d-985c-42b7ef2cd5c1"
              }
            ]
          },
          "category": {
            "data": [
              {
                "type": "taxonomy_term--log_category",
                "name": "seeding"
              },
              {
                "type": "taxonomy_term--log_category",
                "name": "pest_disease_control"
              }
            ]
          },
          "quantity": {
            "data": [
              {
                "type": "quantity--material",
                "id": "11ef1477-ac8e-453a-89c3-ccdbb32b582b"
              }
            ]
          }
        }
      }
    },
    {
      "type": "farmos",
      "url": "oursci.farmos.net",
      "time": 1685991773978,
      "entity": {
        "type": "quantity--standard",
        "id": "ab607cd5-1b77-4bd7-8d5d-cd70f5134f18",
        "attributes": {
          "relationships": {
            "units": {
              "data": [
                {
                  "type": "taxonomy_term--unit",
                  "name": "bu_acre"
                }
              ]
            }
          },
          "value": {
            "decimal": 1
          },
          "label": "yield"
        }
      }
    },
    {
      "type": "farmos",
      "url": "oursci.farmos.net",
      "time": 1685991773978,
      "entity": {
        "type": "log--harvest",
        "attributes": {
          "timestamp": "1685937600",
          "name": "termination 1 bu acre",
          "status": "done",
          "is_termination": true,
          "notes": {
            "value": "blah",
            "format": "default"
          }
        },
        "relationships": {
          "asset": {
            "data": [
              {
                "type": "asset--plant",
                "id": "20b5cc46-db44-414d-985c-42b7ef2cd5c1"
              }
            ]
          },
          "category": {
            "data": [
              {
                "type": "taxonomy_term--log_category",
                "name": "termination"
              },
              [
                {
                  "type": "taxonomy_term--log_category",
                  "name": "harvest"
                }
              ]
            ]
          },
          "quantity": {
            "data": [
              {
                "type": "quantity--standard",
                "id": "ab607cd5-1b77-4bd7-8d5d-cd70f5134f18"
              }
            ]
          }
        }
      }
    }
  ]