[
    {
      "type": "farmos",
      "time": 1685991604859,
      "entity": {
        "type": "quantity--standard",
        "id": "2b764962-ffb4-4858-bab5-02e1e3501937",
        "attributes": {
          "relationships": {
            "units": {
              "data": [
                {
                  "type": "taxonomy_term--unit",
                  "name": "%"
                }
              ]
            }
          },
          "value": {
            "decimal": 100
          },
          "label": "area"
        }
      }
    },
    {
      "type": "farmos",
      "time": 1685991604859,
      "entity": {
        "type": "quantity--material",
        "id": "46db154a-1e58-4814-a24f-48aefcdded22",
        "attributes": {
          "relationships": {
            "material_type": {
              "data": [
                {
                  "type": "taxonomy_term--material_type",
                  "name": "biosolids"
                }
              ]
            }
          },
          "label": "quantity"
        }
      }
    },
    {
      "type": "farmos",
      "farmosType": "log",
      "time": 1685991604859,
      "entity": {
        "type": "log--input",
        "attributes": {
          "timestamp": "1685937600",
          "name": "biosolids",
          "status": "done",
          "notes": {
            "value": "",
            "format": "default"
          }
        },
        "relationships": {
          "asset": {
            "data": [
              {
                "type": "asset--plant"
              }
            ]
          },
          "category": {
            "data": [
              {
                "type": "taxonomy_term--log_category",
                "name": "amendment"
              }
            ]
          },
          "quantity": {
            "data": [
              {
                "type": "quantity--standard",
                "id": "2b764962-ffb4-4858-bab5-02e1e3501937"
              },
              {
                "type": "quantity--material",
                "id": "46db154a-1e58-4814-a24f-48aefcdded22"
              }
            ]
          }
        }
      }
    }
  ]