[
    {
      "type": "farmos",
      "time": 1685991634130,
      "entity": {
        "type": "quantity--standard",
        "id": "c71d5639-5c31-4242-9966-40d3dacc41f4",
        "attributes": {
          "relationships": {
            "units": {
              "data": [
                {
                  "type": "taxonomy_term--unit",
                  "name": "%"
                }
              ]
            }
          },
          "value": {
            "decimal": 100
          },
          "label": "area"
        }
      }
    },
    {
      "type": "farmos",
      "time": 1685991634130,
      "entity": {
        "type": "quantity--material",
        "id": "62df23aa-e276-4c2d-91ca-9aecebb9d194",
        "attributes": {
          "relationships": {
            "units": {
              "data": [
                {
                  "type": "taxonomy_term--unit",
                  "name": "lbs"
                }
              ]
            },
            "material_type": {
              "data": [
                {
                  "type": "taxonomy_term--material_type",
                  "name": "biosolids"
                }
              ]
            }
          },
          "value": {
            "decimal": 1
          },
          "label": "quantity"
        }
      }
    },
    {
      "type": "farmos",
      "time": 1685991634130,
      "entity": {
        "type": "quantity--standard",
        "id": "41e4ef01-5a05-4e10-aeac-803dcda79848",
        "attributes": {
          "relationships": {
            "units": {
              "data": [
                {
                  "type": "taxonomy_term--unit",
                  "name": "%"
                }
              ]
            }
          },
          "value": {
            "decimal": 100
          },
          "label": "moisture"
        }
      }
    },
    {
      "type": "farmos",
      "time": 1685991634130,
      "entity": {
        "type": "quantity--standard",
        "id": "71ed7a29-f8da-4b24-9301-092370bbdb6a",
        "attributes": {
          "relationships": {
            "units": {
              "data": [
                {
                  "type": "taxonomy_term--unit",
                  "name": "%"
                }
              ]
            }
          },
          "value": {
            "decimal": 100
          },
          "label": "n"
        }
      }
    },
    {
      "type": "farmos",
      "time": 1685991634130,
      "entity": {
        "type": "quantity--standard",
        "id": "c06c9c37-c84c-40b9-b488-42441f1e0e7f",
        "attributes": {
          "relationships": {
            "units": {
              "data": [
                {
                  "type": "taxonomy_term--unit",
                  "name": "%"
                }
              ]
            }
          },
          "value": {
            "decimal": 100
          },
          "label": "p"
        }
      }
    },
    {
      "type": "farmos",
      "time": 1685991634130,
      "entity": {
        "type": "quantity--standard",
        "id": "9d7bd72e-2e59-4d58-8558-4a620912fcbb",
        "attributes": {
          "relationships": {
            "units": {
              "data": [
                {
                  "type": "taxonomy_term--unit",
                  "name": "%"
                }
              ]
            }
          },
          "value": {
            "decimal": 100
          },
          "label": "k"
        }
      }
    },
    {
      "type": "farmos",
      "farmosType": "log",
      "time": 1685991634130,
      "entity": {
        "type": "log--input",
        "attributes": {
          "timestamp": "1685937600",
          "name": "biosolids 1 lbs",
          "status": "done",
          "notes": {
            "value": "blah",
            "format": "default"
          },
          "method": "banded"
        },
        "relationships": {
          "asset": {
            "data": [
              {
                "type": "asset--plant"
              }
            ]
          },
          "category": {
            "data": [
              {
                "type": "taxonomy_term--log_category",
                "name": "amendment"
              }
            ]
          },
          "quantity": {
            "data": [
              {
                "type": "quantity--standard",
                "id": "c71d5639-5c31-4242-9966-40d3dacc41f4"
              },
              {
                "type": "quantity--material",
                "id": "62df23aa-e276-4c2d-91ca-9aecebb9d194"
              },
              {
                "type": "quantity--standard",
                "id": "41e4ef01-5a05-4e10-aeac-803dcda79848"
              },
              {
                "type": "quantity--standard",
                "id": "71ed7a29-f8da-4b24-9301-092370bbdb6a"
              },
              {
                "type": "quantity--standard",
                "id": "c06c9c37-c84c-40b9-b488-42441f1e0e7f"
              },
              {
                "type": "quantity--standard",
                "id": "9d7bd72e-2e59-4d58-8558-4a620912fcbb"
              }
            ]
          }
        }
      }
    }
  ]