[
    {
      "type": "farmos",
      "time": 1685991197949,
      "entity": {
        "type": "quantity--standard",
        "id": "b3f1d2dc-d92b-472c-ab1c-26e559c81510",
        "attributes": {
          "relationships": {
            "units": {
              "data": [
                {
                  "type": "taxonomy_term--unit",
                  "name": "%"
                }
              ]
            }
          },
          "value": {
            "decimal": 100
          },
          "label": "area"
        }
      }
    },
    {
      "type": "farmos",
      "time": 1685991197949,
      "entity": {
        "type": "quantity--material",
        "id": "a0140791-a41d-4d09-9448-afc081359279",
        "attributes": {
          "relationships": {
            "units": {
              "data": [
                {
                  "type": "taxonomy_term--unit",
                  "name": "inches"
                }
              ]
            },
            "material_type": {
              "data": [
                {
                  "type": "taxonomy_term--material_type",
                  "name": "well"
                }
              ]
            }
          },
          "value": {
            "decimal": 1
          },
          "label": "quantity"
        }
      }
    },
    {
      "type": "farmos",
      "farmosType": "log",
      "time": 1685991197949,
      "entity": {
        "type": "log--input",
        "attributes": {
          "name": "irrigation well 1 inches",
          "status": "done",
          "notes": {
            "value": "blah",
            "format": "default"
          },
          "timestamp": 1685937600
        },
        "relationships": {
          "asset": {
            "data": [
              {
                "type": "asset--plant"
              }
            ]
          },
          "category": {
            "data": [
              {
                "type": "taxonomy_term--log_category",
                "name": "irrigation"
              }
            ]
          },
          "quantity": {
            "data": [
              {
                "type": "quantity--standard",
                "id": "b3f1d2dc-d92b-472c-ab1c-26e559c81510"
              },
              {
                "type": "quantity--material",
                "id": "a0140791-a41d-4d09-9448-afc081359279"
              }
            ]
          }
        }
      }
    },
    {
      "type": "farmos",
      "time": 1685991197950,
      "entity": {
        "type": "quantity--standard",
        "id": "a8fe55ba-aa8a-405f-822f-5cc7ef435d17",
        "attributes": {
          "relationships": {
            "units": {
              "data": [
                {
                  "type": "taxonomy_term--unit",
                  "name": "%"
                }
              ]
            }
          },
          "value": {
            "decimal": 100
          },
          "label": "area"
        }
      }
    },
    {
      "type": "farmos",
      "time": 1685991197950,
      "entity": {
        "type": "quantity--material",
        "id": "eb485a19-823e-4841-96fb-16189ec26787",
        "attributes": {
          "relationships": {
            "units": {
              "data": [
                {
                  "type": "taxonomy_term--unit",
                  "name": "inches"
                }
              ]
            },
            "material_type": {
              "data": [
                {
                  "type": "taxonomy_term--material_type",
                  "name": "well"
                }
              ]
            }
          },
          "value": {
            "decimal": 1
          },
          "label": "quantity"
        }
      }
    },
    {
      "type": "farmos",
      "farmosType": "log",
      "time": 1685991197949,
      "entity": {
        "type": "log--input",
        "attributes": {
          "name": "irrigation well 1 inches",
          "status": "done",
          "notes": {
            "value": "blah",
            "format": "default"
          },
          "timestamp": 1691121600
        },
        "relationships": {
          "asset": {
            "data": [
              {
                "type": "asset--plant"
              }
            ]
          },
          "category": {
            "data": [
              {
                "type": "taxonomy_term--log_category",
                "name": "irrigation"
              }
            ]
          },
          "quantity": {
            "data": [
              {
                "type": "quantity--standard",
                "id": "a8fe55ba-aa8a-405f-822f-5cc7ef435d17"
              },
              {
                "type": "quantity--material",
                "id": "eb485a19-823e-4841-96fb-16189ec26787"
              }
            ]
          }
        }
      }
    }
  ]