label,value
air quality,air_quality
biodiversity,biodiversity
crop productivity,crop_productivity
economic analyses,economic_analyses
energy efficiency,energy_efficiency
erosion,erosion
fire behavior,fire_behavior
GHG emissions,ghg_emissions
hydrology,hydrology
land use/cover,land_use_cover
livestock productivity,livestock_productivity
manure management,manure_management
N cycling and losses,n_cycling_losses
P cycling and losses,p_cycling_losses
"pest management,",pest_management
pesticide pollution,pesticide_pollution
socio-economic,socioeconomic
soil carbon,soil_carbon
soil properties,soil_properties
soil water,soil_water
water quality,water_quality