EESchema Schematic File Version 4
LIBS:interface-hw-cache
EELAYER 26 0
EELAYER END
$Descr A4 11693 8268
encoding utf-8
Sheet 1 1
Title ""
Date ""
Rev ""
Comp ""
Comment1 ""
Comment2 ""
Comment3 ""
Comment4 ""
$EndDescr
$Comp
L interface-hw-rescue:promicro-promicro M1
U 1 1 5C3DFEFB
P 3400 2000
F 0 "M1" H 3750 2387 60  0000 C CNN
F 1 "promicro" H 3750 2281 60  0000 C CNN
F 2 "Package_DIP:DIP-24_W15.24mm_LongPads" H 3400 2300 60  0001 C CNN
F 3 "" H 3400 2300 60  0000 C CNN
	1    3400 2000
	1    0    0    -1  
$EndComp
$Comp
L Connector:Conn_01x08_Male J3
U 1 1 5C3E0002
P 800 2100
F 0 "J3" H 906 2578 50  0000 C CNN
F 1 "Note" H 906 2487 50  0000 C CNN
F 2 "Connector_Molex:Molex_KK-254_AE-6410-08A_1x08_P2.54mm_Vertical" H 800 2100 50  0001 C CNN
F 3 "~" H 800 2100 50  0001 C CNN
	1    800  2100
	1    0    0    -1  
$EndComp
$Comp
L Connector:Conn_01x02_Male J1
U 1 1 5C3E01D6
P 800 850
F 0 "J1" H 906 1028 50  0000 C CNN
F 1 "printer-power" H 906 937 50  0000 C CNN
F 2 "Connector_Molex:Molex_KK-254_AE-6410-02A_1x02_P2.54mm_Vertical" H 800 850 50  0001 C CNN
F 3 "~" H 800 850 50  0001 C CNN
	1    800  850 
	1    0    0    -1  
$EndComp
$Comp
L Connector:Conn_01x02_Male J6
U 1 1 5C3E021D
P 1800 800
F 0 "J6" H 1906 978 50  0000 C CNN
F 1 "power" H 1906 887 50  0000 C CNN
F 2 "Connector_Molex:Molex_KK-254_AE-6410-02A_1x02_P2.54mm_Vertical" H 1800 800 50  0001 C CNN
F 3 "~" H 1800 800 50  0001 C CNN
	1    1800 800 
	1    0    0    -1  
$EndComp
$Comp
L Connector:Conn_01x02_Male J7
U 1 1 5C3E026D
P 3300 850
F 0 "J7" H 3406 1028 50  0000 C CNN
F 1 "door" H 3406 937 50  0000 C CNN
F 2 "Connector_Molex:Molex_KK-254_AE-6410-02A_1x02_P2.54mm_Vertical" H 3300 850 50  0001 C CNN
F 3 "~" H 3300 850 50  0001 C CNN
	1    3300 850 
	1    0    0    -1  
$EndComp
$Comp
L Connector:Conn_01x03_Male J2
U 1 1 5C3E030D
P 800 1400
F 0 "J2" H 906 1678 50  0000 C CNN
F 1 "printer" H 906 1587 50  0000 C CNN
F 2 "Connector_Molex:Molex_KK-254_AE-6410-03A_1x03_P2.54mm_Vertical" H 800 1400 50  0001 C CNN
F 3 "~" H 800 1400 50  0001 C CNN
	1    800  1400
	1    0    0    -1  
$EndComp
$Comp
L Connector:Conn_01x06_Male J5
U 1 1 5C3E050B
P 800 4400
F 0 "J5" H 906 4778 50  0000 C CNN
F 1 "Coin-inhibit" H 906 4687 50  0000 C CNN
F 2 "Connector_Molex:Molex_KK-254_AE-6410-06A_1x06_P2.54mm_Vertical" H 800 4400 50  0001 C CNN
F 3 "~" H 800 4400 50  0001 C CNN
	1    800  4400
	1    0    0    -1  
$EndComp
$Comp
L Connector:Conn_01x10_Male J4
U 1 1 5C3E05BB
P 800 3450
F 0 "J4" H 906 4028 50  0000 C CNN
F 1 "Coin-output" H 906 3937 50  0000 C CNN
F 2 "Connector_Molex:Molex_KK-254_AE-6410-10A_1x10_P2.54mm_Vertical" H 800 3450 50  0001 C CNN
F 3 "~" H 800 3450 50  0001 C CNN
	1    800  3450
	1    0    0    -1  
$EndComp
$Comp
L power:+12V #PWR0101
U 1 1 5C3E090B
P 2200 900
F 0 "#PWR0101" H 2200 750 50  0001 C CNN
F 1 "+12V" V 2215 1028 50  0000 L CNN
F 2 "" H 2200 900 50  0001 C CNN
F 3 "" H 2200 900 50  0001 C CNN
	1    2200 900 
	0    1    1    0   
$EndComp
$Comp
L power:GND #PWR0102
U 1 1 5C3E09B7
P 2200 800
F 0 "#PWR0102" H 2200 550 50  0001 C CNN
F 1 "GND" V 2205 672 50  0000 R CNN
F 2 "" H 2200 800 50  0001 C CNN
F 3 "" H 2200 800 50  0001 C CNN
	1    2200 800 
	0    -1   -1   0   
$EndComp
Wire Wire Line
	2200 800  2000 800 
Wire Wire Line
	2000 900  2200 900 
$Comp
L power:+12V #PWR0103
U 1 1 5C3E0A08
P 1150 950
F 0 "#PWR0103" H 1150 800 50  0001 C CNN
F 1 "+12V" V 1165 1078 50  0000 L CNN
F 2 "" H 1150 950 50  0001 C CNN
F 3 "" H 1150 950 50  0001 C CNN
	1    1150 950 
	0    1    1    0   
$EndComp
$Comp
L power:GND #PWR0104
U 1 1 5C3E0A23
P 1150 850
F 0 "#PWR0104" H 1150 600 50  0001 C CNN
F 1 "GND" V 1155 722 50  0000 R CNN
F 2 "" H 1150 850 50  0001 C CNN
F 3 "" H 1150 850 50  0001 C CNN
	1    1150 850 
	0    -1   -1   0   
$EndComp
Wire Wire Line
	1150 850  1000 850 
Wire Wire Line
	1150 950  1000 950 
$Comp
L power:GND #PWR0105
U 1 1 5C3E0A7F
P 1150 1300
F 0 "#PWR0105" H 1150 1050 50  0001 C CNN
F 1 "GND" V 1155 1172 50  0000 R CNN
F 2 "" H 1150 1300 50  0001 C CNN
F 3 "" H 1150 1300 50  0001 C CNN
	1    1150 1300
	0    -1   -1   0   
$EndComp
$Comp
L power:GND #PWR0106
U 1 1 5C3E0A9A
P 1150 1800
F 0 "#PWR0106" H 1150 1550 50  0001 C CNN
F 1 "GND" V 1155 1672 50  0000 R CNN
F 2 "" H 1150 1800 50  0001 C CNN
F 3 "" H 1150 1800 50  0001 C CNN
	1    1150 1800
	0    -1   -1   0   
$EndComp
$Comp
L power:GND #PWR0107
U 1 1 5C3E0AB5
P 1150 1900
F 0 "#PWR0107" H 1150 1650 50  0001 C CNN
F 1 "GND" V 1155 1772 50  0000 R CNN
F 2 "" H 1150 1900 50  0001 C CNN
F 3 "" H 1150 1900 50  0001 C CNN
	1    1150 1900
	0    -1   -1   0   
$EndComp
$Comp
L power:GND #PWR0108
U 1 1 5C3E0AD8
P 1150 3050
F 0 "#PWR0108" H 1150 2800 50  0001 C CNN
F 1 "GND" V 1155 2922 50  0000 R CNN
F 2 "" H 1150 3050 50  0001 C CNN
F 3 "" H 1150 3050 50  0001 C CNN
	1    1150 3050
	0    -1   -1   0   
$EndComp
Wire Wire Line
	1150 1300 1000 1300
Wire Wire Line
	1000 1800 1150 1800
Wire Wire Line
	1150 1900 1000 1900
$Comp
L power:+12V #PWR0109
U 1 1 5C3E0C3B
P 1150 2000
F 0 "#PWR0109" H 1150 1850 50  0001 C CNN
F 1 "+12V" V 1165 2128 50  0000 L CNN
F 2 "" H 1150 2000 50  0001 C CNN
F 3 "" H 1150 2000 50  0001 C CNN
	1    1150 2000
	0    1    1    0   
$EndComp
$Comp
L power:+12V #PWR0110
U 1 1 5C3E0C56
P 1150 2100
F 0 "#PWR0110" H 1150 1950 50  0001 C CNN
F 1 "+12V" V 1165 2228 50  0000 L CNN
F 2 "" H 1150 2100 50  0001 C CNN
F 3 "" H 1150 2100 50  0001 C CNN
	1    1150 2100
	0    1    1    0   
$EndComp
$Comp
L power:+12V #PWR0111
U 1 1 5C3E0C89
P 1150 3150
F 0 "#PWR0111" H 1150 3000 50  0001 C CNN
F 1 "+12V" V 1165 3278 50  0000 L CNN
F 2 "" H 1150 3150 50  0001 C CNN
F 3 "" H 1150 3150 50  0001 C CNN
	1    1150 3150
	0    1    1    0   
$EndComp
Wire Wire Line
	1150 2000 1000 2000
Wire Wire Line
	1000 2100 1150 2100
Wire Wire Line
	1150 3050 1000 3050
Wire Wire Line
	1000 3150 1150 3150
NoConn ~ 1000 2200
NoConn ~ 1000 2300
NoConn ~ 1000 3950
$Comp
L power:GND #PWR0112
U 1 1 5C3E131F
P 3650 850
F 0 "#PWR0112" H 3650 600 50  0001 C CNN
F 1 "GND" V 3655 722 50  0000 R CNN
F 2 "" H 3650 850 50  0001 C CNN
F 3 "" H 3650 850 50  0001 C CNN
	1    3650 850 
	0    -1   -1   0   
$EndComp
Wire Wire Line
	3650 850  3500 850 
Text GLabel 3050 2000 0    50   Input ~ 0
TX
Text GLabel 3050 2200 0    50   Input ~ 0
RX
$Comp
L Connector:Conn_01x04_Male J8
U 1 1 5C3E16D4
P 4900 900
F 0 "J8" H 5006 1178 50  0000 C CNN
F 1 "DC/DC" H 5006 1087 50  0000 C CNN
F 2 "Connector_PinHeader_2.54mm:PinHeader_1x04_P2.54mm_Horizontal" H 4900 900 50  0001 C CNN
F 3 "~" H 4900 900 50  0001 C CNN
	1    4900 900 
	1    0    0    -1  
$EndComp
NoConn ~ 5100 800 
$Comp
L power:GND #PWR0113
U 1 1 5C3E1E24
P 5200 1000
F 0 "#PWR0113" H 5200 750 50  0001 C CNN
F 1 "GND" V 5205 872 50  0000 R CNN
F 2 "" H 5200 1000 50  0001 C CNN
F 3 "" H 5200 1000 50  0001 C CNN
	1    5200 1000
	0    -1   -1   0   
$EndComp
$Comp
L power:+12V #PWR0114
U 1 1 5C3E1EBB
P 5200 900
F 0 "#PWR0114" H 5200 750 50  0001 C CNN
F 1 "+12V" V 5215 1028 50  0000 L CNN
F 2 "" H 5200 900 50  0001 C CNN
F 3 "" H 5200 900 50  0001 C CNN
	1    5200 900 
	0    1    1    0   
$EndComp
$Comp
L power:+5V #PWR0115
U 1 1 5C3E1F63
P 5200 1100
F 0 "#PWR0115" H 5200 950 50  0001 C CNN
F 1 "+5V" V 5215 1228 50  0000 L CNN
F 2 "" H 5200 1100 50  0001 C CNN
F 3 "" H 5200 1100 50  0001 C CNN
	1    5200 1100
	0    1    1    0   
$EndComp
Wire Wire Line
	5200 1100 5100 1100
Wire Wire Line
	5100 1000 5200 1000
Wire Wire Line
	5200 900  5100 900 
$Comp
L power:+5V #PWR0116
U 1 1 5C3E30B6
P 4450 2600
F 0 "#PWR0116" H 4450 2450 50  0001 C CNN
F 1 "+5V" V 4465 2728 50  0000 L CNN
F 2 "" H 4450 2600 50  0001 C CNN
F 3 "" H 4450 2600 50  0001 C CNN
	1    4450 2600
	0    1    1    0   
$EndComp
Wire Wire Line
	4450 2600 4300 2600
$Comp
L power:GND #PWR0117
U 1 1 5C3E32F6
P 4400 2200
F 0 "#PWR0117" H 4400 1950 50  0001 C CNN
F 1 "GND" V 4405 2072 50  0000 R CNN
F 2 "" H 4400 2200 50  0001 C CNN
F 3 "" H 4400 2200 50  0001 C CNN
	1    4400 2200
	0    -1   -1   0   
$EndComp
$Comp
L power:GND #PWR0118
U 1 1 5C3E3335
P 3050 2400
F 0 "#PWR0118" H 3050 2150 50  0001 C CNN
F 1 "GND" V 3055 2272 50  0000 R CNN
F 2 "" H 3050 2400 50  0001 C CNN
F 3 "" H 3050 2400 50  0001 C CNN
	1    3050 2400
	0    1    1    0   
$EndComp
$Comp
L power:GND #PWR0119
U 1 1 5C3E3364
P 3050 2600
F 0 "#PWR0119" H 3050 2350 50  0001 C CNN
F 1 "GND" V 3055 2472 50  0000 R CNN
F 2 "" H 3050 2600 50  0001 C CNN
F 3 "" H 3050 2600 50  0001 C CNN
	1    3050 2600
	0    1    1    0   
$EndComp
Wire Wire Line
	3050 2600 3200 2600
Wire Wire Line
	3200 2400 3050 2400
Wire Wire Line
	3050 2200 3200 2200
Wire Wire Line
	3200 2000 3050 2000
Wire Wire Line
	4400 2200 4300 2200
$Comp
L Connector_Generic:Conn_02x03_Odd_Even J10
U 1 1 5C3E4543
P 6600 3200
F 0 "J10" H 6650 3517 50  0000 C CNN
F 1 "isp" H 6650 3426 50  0000 C CNN
F 2 "Connector_PinHeader_2.54mm:PinHeader_2x03_P2.54mm_Vertical" H 6600 3200 50  0001 C CNN
F 3 "~" H 6600 3200 50  0001 C CNN
	1    6600 3200
	1    0    0    -1  
$EndComp
Text GLabel 6150 3100 0    50   Input ~ 0
MISO
Text GLabel 6150 3200 0    50   Input ~ 0
SCK
Text GLabel 6150 3300 0    50   Input ~ 0
~RESET
Text GLabel 7100 3200 2    50   Input ~ 0
MOSI
Wire Wire Line
	6150 3200 6400 3200
Wire Wire Line
	6400 3300 6150 3300
Wire Wire Line
	6150 3100 6400 3100
Wire Wire Line
	6900 3200 7100 3200
$Comp
L power:GND #PWR0120
U 1 1 5C3E5596
P 7000 3400
F 0 "#PWR0120" H 7000 3150 50  0001 C CNN
F 1 "GND" H 7005 3227 50  0000 C CNN
F 2 "" H 7000 3400 50  0001 C CNN
F 3 "" H 7000 3400 50  0001 C CNN
	1    7000 3400
	1    0    0    -1  
$EndComp
Wire Wire Line
	7000 3400 7000 3300
Wire Wire Line
	7000 3300 6900 3300
$Comp
L power:+5V #PWR0121
U 1 1 5C3E5AC1
P 7000 3000
F 0 "#PWR0121" H 7000 2850 50  0001 C CNN
F 1 "+5V" H 7015 3173 50  0000 C CNN
F 2 "" H 7000 3000 50  0001 C CNN
F 3 "" H 7000 3000 50  0001 C CNN
	1    7000 3000
	1    0    0    -1  
$EndComp
Wire Wire Line
	7000 3000 7000 3100
Wire Wire Line
	7000 3100 6900 3100
Text GLabel 4450 2400 2    50   Input ~ 0
~RESET
Text GLabel 4450 4000 2    50   Input ~ 0
MOSI
Text GLabel 4450 3800 2    50   Input ~ 0
MISO
Text GLabel 4450 3600 2    50   Input ~ 0
SCK
Wire Wire Line
	4450 2400 4300 2400
Wire Wire Line
	4450 3600 4300 3600
Wire Wire Line
	4300 3800 4450 3800
Wire Wire Line
	4450 4000 4300 4000
Text GLabel 1200 1500 2    50   Input ~ 0
TX
Text GLabel 1200 1400 2    50   Input ~ 0
RX
Wire Wire Line
	1200 1400 1000 1400
Wire Wire Line
	1000 1500 1200 1500
Text GLabel 4450 2800 2    50   Input ~ 0
PF4
Wire Wire Line
	4450 2800 4300 2800
Text GLabel 4450 3000 2    50   Input ~ 0
PF5
Text GLabel 4450 3200 2    50   Input ~ 0
PF6
Text GLabel 4450 3400 2    50   Input ~ 0
PF7
Text GLabel 3050 2800 0    50   Input ~ 0
PD1
Text GLabel 3050 3000 0    50   Input ~ 0
PD0
Text GLabel 3050 3200 0    50   Input ~ 0
PD4
Text GLabel 3050 3400 0    50   Input ~ 0
PD6
Text GLabel 3050 3600 0    50   Input ~ 0
PD7
Text GLabel 3050 3800 0    50   Input ~ 0
PE6
Text GLabel 3050 4000 0    50   Input ~ 0
PB4
Text GLabel 3050 4200 0    50   Input ~ 0
PB5
Text GLabel 4450 4200 2    50   Input ~ 0
PB6
Wire Wire Line
	4450 4200 4300 4200
Wire Wire Line
	4300 3400 4450 3400
Wire Wire Line
	4450 3200 4300 3200
Wire Wire Line
	4300 3000 4450 3000
Wire Wire Line
	3200 2800 3050 2800
Wire Wire Line
	3050 3000 3200 3000
Wire Wire Line
	3200 3200 3050 3200
Wire Wire Line
	3050 3400 3200 3400
Wire Wire Line
	3200 3600 3050 3600
Wire Wire Line
	3050 3800 3200 3800
Wire Wire Line
	3200 4000 3050 4000
Wire Wire Line
	3050 4200 3200 4200
Text Notes 1550 1450 0    50   ~ 0
34800 8N1\nxon/xoff
Text GLabel 1200 2500 2    50   Input ~ 0
PD1
Text GLabel 1200 2400 2    50   Input ~ 0
PD0
Wire Wire Line
	1200 2400 1000 2400
Wire Wire Line
	1000 2500 1200 2500
Text Notes 1450 2550 0    50   ~ 0
Printer TX\n\nPrinter RX
Text Notes 2400 3000 0    50   ~ 0
Printer RX\n\nPrinter TX\n
$Comp
L power:GND #PWR0122
U 1 1 5C7F8966
P 1150 3250
F 0 "#PWR0122" H 1150 3000 50  0001 C CNN
F 1 "GND" V 1155 3122 50  0000 R CNN
F 2 "" H 1150 3250 50  0001 C CNN
F 3 "" H 1150 3250 50  0001 C CNN
	1    1150 3250
	0    -1   -1   0   
$EndComp
Wire Wire Line
	1150 3250 1000 3250
Text GLabel 1200 3350 2    50   Input ~ 0
PD4
Text GLabel 1200 3450 2    50   Input ~ 0
PD6
Text GLabel 1200 3550 2    50   Input ~ 0
PD7
Text GLabel 1200 3650 2    50   Input ~ 0
PE6
Text GLabel 1200 3750 2    50   Input ~ 0
PB4
Text GLabel 1200 3850 2    50   Input ~ 0
PB5
Text GLabel 1200 4200 2    50   Input ~ 0
PB6
Wire Wire Line
	1200 4200 1100 4200
Wire Wire Line
	1100 4200 1100 4300
Wire Wire Line
	1100 4700 1000 4700
Connection ~ 1100 4200
Wire Wire Line
	1100 4200 1000 4200
Wire Wire Line
	1000 4600 1100 4600
Connection ~ 1100 4600
Wire Wire Line
	1100 4600 1100 4700
Wire Wire Line
	1000 4500 1100 4500
Connection ~ 1100 4500
Wire Wire Line
	1100 4500 1100 4600
Wire Wire Line
	1000 4400 1100 4400
Connection ~ 1100 4400
Wire Wire Line
	1100 4400 1100 4500
Wire Wire Line
	1000 4300 1100 4300
Connection ~ 1100 4300
Wire Wire Line
	1100 4300 1100 4400
Wire Wire Line
	1200 3850 1000 3850
Wire Wire Line
	1000 3750 1200 3750
Wire Wire Line
	1200 3650 1000 3650
Wire Wire Line
	1000 3550 1200 3550
Wire Wire Line
	1200 3450 1000 3450
Wire Wire Line
	1000 3350 1200 3350
Text GLabel 3650 950  2    50   Input ~ 0
PF4
Wire Wire Line
	3650 950  3500 950 
$Comp
L Connector:Conn_01x02_Male J9
U 1 1 5C8115B6
P 6550 1000
F 0 "J9" H 6522 880 50  0000 R CNN
F 1 "backlight" H 6522 971 50  0000 R CNN
F 2 "Connector_Molex:Molex_KK-254_AE-6410-02A_1x02_P2.54mm_Vertical" H 6550 1000 50  0001 C CNN
F 3 "~" H 6550 1000 50  0001 C CNN
	1    6550 1000
	1    0    0    1   
$EndComp
$Comp
L power:+5V #PWR0123
U 1 1 5C8117E6
P 6950 700
F 0 "#PWR0123" H 6950 550 50  0001 C CNN
F 1 "+5V" H 6965 873 50  0000 C CNN
F 2 "" H 6950 700 50  0001 C CNN
F 3 "" H 6950 700 50  0001 C CNN
	1    6950 700 
	1    0    0    -1  
$EndComp
Wire Wire Line
	6950 700  6950 900 
Wire Wire Line
	6950 900  6750 900 
Wire Wire Line
	6750 1000 6950 1000
Wire Wire Line
	6950 1000 6950 1100
$Comp
L power:GND #PWR0124
U 1 1 5C81631E
P 6950 1600
F 0 "#PWR0124" H 6950 1350 50  0001 C CNN
F 1 "GND" H 6955 1427 50  0000 C CNN
F 2 "" H 6950 1600 50  0001 C CNN
F 3 "" H 6950 1600 50  0001 C CNN
	1    6950 1600
	1    0    0    -1  
$EndComp
Wire Wire Line
	6950 1600 6950 1500
$Comp
L Device:R R1
U 1 1 5C818967
P 7500 1300
F 0 "R1" V 7400 1300 50  0000 C CNN
F 1 "4k7" V 7500 1300 50  0000 C CNN
F 2 "Resistor_THT:R_Axial_DIN0207_L6.3mm_D2.5mm_P2.54mm_Vertical" V 7430 1300 50  0001 C CNN
F 3 "~" H 7500 1300 50  0001 C CNN
	1    7500 1300
	0    1    1    0   
$EndComp
Wire Wire Line
	7350 1300 7250 1300
Text GLabel 7750 1300 2    50   Input ~ 0
PF5
Wire Wire Line
	7750 1300 7650 1300
$Comp
L Device:Q_NPN_CBE Q1
U 1 1 5C8229C7
P 7050 1300
F 0 "Q1" H 7240 1346 50  0000 L CNN
F 1 "BC547" H 7240 1255 50  0000 L CNN
F 2 "Package_TO_SOT_THT:TO-92L_Wide" H 7250 1400 50  0001 C CNN
F 3 "~" H 7050 1300 50  0001 C CNN
	1    7050 1300
	-1   0    0    -1  
$EndComp
$EndSCHEMATC
