digraph "LCDLIB Exported Functions"
{
  edge [fontname="Helvetica",fontsize="10",labelfontname="Helvetica",labelfontsize="10"];
  node [fontname="Helvetica",fontsize="10",shape=box];
  rankdir=LR;
  Node1 [label="LCDLIB Exported Functions",height=0.2,width=0.4,color="black", fillcolor="grey75", style="filled", fontcolor="black",tooltip=" "];
  Node2 [label="LCDLIB Exported Structs",height=0.2,width=0.4,color="black", fillcolor="white", style="filled",URL="$d4/d9e/group___n_a_n_o1_x2___l_c_d_l_i_b___e_x_p_o_r_t_e_d___s_t_r_u_c_t_s.html",tooltip=" "];
  Node2->Node1 [shape=plaintext, dir="back", style="solid"];
}
