digraph "RTC Exported Constants"
{
  edge [fontname="Helvetica",fontsize="10",labelfontname="Helvetica",labelfontsize="10"];
  node [fontname="Helvetica",fontsize="10",shape=box];
  rankdir=LR;
  Node2 [label="RTC Driver",height=0.2,width=0.4,color="black", fillcolor="white", style="filled",URL="$d4/de0/group___n_a_n_o1_x2___r_t_c___driver.html",tooltip=" "];
  Node1 [label="RTC Exported Constants",height=0.2,width=0.4,color="black", fillcolor="grey75", style="filled", fontcolor="black",tooltip=" "];
  Node3 [label="RTC Exported Structs",height=0.2,width=0.4,color="black", fillcolor="white", style="filled",URL="$d4/d20/group___n_a_n_o1_x2___r_t_c___e_x_p_o_r_t_e_d___s_t_r_u_c_t_s.html",tooltip=" "];
  Node2->Node1 [shape=plaintext, dir="back", style="solid"];
  Node1->Node3 [shape=plaintext, dir="back", style="solid"];
}
