digraph "SYS Exported Functions"
{
  edge [fontname="Helvetica",fontsize="10",labelfontname="Helvetica",labelfontsize="10"];
  node [fontname="Helvetica",fontsize="10",shape=box];
  rankdir=LR;
  Node2 [label="SYS Exported Constants",height=0.2,width=0.4,color="black", fillcolor="white", style="filled",URL="$dc/d4e/group___n_a_n_o1_x2___s_y_s___e_x_p_o_r_t_e_d___c_o_n_s_t_a_n_t_s.html",tooltip=" "];
  Node1 [label="SYS Exported Functions",height=0.2,width=0.4,color="black", fillcolor="grey75", style="filled", fontcolor="black",tooltip=" "];
  Node2->Node1 [shape=plaintext, dir="back", style="solid"];
}
