digraph "CLK_WaitClockReady"
{
 // LATEX_PDF_SIZE
  edge [fontname="Helvetica",fontsize="10",labelfontname="Helvetica",labelfontsize="10"];
  node [fontname="Helvetica",fontsize="10",shape=record];
  rankdir="RL";
  Node1 [label="CLK_WaitClockReady",height=0.2,width=0.4,color="black", fillcolor="grey75", style="filled", fontcolor="black",tooltip="This function check selected clock source status."];
  Node1 -> Node2 [dir="back",color="midnightblue",fontsize="10",style="solid",fontname="Helvetica"];
  Node2 [label="CLK_SetCoreClock",height=0.2,width=0.4,color="black", fillcolor="white", style="filled",URL="$d5/d72/group___n_a_n_o1_x2___c_l_k___e_x_p_o_r_t_e_d___f_u_n_c_t_i_o_n_s.html#gaeb2dbdffa8c62523cffa7116afbc3297",tooltip="This function set HCLK frequency. The frequency unit is Hz. The range of u32Hclk is 16 ~ 32 MHz."];
}
