digraph "SystemCoreClockUpdate"
{
 // LATEX_PDF_SIZE
  edge [fontname="Helvetica",fontsize="10",labelfontname="Helvetica",labelfontsize="10"];
  node [fontname="Helvetica",fontsize="10",shape=record];
  rankdir="LR";
  Node1 [label="SystemCoreClockUpdate",height=0.2,width=0.4,color="black", fillcolor="grey75", style="filled", fontcolor="black",tooltip="This function is used to update the variable SystemCoreClock and must be called whenever the core clo..."];
  Node1 -> Node2 [color="midnightblue",fontsize="10",style="solid",fontname="Helvetica"];
  Node2 [label="SysGet_HCLKFreq",height=0.2,width=0.4,color="black", fillcolor="white", style="filled",URL="$d5/d7e/system___nano1_x2_series_8c.html#aca6d5b465c5468d7dc1f3675e834c1b9",tooltip="Get current HCLK clock frequency."];
  Node2 -> Node3 [color="midnightblue",fontsize="10",style="solid",fontname="Helvetica"];
  Node3 [label="SysGet_PLLClockFreq",height=0.2,width=0.4,color="black", fillcolor="white", style="filled",URL="$dc/d49/group___n_a_n_o1_x2___u_a_r_t___e_x_p_o_r_t_e_d___f_u_n_c_t_i_o_n_s.html#gad0eab36ae6ce25e23219dc6a1e8fa73a",tooltip="Calculate current PLL clock frequency."];
}
