digraph "SPI_SetBusClock"
{
 // LATEX_PDF_SIZE
  edge [fontname="Helvetica",fontsize="10",labelfontname="Helvetica",labelfontsize="10"];
  node [fontname="Helvetica",fontsize="10",shape=record];
  rankdir="LR";
  Node1 [label="SPI_SetBusClock",height=0.2,width=0.4,color="black", fillcolor="grey75", style="filled", fontcolor="black",tooltip="Set the SPI bus clock. Only available in Master mode."];
  Node1 -> Node2 [color="midnightblue",fontsize="10",style="solid",fontname="Helvetica"];
  Node2 [label="CLK_GetHCLKFreq",height=0.2,width=0.4,color="black", fillcolor="white", style="filled",URL="$d5/d72/group___n_a_n_o1_x2___c_l_k___e_x_p_o_r_t_e_d___f_u_n_c_t_i_o_n_s.html#ga27ded0f4435751be979927718884488f",tooltip="This function get HCLK frequency. The frequency unit is Hz."];
  Node2 -> Node3 [color="midnightblue",fontsize="10",style="solid",fontname="Helvetica"];
  Node3 [label="SystemCoreClockUpdate",height=0.2,width=0.4,color="black", fillcolor="white", style="filled",URL="$d5/d7e/system___nano1_x2_series_8c.html#ae0c36a9591fe6e9c45ecb21a794f0f0f",tooltip="Updates the SystemCoreClock with current core Clock retrieved from CPU registers."];
  Node3 -> Node4 [color="midnightblue",fontsize="10",style="solid",fontname="Helvetica"];
  Node4 [label="SysGet_HCLKFreq",height=0.2,width=0.4,color="black", fillcolor="white", style="filled",URL="$d5/d7e/system___nano1_x2_series_8c.html#aca6d5b465c5468d7dc1f3675e834c1b9",tooltip="Get current HCLK clock frequency."];
  Node4 -> Node5 [color="midnightblue",fontsize="10",style="solid",fontname="Helvetica"];
  Node5 [label="SysGet_PLLClockFreq",height=0.2,width=0.4,color="black", fillcolor="white", style="filled",URL="$dc/d49/group___n_a_n_o1_x2___u_a_r_t___e_x_p_o_r_t_e_d___f_u_n_c_t_i_o_n_s.html#gad0eab36ae6ce25e23219dc6a1e8fa73a",tooltip="Calculate current PLL clock frequency."];
  Node1 -> Node6 [color="midnightblue",fontsize="10",style="solid",fontname="Helvetica"];
  Node6 [label="CLK_GetPLLClockFreq",height=0.2,width=0.4,color="black", fillcolor="white", style="filled",URL="$d5/d72/group___n_a_n_o1_x2___c_l_k___e_x_p_o_r_t_e_d___f_u_n_c_t_i_o_n_s.html#gaf42f850d36900fcf77e4643f2db5470b",tooltip="This function get PLL frequency. The frequency unit is Hz."];
}
