,URL,Loaded,Updated Date: ,Name,Price,Condition,Quantity Available,Quantity Sold,Images Count
0,https://www.ebay.com/itm/254838474807?epid=20045865509&_trkparms=ispr%3D1&hash=item3b558e8837:g:hpQAAOSwMuxhMtfj&amdata=enc%3AAQAGAAACkPYe5NmHp%252B2JMhMi7yxGiTJkPrKr5t53CooMSQt2orsSeg1Ad1f9161DldjYGbgJebeLfz3JdDAWAQRJR4l7j%252B5QMxbycYRG6ogRnrFBkhNb9rCVq%252FlOOvAts8jRFfysvLwGYx4OIocBXF4wX2QVW6bsPGT2wGp9OHt76O9cDsBSsxLXOjdAbLM9v6HU2eH4VKfbRimNdHAD3LLHd4g4EblD4sdoJqnNUKhTm9rZb11u65pRjCNXtQaB%252FBzcn9T3xUE2Ji2wm%252Br2q9MgHwSDxJO5XBnWc7bCV5jscorP%252BwK2E%252FnpYsLCtedpnjcccWWAEKgh4QGhdghqP2i4H0pLngPy3M16I6EW9IvPlj%252FS%252BC3gcEllXVLZVwEwjuf1X7b42r7pMv%252FqzZCzPgTG0KWyZl6lIiQtOw7qbqgpnxu4B5nM7l7gnrSieStR0vazWAXvGd0OiQj8cudAl5sKnXaRz3gpLZUyfD9Fxx1LJyYWfKO5eg6UZCdUABqb4ske9z3DIm%252F83SKHBjJ3LACbpFQyHsbXDWh3AhP5V43kD9xL0ZTaQSBPjMAzRGX6e3NvvzlJjxo6IuYIcK8uZ8p2Jr0d4I2KFW25UDcO9%252BcaPd180%252FNvqyQBr7%252BlhSZBJOV2ZTn1ZhFkRTlUSTGHZjpUsSxrsa9nkwfF58BosFCTeN6jzS9X6Hq2%252FQG%252FPSONr3eNkIQ2H3qKM%252F%252B5%252FqBoL6%252B6Yd%252B4zp1Yazmc1twpq1ledJpoxldVjn%252BbGKwgdcd02%252BHPNHl2NzOe%252FPwtXadBJSDDqBwIAsRKkPNGfEMpeSs%252B8xMAmfhBzzAuLS9Xcx3yOZuI2A0rTgw3NNBFqAvS3t%252BQZuQifd6MyMxiuvWmlMZCf4X16fXh%7Cclp%3A2499334%7Ctkp%3ABFBMovzTrq5f,False,,,,,,,0
1,https://www.ebay.com/itm/255077945426?_trkparms=ispr%3D1&hash=item3b63d49052:g:ImQAAOSwOO9hCs5N&amdata=enc%3AAQAGAAACkPYe5NmHp%252B2JMhMi7yxGiTJkPrKr5t53CooMSQt2orsSeg1Ad1f9161DldjYGbgJeVMzH%252Fu8Jf21C1O3PhpLZU8F7fK4WAeYgd4r0TY3H3amkBmh37k%252BQSGb8QIVmzT1pBqs4qGte92ePLMe3Ze7a4ezhHNWM0g9wr3lF2pmzHzsSzqlNmQZjgDQiNptbbDGqNN1Bja74Dpzut0gru9XgSwCVIz5vjJMm5UfgrJFn6me%252BmrqJhbCkp%252BIKx298F9bx7mC1Lh3EFQ4FVEcU%252FlwxAzSUOBKmNvqS4igw1gMyPDX2umf%252Bi2tWo2j2PEd2h6qUQDgOmXRGIdzfB24uMiFwxrP0OBycP6sEy0lRNoiLiZ4M7hp7Kqd%252B%252BmsgTHRxFwUOa0xjX0CMqxHKKOj0%252FMThZFeWRFo7nLsDkGIg%252BeMDzNtrKGVuE%252FLhzW7pkxAm9%252FxiB0H5AHgfAo29t%252BpCOY64yf3RB9F86NfHuKlZ1cQcldKBODHXxVtM5ijO44uGdRcXXFweV0ObuJw9LQavhoopfXYazPosLkcQLwGL7nQp8%252BunE8F%252B8EmscR1c5wKc4sPHoVqsiasZ4jN1Rr7nnf8LjrlzCrZmMJR5V2jnwOWZt9idZCx2oWK90OvNWsDa2wULYio2uvmAQsBL6Cja44%252F0trrpzqhMsEXKlVWCjPQbopC%252FQZDaNAre%252F3n6bwT2xPCXZcNa4U47q1SOpolSi06N4nejynkJdLJLkao4pwWRytokseukfrYhH36N7S5gtEnav0HS1GFFOx8S0Cm76wBeG5nSFCiwiWk8tgeVYxn0QYIKfAnzcU1XeFXJprChvUGhCYBZ0dxviNLDi8IKAJ3Wb5O50O8yCt%252FrGHFXzRTR%252B1f%7Cclp%3A2499334%7Ctkp%3ABFBMovzTrq5f,False,,,,,,,0
2,https://www.ebay.com/itm/234009709149?_trkparms=ispr%3D1&hash=item367c10ca5d:g:lEIAAOSwlOdgn1sc&amdata=enc%3AAQAGAAACkPYe5NmHp%252B2JMhMi7yxGiTJkPrKr5t53CooMSQt2orsS22gQ6x0tansgdMn7HCckRHniMXmthua04U6dB6DaUFReBOJyGpVruv6x7OfHkfjswkH6VqlL6f780w80ps7sfPVmP%252FSMtrk7XDofJDf4JZhAA0BQrbfXTdW02ou0zsdytcSJTUXmi91TjFETbafJIj0JeEATHvL1YWCOFGprWhN%252Ba3rsbx1c6%252BFzIN4P%252BgnSSFkKkT%252BdPwz5VkeLLka8LcZbZz08v4jVm45zGW9ddZeFCbIQ7QsZ0YnEmEhXpb%252FjAnvqb%252F2zPs7Mpr7R4jCiHtvt9WSg0yLcMlvPhEx07Fx0NckYlLRyC3qWTsqjJTU6KEreuxSW3vhkf5nsUYPZWWF3dwrpicJaH1ABGTEoHptRJDcmYwIlt%252FraxbdbpdGF7zYYcQYSGAtB2TNb9RzrI4PMg5RWuD98D5JIAyH4sIIPhbPa%252FuvpHOwL60Wztas2otvzz8V8whFLv7bRzokW8AOBM5oKCvWZhszLQxX1uBi2%252BDM7qN9l1ZQAB2kYKaj%252BWtirywyNkyvgKLs6Eza8R70fUWYYMPbRFU%252FBApzAOkdSJg45qzDHTE3FlRpdnqip%252B2eHHeJrAnITKOWBMkzYVWu8jORAEGKLIcffbTwYHa1QRx9dwKo9xJnKRwK8kOqM6fSPKpAVAI533lVsfkTuSe%252BFsTsVBYZqW3rl6x%252B0rEkRnOASo7G3Cf7U5OUmAe752t13ZjZMVAVcgj%252BleJjT8HlITdjsKpmyVj3yyvcK2X%252BPLdhfIzwEgECB%252FEDzRZWcv52vUrXlv1A%252BGLjgrrunY2NoE%252BrnHH0Mn5nCR8T9T5iGUUYAdbTX1k1oAHcNiLpe%7Cclp%3A2499334%7Ctkp%3ABFBMovzTrq5f&var=533643869803,False,,,,,,,0
3,https://www.ebay.com/itm/255070416561?_trkparms=ispr%3D1&hash=item3b6361aeb1:g:DqMAAOSw1V9gEmFw&amdata=enc%3AAQAGAAACkPYe5NmHp%252B2JMhMi7yxGiTJkPrKr5t53CooMSQt2orsSeg1Ad1f9161DldjYGbgJeYDBgwAL5iXPl9tJoOImBv7vjfJdDv9n%252Bz5vQ8us7S6KccP58AxUwZPYi9aGmh%252FDnd3%252BDS9q3qXvFoYLa6oPUPkL3UAsgk2T%252FnfjCdJEEp%252BUkV4F3q1xtAiuNn8Tn%252BrWCqbTpUyiZUZDSuD5vIIZ4vW8shk8V%252FNdsdm%252FTmUHFnpjMBr3Wb9y11G9Qpupe66%252BEoNzRixm0PY2Z2%252FYJJ7dRzuqKlbyI4iNBjJEf%252B%252FzkjjJjIfGiVtWCwQpDnFriKKwrUWZYsWCbzeJE3%252FJ48fXcqXB8iOlalQQeQ1fLR7vW1a8joWt8naabL6duUDoz%252Bi75EL%252BWaccOgQZBaakjEveY0LM9gudqftgoBAdgvatzS63YD9f66Ho3kmhrv3MlCByhy%252FmOpSFWXkmE4%252B6jN8xCwm6sjFQ%252BqdQUfsCTYaaxxiCB%252FsIvFO8q1ccQScLM4C%252BmxpOJyqczj7gOAFXToZsHAwvfgoye97ScKrVzOxENRu7G7Tzcht%252FMNX12e4k%252FY9NGj%252ByweMZDuLiZfrsoCj8QyTMTRBRCs4ReBm8JQuqxEDXIqFlZ3P5AO39gYyez8bUMhxLMV%252F%252FuDkJ6ZQjyYT7b6sLK%252F1ToDulbeLlX%252BtBYA5VQMgsdltm1EIO1QFGxzqMKT0RkFHVUXsm%252BREx2W5qkXKlRQV53o6kNwyV0jkSkG%252Bzm4N2FlbDQQLN91WrxD3atkPYrjQdd46hkzGmhUTUcJOL09VXHcGBcB2vDjP4j9rUiRAPedNQ28G0zJO7Ub68ydoGdThl8BMRFZImC1njj%252BdGsBl7M0Opcix8JSX9LHSM%7Cclp%3A2499334%7Ctkp%3ABFBMovzTrq5f&var=555166168690,False,,,,,,,0
4,https://www.ebay.com/itm/194411944786?hash=item2d43dadb52:g:kwkAAOSwDqlgaK8u,False,,,,,,,0
5,https://www.ebay.com/itm/373734308286?_trkparms=ispr%3D1&hash=item57044cf9be:g:AEwAAOSwf~phTsdK&amdata=enc%3AAQAGAAACkPYe5NmHp%252B2JMhMi7yxGiTJkPrKr5t53CooMSQt2orsSGPM5LSpFpxB8y%252BM3EBCfFFwJCjh%252FMsbZ1mcBLmoO%252F9f6H9Ie1xcskJHWWeEPScwGd0DB3EnaBi98a22Gt0A7StJHu%252FiIkcZmGRDOsZ0bCd1pgtzQESLZE5R2633wVBOLrB4M6BHJqBwX2xWjoFX1nF8c5i2tQD0r30t5%252BUxUz63fptzByGss1FXZf2kQND8X10lRveb7c6n3CdiGqOqUBKPK32jtP4%252Bdf4pR4V26Ukx9j%252FtxgXYjK3MpZTHRx2kGtQIAOXURfaxWV4RKz6LgScCAgndRSsRf3yPabCjkoOjVSngZl6xhj5UREQBLN22eupRV1VIEhsF4pt55lFIAMNm%252BI7N85Y74JOm1fc%252BV7sm9pM0D3Yqc%252Fcv2doFa8xcYjb6qNSSFqAQ1e74s6oQ1LGaZYBccE8yXxuYFxQlUS4AGRbpFbaMdOPFLx4fVyp5eLsWYNVy1TPEt5wfxTGM0UoWc%252Fp%252FMNd22pZxou5Llg38q2GJ287Qhwk4cFXWCyvNmcqwmRxAq5qzo4PwbeKQBmUodBkU74BAdu2MZjvdi0%252FBdT2l1J9SjpRGzHVGS7klGveOXZLYvz4%252Bk4ZR7v3VFOqni9AXAmjmxpNZEA8IiQGABqHvMX5I9gZgIwFeuuEzvgfV%252FSk%252FpDSRpoysBxsVt%252B45Ur4OACpKnEjXzPvtq1w1rG8qdJ46kRSs6UzEuac%252BjgFmhsLlibyp2tLEWpXD4aMB1xfRAUNxb5sCzNXSc65G%252FFAdyKRffwYOVRyGq52sECodODnvjdHtr6scsszBGRCm57eHZIGuUPwfTdUamTwZjU20R9M0OxxrL1F3UdWfh%7Cclp%3A2499334%7Ctkp%3ABFBMovzTrq5f,False,,,,,,,0
6,https://www.ebay.com/itm/304178486353?hash=item46d2735c51:g:50sAAOSwCVZhYQlg&var=603285302173,False,,,,,,,0
7,https://www.ebay.com/itm/353747464759?hash=item525cfdf237:g:jy4AAOSwY7Jhm6PK&var=623107182116,False,,,,,,,0
8,https://www.ebay.com/itm/233566369654?hash=item3661a3f776:g:pY0AAOSw9uxenvJj,False,,,,,,,0
9,https://www.ebay.com/itm/275047343727?hash=item400a19666f:g:54EAAOSwSb9heGBU,False,,,,,,,0
10,https://www.ebay.com/itm/333917136775?hash=item4dbf032787:g:o~oAAOSwAqhgSenH,False,,,,,,,0
11,https://www.ebay.com/itm/133948386113?hash=item1f2ff22b41:g:o6IAAOSwXbdhpFsJ,False,,,,,,,0
12,https://www.ebay.com/itm/133948386132?hash=item1f2ff22b54:g:4-gAAOSwaqphpFsL,False,,,,,,,0
13,https://www.ebay.com/itm/393744124686?_trkparms=ispr%3D1&hash=item5bacfa8b0e:g:4UQAAOSwBglhpNEz&amdata=enc%3AAQAGAAACkPYe5NmHp%252B2JMhMi7yxGiTJkPrKr5t53CooMSQt2orsS756jE49efRUdZ161WGGuaaaWlwithW49KM8NlyH8T8eTkXHrkj4OI0Vqc0YiPDPucTUs5W6Y1G60UuPU80vMw6Hw2kcpUqp01z%252BllrFseSIskk0tctct3fCntRWKHd275%252Bd%252F78sApRlctq%252BV6etirsp%252BQ0h%252BTkiZ09mS3YZtpnQipLh8Dvy3rSzj61O28uWExPzOqoiIUy%252BQjv%252BGj%252FljxDi30zKMGX350JHUGAbtfm6oLn4dHoPZZJku%252BhKbMwrGq9ghgBhxaJcMArjOoi9cdeVBNuUSCZzlD%252BacpgUEZK4yLrQnC%252ByGbOB2aRFP156VHYOmvNJoSb2Pw%252F8n3m20O4TO881w5PsxpaZnw1LRTOo0rax7FdIBXeYLI6wT7XgvuMuXTdF6Sfom%252B%252F2vz7DSyNp86JiCi%252BFOAC7xviQeT747MRyC5JH8dEa%252Ft6Dzng8CcXk2bklZ6VhSdij%252FzMcds4SJeF15oU7f%252FBARYVUEY5e4TKsQec5xuQMU42lp3IZcF3bx4EQBBZwU52y1jHCZJ%252B%252Bj%252FJ9kF8hD5uFYvDpw3AV1vo6fiU8MwtBGJWn0c9%252FBMDygbAyPlKRos4Sqf8aEC2njdBSPV7VfAYP%252BYZoaSs5cdYvpfqnim7ioaA5LvGN8jkHZSTLSOAwSqkQEj21VGZ1zjAs83goouIu4J5jdFo5Q%252BYqF0BKAWPBAlfMMlfniuIGuJywrrkHR0Y740kK1%252Bf%252FZa58bidUKb9RKHtenFzioeWjvwEDZCMI2A8cit9cIwSXfPB6ZufdxXhTWb7fJVhcQsuyM74kfDY0CUiVGJNAoJ6GJbt7Wjnx8fvcOsiVQ%7Cclp%3A2499334%7Ctkp%3ABFBMovzTrq5f,False,,,,,,,0
14,https://www.ebay.com/itm/334235436217?_trkparms=ispr%3D1&hash=item4dd1fc04b9:g:MWAAAOSwqBpho8Fw&amdata=enc%3AAQAGAAACkPYe5NmHp%252B2JMhMi7yxGiTJkPrKr5t53CooMSQt2orsSJQp8uqlJ8r7SZitI9gA%252F1XGdLFZ1pIob09DV4T0g9zq9MiuVIWZA3acZelrds4PSiaDJrB%252FzVuSJfwtAKBOQi9%252FfHBYe9f9tH2QVwVIFdMU9xeLkG9qVXEbhKIc0iymfeJ21GONh0nW9ZjzxUC%252BQ2LYD9Xyl6rdDQMLXR67qgGEku1uhKPiEGBEHYksaa%252BeeL80scVK0P3cFVsLdVzmSqD%252BbVVcIV1OJQchWxgdjxTJ6C5OrOnwV4OVV4B9usfaytkAkniHKGfsQm4imX4nDea0eCt6mDOACuOOgfzQOsoUzQM%252BbNfzFnM9IY4C59MEDb0jn9BJDcv62DMWWH%252BOENCUBzePlsrje31d5Bd3492VSkLMOp7hWJD2emse8TAn3VT9qS1ZC4%252F7f74LCg4yRCLfFI1xm0TATIpu0RRiuYK3O1RpARs2mQBiEuqshDx8Oug8qzxpdC7Gi0Cpv13jkaz0gU6HWWOv0%252F8brtkMChZG2BXek6suGRQ2Bed%252FeZhJQW31SWCyPsmHShxmNV1sAWWXrA%252BZqKdcGNtLZnO%252BC%252F3FDDPhn5c6GpfeGiXZ0UgInhUUicTtDQo5v3f9fSYtUl%252F7m%252Fb57j%252FbfyrGBg1Qj9CKc9bHYR76SAVsbIFT%252FYAeWnXvZYNwr8YYuJdU89ViiWbLWvdglMw1wmLyAgxpQMvYTDnKRAbdWQpktP3S86qyh5hHlG5t%252F5H4GpHktRdV7E5addyyQaJodMHOshA3a7OBsm9ossw1pN7o8OTOflPBR%252Bo2UFUT0zKFzrqHKQkfxGjcvErgEVHlVUkpxKlXo9Ul7SxFBg9RScEmajEtsYy8e%7Cclp%3A2499334%7Ctkp%3ABFBMovzTrq5f&var=543238128228,False,,,,,,,0
15,https://www.ebay.com/itm/203645643807?_trkparms=ispr%3D1&hash=item2f6a39ec1f:g:C1cAAOSwKgFhYpv0&amdata=enc%3AAQAGAAACkPYe5NmHp%252B2JMhMi7yxGiTJkPrKr5t53CooMSQt2orsSDbb8Xz6YxVYplPlqqf7B3wa7W5R0gWYE3Glxd7UTsh8KG9IRQWQxOkNO7pr8lqmOiIXt7rdBsEpgyQVL08bGs7ioJX0Mz7ZHFEl7UszaUZKwa880pDDowXYZFuXNM90NN5rLHJEER7k3UW9D5yCnJfZXXN4gouUufgnGZBQfKLpZW4BA8S8bTYP6PI7ifzUlgu27M1z3BQnB8UYoG7rwJ93m2inJGHdj7swza7OOJnqmomNeU8IB5LBrIFKc6233uEeDFLVFmvWJoqPXXN8Wh1bPgPjbSYK3HL%252FvVTHCZsvpVIsSMcIOAdokwxEr6odQJ%252BqzXJgJ4oj4L%252F3brFUxPXPTfnA2qm%252BEm2G5R3ilRUEGIL0zEyI9jOcJo1z1h0ZxQ61zDzXw%252B7OqFKl2ESnDT64xJ5L3QH%252F5c02do7TA0qBVUHSeCrRcwP9pxBds00WyddopaFSKvJecwF%252FNoj6ro%252B3mEWv3pqxi8jhx177LEvW06JuTGS4qeNmf2%252BOiRKYr4yy%252BTuZR8BallCWTJdQwIJOl7RRzrHoerlAcWR0HM3voYcmrHqYoDmNV8F0IxsCMa7zi7t67mxeokD4BiFR%252BAzRDHGTi1j54UMsbM5hCYbbPMVSMpId3VFKVhz27I11mIHknfq0ruPK8X%252FdX822LHFUKHCPn7FNDoqYSUePpW0inT74S3GzNCg%252BkOlRO8KSpeuFmkwhRdZLR3xQdVR4wDeoTtJLaRFN6VK6GqLOarZBDVOzFgW%252FER3FzCX7IPok5ZaE%252BKospQDIrERLS2ym0H%252Fq4GLJDOeYfzL2rvUeh9mPyR8xVzcXvFc3Kl89s%252BEKk%7Cclp%3A2499334%7Ctkp%3ABFBMovzTrq5f,False,,,,,,,0
16,https://www.ebay.com/itm/334235432363?_trkparms=ispr%3D1&hash=item4dd1fbf5ab:g:8XMAAOSwSjpho8BK&amdata=enc%3AAQAGAAACkPYe5NmHp%252B2JMhMi7yxGiTJkPrKr5t53CooMSQt2orsSJQp8uqlJ8r7SZitI9gA%252F1cicSx5jwNHne%252FFqaZICpA43Gj0z5QJmtmqx31edHQUxYp8PjvqnGDa22lvsn5l23JG3up7bjXWjbgWF6Wjgn4N%252BWTNpMnOCJvarZ%252FHRdurvJPXV8mpBPyPXkduv7LiQ4b4GEwzgjlxthpDCic6j3TmMyZyjB9GIT1Aj2V211vMVdXLXnFmLszDiFfZ%252FTqj01iI6DrKvxDibA5lvZSzQbspX5WEhBMSQ2rXfQAVG30SYJEalEgntWzENgstxcO5YUbByIC6CXP7YXZlN8Ir5sS9S1%252B%252F6C79%252FTfpWHMfpVnNi9JTqaICqD%252FHw6ZKEYYvHCKrLsCvkb%252BMWe%252FQaTkDHDLew016rxwfXeqcMd0fWDUojPrLaywBXDYBX4yOHgJv49terFZlQLxFUsTGlo3fc9bPk6skUjYD1c3yxouxWHskMkFFoKFpUTaNGHKYxqRQimdIugPsW4axEAlU4JnkXZb1b9qO50ch25fJ5%252B7KWaPLtenhpKOOXs4RJc4IkimF%252FyQa9VMdokKO%252FO1IhT%252BzhabaPS2lkxxBSC2q%252F7igY%252Bxv8w8OtUnSkjiy9N7gZbb3Vaa5k0MuJ26L7Y9g9WpqG3qU9UKI5gYCDu%252F5O2tRRy7p0ceyeX0Zvp5LfcEe0SUzNYyoOYLgfxZnOP67zMG32Nli1UnBkXD2pR8h%252Bsc0W8HMIeHrwkPMf5ra1XSUpZ5gsdXULJxS0vXyCFdqxxZIFmHg4A6HiJkKzY0R855JSw3x2JUhXEhnsAwhgIFYpLrFdRnVWTOQ4O%252Bx9qbkxPe%252Bp7WOH8IqngCDZC2SND2B%252Bxp1L%7Cclp%3A2499334%7Ctkp%3ABFBMovzTrq5f,False,,,,,,,0
17,https://www.ebay.com/itm/144310507971?hash=item21999399c3:g:gfMAAOSwLLNhpFsJ&var=443624417551,False,,,,,,,0
18,https://www.ebay.com/itm/384542396466?_trkparms=ispr%3D1&hash=item5988835032:g:CS4AAOSw~sZho8BP&amdata=enc%3AAQAGAAACkPYe5NmHp%252B2JMhMi7yxGiTJkPrKr5t53CooMSQt2orsSpngC8TtjPC1%252FgpUwC4Gby6FAi9j4WfI3AVfuN5pdCyUgKVsr%252BSkrMDddHlPAms7O3P3bOw5syVXTCnkUeh2wsrht1u%252BdJsFK6m%252FX3mnnWOdl71VjP4tB6H9pRVCyp3Xm%252FChIoExnMJZXljNcU0wQCNktLIzMlfAKpWAKgc73XnmgUUzvFCDJlgZx8muwy5NgsXWWPtNz65QX45hoXj59DGwgC3y%252BQPjj0%252BaAkQ3OkmBiO4uNOiDjoXB8%252BD40zcfm6NTxAsyPQjsjqLoO9tR%252BU0csmQ0Kz%252BS8Gcf%252BsLLh0HYj1Tr0ig%252BemjLm0kZ%252BFHasYqf%252FOj9tJoxpvQqM217ILBleagRpTcw4NkoK1To58TRW%252FzAD9xkkKZZmWmjJVdvs9Z9XAO%252BR4uyMVl5OJuANdmj7zU8av7vVnxAVOHN0IcqEEqzImcVs8crNd9FMiNoxlmZJlm5nY%252Bh82B5Bwl8kRDVIZTfWAaY5BVCL2IEKjaIq8yFzLmfL5ZGNoQSUnWZzjPCi6ugTpwllILUQo6KVWTztBFi1ZZpOu1%252BhV0JSnf%252Fw5geaE5JoCt1RTNVdlLfzq9WE8xOVdyTha7fn1GtOrIOKf10IjNbRe%252FQyhBiIyJ%252BUNo3CUa%252FIQp6wf21fCsgcl6oHGTaYejxZHQzcNmvTRnhFCznBEVviYL7uyblVvF%252B2DjaBgnyEihaXyXXmrhpN6WN6%252BRS%252F6gXJNoQ%252FCoGpKWAbr1GQaj8LomIVq5AmO3AGfCdGM52asu8U%252FrrV5H7j9iqmTRBjPxHY9w7Oq7E3wzSkDPL9sIfZr%252FXv6siB6XjP6do2sF1xpJeG3HDHo82Y%7Cclp%3A2499334%7Ctkp%3ABFBMovzTrq5f&var=652613371696,False,,,,,,,0
19,https://www.ebay.com/itm/203727596156?hash=item2f6f1c6a7c:g:5tgAAOSwkINhpEw2,False,,,,,,,0
20,https://www.ebay.com/itm/203444227947?hash=item2f5e388f6b:g:p5kAAOSwNcFgk~Aj&var=503780557250,False,,,,,,,0
21,https://www.ebay.com/itm/284545121633?hash=item424035fd61:g:mh0AAOSwkZBhoeii&var=586128469675,False,,,,,,,0
22,https://www.ebay.com/itm/304119516168?hash=item46ceef8c08:g:0UwAAOSw7o1hJZwJ&var=603241387016,False,,,,,,,0
23,https://www.ebay.com/itm/255036102831?hash=item3b615618af:g:T8YAAOSwXmRffLhX,False,,,,,,,0
24,https://www.ebay.com/itm/292587011760?hash=item441f8b7eb0:g:v~kAAOSwI4BZp~tI&var=591393288270,False,,,,,,,0
25,https://www.ebay.com/itm/124764478056?hash=item1d0c8ada68:g:D~IAAOSwLDRhpKKc,False,,,,,,,0
26,https://www.ebay.com/itm/393745026707?hash=item5bad084e93:g:~KYAAOSwndZdAv8V,False,,,,,,,0
27,https://www.ebay.com/itm/124966659937?hash=item1d1897e761:g:jisAAOSw~1Fhe8MU&var=426038251301,False,,,,,,,0
28,https://www.ebay.com/itm/403324217446?_trkparms=ispr%3D1&hash=item5de7ff2866:g:CY8AAOSwm6hhpC5S&amdata=enc%3AAQAGAAACkPYe5NmHp%252B2JMhMi7yxGiTJkPrKr5t53CooMSQt2orsSv8pnySnjCrvuafadD2t5d2mfLQawgoRnjSRMPPlg7PWPprqwarnflNtIE6ngTuZaEh7ckreMRFEtkik8xgRViKHKnGWjZ8t3qZcyCmANgMfmjIJxcoDeDqg4uNfULllOoU9NU0HoR0FTQP469hh0X9iYCqDcZ3SuaRYrTPD5t8Z6N%252BIG4zPM6rJE74lBFxHx%252BIuGZsoQI0gSoH4AVfCnIM%252BBvVilPtG3EpRR2Eovy0eNj8uMpzey5uEptYI3pYxkNNXme5Au5ulb%252FVID3F2%252BYxyGcEvI6N7PACvR%252FJkggxRzMFn0pBeNpLNjONrgygctVVllbtroGiuNrIwFgBxS1eaTU%252FGujRizSwUwdBtcytnMOSZlmuHEHICSujrQGXGLs5DNXvjFhshITYSMpj9AXGGSYBsHTz8LQSKeofDJBHYyNE3oZft53pHrBnYBbQdabgUDjbiuI9LRT06X3qVvsyx6eBvck51f9DYq%252BK771RWKZQm1yUypfhP7PW%252Fz8%252BQ5CkfTr6vjLKEPve4k4xL%252BZz9OarDLsltkmXR5ymR70L5qLHA5PsOVN8s1VIk0AHng2BxLomgC3Topj3r6dNnRDuEGEsMsrBWcdqW4BtqOA0O7DBp%252Bs%252Bnrnk96CCuSVwvEXG4svXvRkU6Bl%252FuEGL5oYZ%252FjmSug0GBOSuMm7umcqdrNyBWLGAWXm90VhCZI3lj7q0HNxQQ4L0r%252Bw%252FW4zRqo62tiU4eUbU2xdPO8tTYLF5sHkpgwMzj3xmMnvpV%252F1RXwIgomz2cRVSdP0pqmrfwFDV7wCPMCngimzQ8rzCtOTWBt0GiWejozNprcr51VvOPD%7Cclp%3A2499334%7Ctkp%3ABFBMovzTrq5f,False,,,,,,,0
29,https://www.ebay.com/itm/165176065387?_trkparms=ispr%3D1&hash=item267542bd6b:g:kD8AAOSwj9tdW7qj&amdata=enc%3AAQAGAAACkPYe5NmHp%252B2JMhMi7yxGiTJkPrKr5t53CooMSQt2orsStBvoja9QbbKZL7Re0InmXfcuefU%252B6cHmLWqfQkadsa%252FUJ0en9y0%252Bnymvi9nMXzgXvfT47e2LU1HE31VVc5fpOnYGokxgRmII%252FtLcQemzUgfJPn5nQMPcyIZe3lNVt2c1gWpbJQ7EJMuvxisGp94yN3sfoFIosxoiDm2r%252BSBNTvn5TN6pNAEpZfV9z8IWihlg1n2%252BivvwvtUvMKoYZ05mHgJEbBdJNy04rYmVDm7D8AJCqBHb119gFNLBO0CKzDsa6sQo7NUpZGRTsJaVQDl3v8a1%252B2agajeZC%252FEL%252F%252B98T9PU6yXqiqLmlSjUk8C9%252FBKSxgHMjguV012BjdksoPi9UberqUAHzDUXvrT53bwUp6hNWRuQvSHydgtkQ1gSFfYzwsjoScFpf%252FnqRyYne%252FTVmR%252BmMtvlJ%252FBvba21ugW3T2mM2lrNh9g6Xi1ly0mj1EeTMvLTfTTdgVw8kZu9quDPv7egWkmtkaoTSMEj3%252B349%252BUMurXPhTGduov%252FzR2lzUnRW5O7STiokTpmXjnX8r9TJlUJJ83UmRD0w4bk4gFZO6yHmMbY2nea5a8tDN6jzsHpgRH9Ep4f%252BlULIOau3%252FM8pdwCa3c1WoLayiEz1m8c4qlaP3oxc7XRjsi6gfEDJP1IMi1li%252B9SIbsRhDN%252Bp%252FDk28pF6rMyIRK3gtvek0y%252FCSX%252BMYTS2LkBG9Y31rFzfkGm1Q%252F2Uw9RS11zOWElaj%252BmSo3Y1RW8DI4bJACwQLzEmCqBwk0jj2aRq0HYifO5xht4v5ag6lxe2069yWEiiAoIXCjbSqbTrjrKsjNMPkpuC48k22EiSHoQAZbML%252Bm0hN%252Fa%7Cclp%3A2499334%7Ctkp%3ABFBMovzTrq5f,False,,,,,,,0
30,https://www.ebay.com/p/14048045693?iid=154726131536&rt=nc,False,,,,,,,0
31,https://www.ebay.com/itm/203448652287?hash=item2f5e7c11ff:g:howAAOSwJoZgmpCd,False,,,,,,,0
32,https://www.ebay.com/itm/165209107180?hash=item26773aeaec:g:1WMAAOSwURNe63IE,False,,,,,,,0
33,https://www.ebay.com/itm/154726131530?hash=item240665674a:g:1jUAAOSwy79f0jUw,False,,,,,,,0
34,https://www.ebay.com/itm/154726131553?hash=item2406656761:g:KkcAAOSwJB5hpRPq,False,,,,,,,0
35,https://www.ebay.com/itm/154726131623?hash=item24066567a7:g:lncAAOSwIyxhpRPv,False,,,,,,,0
36,https://www.ebay.com/itm/173620276815?hash=item286c932e4f:g:oUQAAOSwm4Zb3IHU&var=472298967163,False,,,,,,,0
37,https://www.ebay.com/itm/165209107122?hash=item26773aeab2:g:ES8AAOSwXk5g7fW7,False,,,,,,,0
38,https://www.ebay.com/itm/165175914611?_trkparms=ispr%3D1&hash=item2675407073:g:adEAAOSwJ3RazWip&amdata=enc%3AAQAGAAACkPYe5NmHp%252B2JMhMi7yxGiTJkPrKr5t53CooMSQt2orsStBvoja9QbbKZL7Re0InmXcty%252BSOnY776f2pEsEk3aF8C2eQBlnfNR%252BN%252BFbPNShzbKJiXt8lcxyOGr0RpwGi43rFvWEGrW41iAxDBqmL1Q88bC1ByIBj6NKapwZoZuM3UzISjJnoBghjVTV%252FZPeFbS4T959H1MXYMuujCXriKFLDbBVOYoS1v5kjO6i0ud2tpK0g%252Bx7Q2GNtDKFkHsxkM5KvhCUw1mQm2ksyQw%252BywPAXPTUu%252FN6g3YUPjWELYE0a000ErCsixHjnhwjuucoWwbqlui5F3qK%252Fuwdx5tkD0XuYc%252FtRsH3MEWABJZjGTQmzQcFvrvkbNPvSszodMPOW5cWkIj9XiF89X22GSkFCoQicE%252BDQuadcyhg5Sri0fy%252FtS14gziajHYpqocdg6oNw487Q8FSFDBMMNv4ORdxFdDt%252Bai4lwwD35uHfCv96%252FXEOCPbGR90QiQ4Mp5DZa7DfCzfdqpQOL6hUcasDppjSN2QCjtIn%252F8yKCWbFPsCwi1vL0KE7tbVeOWsza5NB5mElLOhq3KgD1ybgFr8tiRCG48CTc5vjWDR3%252F40XHMQ47LNqrZNZVkJweTRPg8nV%252F%252F5NC6ReNQnFDKGQBcYViif%252B85AmzgbzXONtfQ59rIaZ0GHdPdunAHT95ExLsmtijbvRRcfaVvn5fZD07AIDpnpGWs7403bdtbpX8QkLmIAGlybf5rz6lvG4XIlvOIskkeWu5suufd80aU3vhWvU9EvMpfN0KQIxxxHNQUBZjEB%252BFKoetTIKtZUFX0U%252FtUOyBK%252F2TY6nLU4uMAKIh3lOeosh9%252BCEsiG8y%252BkGdAMj96nvi68xG%7Cclp%3A2499334%7Ctkp%3ABFBMovzTrq5f,False,,,,,,,0
39,https://www.ebay.com/itm/154696742916?_trkparms=ispr%3D1&hash=item2404a4f804:g:cpYAAOSwGU1hOEHE&amdata=enc%3AAQAGAAACkPYe5NmHp%252B2JMhMi7yxGiTJkPrKr5t53CooMSQt2orsSrvYRR9YP5PP7PIDqIHX%252BhAkFLCvRp1Dip8bmmHiLHUN1D8qh37dvA7PCcK65LS%252BOoBb3GyBJK5DniCVVsS5Hh3ZQnwZyUF23AmU%252BdVCN4%252FHSHH5rvoKvHrpUyxkY97s03y4Qo%252BByBSpb%252FoeIQ1bILZZnieZK%252F92uNPvkjXzhhLFAWDTBMcsBxWwm7gGOJnrucs%252FhEkIP55ajAxkC%252BY56EOqengFXVPTqp0L%252B3Vg%252BPqIhP5SChCO0f%252BfhsubKmwENl1tWxSGVt6kb50mIhCbHShX7pQDghxpDTBlqbQBv2HCuTXvaW0ux7AcSk0dLLuMk6OlWDpfBKtOBhCyTRfWU%252Fx67R4McXZ1vAZYklncZvI4%252FP2KLk9NrRM1lgd%252BxRoDHNzRyN%252BKRrfHgWd581vvX2S7wojaLsAVQfQeFQZrGrpsJRFD066k4tq3EeeiHMm60gE1ehm0BWzaaDME4%252BxTXKLOtHLenGcsRIYekGM1XtHPNA32YqmtEqTzmqFuN%252B9lzjVltc201Rq0lcwa6kzaR%252FVKnuZyiusuIafUcB1bodv7sw0tMDPWHV%252BKu%252BIr46vCTWdy64GCnDK1EmTjXgMFKDhms%252FTORfjaG%252FTDas6bjGya4rKPjZszRVbNfYFkqQAeLvrmrLAMpL0KU%252BxOtbQDVBD8mIIIRNoV51D4fMWSkjuDl0vNdp6VZhL1Ul7Jn9mG3WaOPJLYFMsbGJ5KII2Ij2XseN7qFv8i9KZ%252BwzpkYxlZ0MQYKqh%252F%252F3TTzGXtp%252FCrHOesomG7b%252FyPxbXU8o98j4PpvlqnnPG7mg%252BhBFyecXGuUVBQFzK1VNAEZo8tCPgrb%7Cclp%3A2499334%7Ctkp%3ABFBMovzTrq5f,False,,,,,,,0
40,https://www.ebay.com/itm/154726113005?hash=item2406651eed:g:j1AAAOSwLeNhe5MD,False,,,,,,,0
41,https://www.ebay.com/itm/165209106171?hash=item26773ae6fb:g:s5QAAOSwe4lhlLL9,False,,,,,,,0
42,https://www.ebay.com/itm/154726131569?hash=item2406656771:g:B7sAAOSwy3lg~Req,False,,,,,,,0
43,https://www.ebay.com/itm/165209107403?hash=item26773aebcb:g:-K8AAOSw8~Ng~Rei,False,,,,,,,0
44,https://www.ebay.com/itm/203605563925?hash=item2f67d65a15:g:T5AAAOSwJ1FhQR84&var=504016787714,False,,,,,,,0
45,https://www.ebay.com/itm/154726131524?hash=item2406656744:g:6usAAOSwbE5g~Res,False,,,,,,,0
46,https://www.ebay.com/itm/165209107230?hash=item26773aeb1e:g:ffQAAOSw6INfAaLZ,False,,,,,,,0
47,https://www.ebay.com/itm/154726131505?hash=item2406656731:g:q4kAAOSw62xhk2ue,False,,,,,,,0
48,https://www.ebay.com/itm/304182837720?_trkparms=ispr%3D1&hash=item46d2b5c1d8:g:-5YAAOSw3u9hZaC2&amdata=enc%3AAQAGAAACkPYe5NmHp%252B2JMhMi7yxGiTJkPrKr5t53CooMSQt2orsSsTrsimSq2LqQEOMrEDGZBW5M49UCzzqpN1Dwpel79o2ytaC103I9DiRSQQH8IjGiH%252FeXDrTNzw2DmBJCIdvQi%252Fjz0PCeUUJg3wHED%252BqqXAYa2EtzahnLBfyK1WN7ZJ6UX7N4WgcPuxTPR3ux5BCIqIvqruzqB%252BC07TC1JU%252B4pywMbeIFenYkvgvblS72aZusd1FvAR3dN%252B6ttpMYhf12oBF14ZfYFqusRTC1ifpxs1tcMKgSl3t1r6u6ZDIel5FAz5ORZ2GBqSg3qcVJtBSsFR1rZY%252BrioScSs%252F49VRSdI%252B7KYmKjjn2nr1z1VxJZsUJHdDuleVJsqMq8TDk69ZohESTXGVD%252Bz6DlVq75v1cpo6y5WZZnbp7lmUV2rhziTU4jl1v3AJ1Hkjm82jMsJ4GJr7DWEd2bL5gU%252BVlJHhk8nytVqxP4GXb4S7oHgZbImY1X4lqJIDgJlX%252ByHBqAQD6lyH%252Bo1dwYOpTN7dFoXS36TVbFsS9A6dXuKw9y0vEX%252B7cepVGIkIHfSHN%252BqeF3FcBuCkQahGRkQI9DOej5GA2SE2xL%252FQ9sm50QkIOTNNFVkndAWrFh61or%252FvKlSaMTOUTIEOJhJPmP5fctcfuoTqBoOdJoML501BDOE5x58w1DJQ2m8oPRgeeD46ErtElZ%252FxXRyZtyQl5m6ciPgCFpOgyZ35F7AZOELl0nDAORu7SpAeYjmO2ZCl0uz6EIXcCQyQXw5CJQ8nala1lf5bM0PbySIJNolUC7j5jF6k3uNK6z77XzmfhFOra3oSP4u4vz1PmSWIFvYLgAvoy1fW7z6kk3mPoL0tyupIlPlk2HC%252BsQHst%7Cclp%3A2499334%7Ctkp%3ABFBM_KvUrq5f&var=603289376169,False,,,,,,,0
49,https://www.ebay.com/itm/403185510447?_trkparms=ispr%3D1&hash=item5ddfbaa82f:g:hj8AAOSwkqxhTVBq&amdata=enc%3AAQAGAAACkPYe5NmHp%252B2JMhMi7yxGiTJkPrKr5t53CooMSQt2orsSv8pnySnjCrvuafadD2t5d5X4eMJ7bC8ALqEaWAIvY0P%252Frlnq2IzMmEnIGYKDkSeKTnsrrGze2qo5WvvQEHmVAY3S7O3QR5SY7tIHEpr%252Fl5sqpWOa2YFYYeWU3FyjenrEr4OU9L6IrnP2P9D5KGb6l9MTs9%252BB2dEfpcAyX8AB%252FU7UhukdKeP1C%252B06xiBw4CsfDgeRsHsFvLs35jkD%252BqaGHs0%252B56%252Fg48IE3sYOgdJNS7jk8Yt%252FY7jG%252BzSEuL6cUbNNwCi9Y7XZ6JDmCC5ajfOpHqwQQnOJB745qii57rAeL0q6NFePNyeo5tsX4%252BkZd26%252BTGbzKNgBhdvt4Wc1u3IlpXZwyfDC%252FUXG2ihu627PKl7cTCUIWPY4MtApAHCwx19pjmuTDNcCu%252BT7F43T%252FARZluAFNKf%252FvixphIxfBUe7XfLUMBEr8T6e1f9fHrTfJj9w%252B0Nay1smFXa9UtDVTBNtBJUazyx4wjVGQJJkczYkQ%252FNBxbOOhYYLCyjKQcihHCr1GX92FhHe%252FMvunueVAiTpQjxsV7mTJXRLuV7EbKQYcnIKqGOo7Kwdx3i%252BhkAPXeMIt76xwtzLy17KsL2rt5mGvd%252FlUQkLShzi1hKlJOT3qM3%252BTyLp6cG%252BzXNdeTO6et8%252F61tKXY624UQbuSRDDm7bhMjvQBJakUFf99hbrur%252BGnxsaOjXvnFnmx%252BnkwiDTuyocGnxk0fMSSKWb97gHsaNKckFmHJaJJWiOaPq81LK6U7qxkvoS2nwK3EdvQSh2B4ASAqj0SQ4r8f8p7y7Ee9v%252FZ1I0hRTrEyUOtdgMrkkdKh68mbVY1uAThijXHETamVY%7Cclp%3A2499334%7Ctkp%3ABFBM_KvUrq5f&var=673281502103,False,,,,,,,0
50,https://www.ebay.com/itm/274419463122?_trkparms=ispr%3D1&hash=item3fe4acb3d2:g:rpUAAOSwyUtbgmQG&amdata=enc%3AAQAGAAACkPYe5NmHp%252B2JMhMi7yxGiTJkPrKr5t53CooMSQt2orsS53H5nE1T47BUn4%252FoYFCTGe%252BPzAg2or7rUITWwxTgp1NaUZESSEMbJ9ZbkSjRbNFCVoZAaJhO204uFhXK9YI7gWwEzhyvxl2OY6HlM69lmvL9Zr%252FHum%252B7nrsIRnTwY181MauG%252FheqsGEls6zPDTb25RTo1lPGQzhLZH3gjskLjeK7UPPA7b%252Bx6IhJWLHc1g4Di1ZjwBcqS0%252BUVJUb851eN8pnAs7PrvOo0Sk6XEMdy1%252Bxe4rMde3MHTr2YFUc8MURJZwYa3mweyQpXfwKnUnxDjL7dC9jr5j75884XtVLkx1C2Qzdm99WT%252Fh%252FsBHMeVFZlQ%252BwgRjiqrpzVUbqn7BgieE%252BiVU%252F8l%252BnbDcVr71bzgPVyDLO73hOetusXOx0DV5wANu0SQ8BM2icrmeBwMxOQOaGsp79DjpWeER3Gt7%252BqLKlHoaaB7DlLyKreh1KVCduMhv57xMf6q%252Brxym2BHpU8T37uUt7S5fRwlwJFM9Sau4DnaeDLV3fprGlzB3w7lnKdpf9CfuA3eJDvsxGjGACDMeVb%252BlXsZZ9uMBhRSwGU%252FFn1xjAnz61Ty%252FlI6HUFodF0a7DQ1KR2FUhL0wEjaNMWMmX%252FzppInS5grYLAqt2lLGfp29OjHURudHVEvGS2gATykYUD1AJE%252FqPx8u5uBQcEzJxWg4A3tBm64kJWp1EY3OUTIUV0TAyLgO00J5PABUAiZ2%252B1BwSRDUpkVCHF87ijT9WypK9ELyLkwzhB6%252BCJfUJqav%252BT%252B76B2ImlKCL167vjn3Gw86%252Ff0R%252FT6W5IRcSMnh5Du5PVAki414sZaxZx6AIg4Up%252FXS2szne3wkp50Uw%7Cclp%3A2499334%7Ctkp%3ABFBM_KvUrq5f&var=574549304660,False,,,,,,,0
51,https://www.ebay.com/itm/154545064973?_trkparms=ispr%3D1&hash=item23fb9a8c0d:g:TcQAAOSwbWdg~nro&amdata=enc%3AAQAGAAACkPYe5NmHp%252B2JMhMi7yxGiTJkPrKr5t53CooMSQt2orsSrvYRR9YP5PP7PIDqIHX%252BhB9KJa7sCLZ8eJzOKN5Nh9TbmSeZGxFmGNK986rZUGSYCvFH78rVDsOXDY5he7IaZo1ilzy9OxFJC2udTrxZVtqfbTmCZTnq8FtEJSN5o0kK8ie2%252F9N93I4RVIwA5X%252Fg6xkWyVnhYsa28jCzEgoR1z47vUr2vwGTTSZhr93EbjhuqhyI15ktZUbw7I6Fm7Iz62N0M6Sw0qi6TA1I5g7d4JjhLSe6zzlBykU%252F7mT83xhEYkoO1eJ%252FamFHc5rJizzpKo9fU6LiC4sMpHD%252F87P3HAGLAwn3Mgx1J6mvxdle3U30r2J1gM7Ar%252BYliln5qSU6xU3kBDToS%252BUkRecl0TCvMinaobmPQo4CxUoDF7QNG4Lqj8VScagGYzUoTt3hmyxTIxP6XCHQmKssp7OF8csZmuCo9GiBLsKB2ADYnYtCTflzCYSD9Bv4Ig7Q8rjq5aZW3qfHXSNhr6RmkWw%252BI24w80QievGxu2V%252BmI1ru61ZNxtTqFB70Un6UtPssrRpvj5JwpeMmkCkpFwbKF9k6erPfOjmCqUje3L59ehyx8aDJMLJ4tudDo8FO5oRex0J6V%252FbnrUvg%252BA6KAr1AvAwT6PKGGHPANHeHWiOIKjKmWoxEMa7Ia%252FWTRlrmCjTzjHKfcFWWbRxNLXQYJHaV5z%252B79wNacbx5FLhyGgHi5TC12beMGkmcayO4O1ZO4%252Btmnqy0xsL3uh8dJyRz3j2cr5%252FewqtcHfGbEloalzv4Wbbc8cs3Cnf0QkOt3BD8UN8uKsIk3EH3XtqHlEdjG22zA1OWY6K%252FLdeVdz7ErfwrolZg5%252BgeVSK%7Cclp%3A2499334%7Ctkp%3ABFBM_KvUrq5f&var=454622865261,False,,,,,,,0
52,https://www.ebay.com/itm/165209107157?hash=item26773aead5:g:6fMAAOSwqK9e6iXo,False,,,,,,,0
53,https://www.ebay.com/itm/334236571735?_trkparms=ispr%3D1&hash=item4dd20d5857:g:jKAAAOSwW2FhpSQY&amdata=enc%3AAQAGAAACkPYe5NmHp%252B2JMhMi7yxGiTJkPrKr5t53CooMSQt2orsSJQp8uqlJ8r7SZitI9gA%252F1YbBJBLHaz01cPDbQ9%252BqsXXHNOonAIx%252FqoVUjEanqU2wPEqFm4dAHOUO6kWXbShrSvv9EU557STfMtmmjXKcsLI10OxzPyDMjhCa%252B8%252FwJwDFIlSs3mxpAY6Bd9cZUdpxzX5A6wKJqSylwuJLi0AurJVMKF0um0%252BuQYNj%252BW7docK5fiXWJg%252BeZtra5JC5FEaH7p4h9hxzASVnxmwE%252FQBxTC4maMB%252BvUHDkvsRTsKzx7Iwj60fu8KI1oBsMxusVpzGt6KcPf1TzwwYv1y%252BStLelt8fpIfNyn5etaFrjH5UvDxyqTmyeR8b16S%252BptQ0r2RWmJzpBsl2kLmIAGklGXxk4kil9gCi5ITloLvZCbOwsezKGvyoUSENRNhTn4hG32Mf8jDSTB7vKhnht97plvCzcYQljrCbzYToI1rOhRSnHH82JJrKl4xK2zRoiL3mQHseLWEoIdWs4ztBeUp8orZnwiqqLx31C2a248R%252FVmxBp%252FUuRChMyWh3hfCU%252BI5M6aQuIcAA1Cjl431fm410NdImSrmZHQ%252BNLHhycGyydXP4wDjlsatvlO8TXaXZIaQV2jtqDgUY7JO6y4Jj1rpudnevSkxWkDgQh6Qer2UuqboNf6M8QrLQFVvE2kDc%252F3a5JlpKHRwgoLO5%252BJf%252BRvDsW2PkSyXXG%252BmZUqEUZS4wWlQvGhx3gH1WCu8NHsEhxI%252FU7HzmkRpg7IVIC7uESFryt1sB4TXlrx%252BhKuoobez4AR2In0O953uguDXsG%252B6IpHzDBgS6isCPThZ%252B5qj8JXLaPfC85a6tojuj6jaN44MHf4lluBNe%7Cclp%3A2499334%7Ctkp%3ABFBM_KvUrq5f&var=543239330924,False,,,,,,,0
54,https://www.ebay.com/itm/402620055757?hash=item5dbe0680cd:g:eAsAAOSwJX5f4uxj&var=672901018555,False,,,,,,,0
55,https://www.ebay.com/itm/154726131485?hash=item240665671d:g:RgEAAOSwurlhTZPz,False,,,,,,,0
56,https://www.ebay.com/itm/173620276815?hash=item286c932e4f:g:oUQAAOSwm4Zb3IHU&var=472298967163,False,,,,,,,0
57,https://www.ebay.com/itm/324912789522?hash=item4ba64fb812:g:ls4AAOSwhhBhpU~C,False,,,,,,,0
58,https://www.ebay.com/itm/162268989322?hash=item25c7fc478a:g:-7wAAOSw-cphU2E7,False,,,,,,,0
59,https://www.ebay.com/itm/154726131539?hash=item2406656753:g:h9kAAOSwMAlhpJ3E,False,,,,,,,0
60,https://www.ebay.com/itm/324912789669?hash=item4ba64fb8a5:g:NVoAAOSw~i1hpU~T,False,,,,,,,0
61,https://www.ebay.com/itm/353732919071?_trkparms=ispr%3D1&hash=item525c1fff1f:g:tuUAAOSw7kxdNstz&amdata=enc%3AAQAGAAACkPYe5NmHp%252B2JMhMi7yxGiTJkPrKr5t53CooMSQt2orsSL18zNWkBdjtrQvAkAXIw%252B1uQzW6%252FNGT3FkVDdgYPClxGdn%252BzYl2dpGFUx3x%252BFSI32qE8GGEGWpbP0Viogwu3XVEDCbKEwfxBbunu9P7W71tZFz0jykm4L7bt%252BowYcXnVAu0V8RkkzQkPALx2DLQ3Cv%252FJWiC6CWU%252BgivOif9R42hSdx6zqwXa3FXJy5naaS9Tlp3rXG3x9JbWc6RQtmgH6IZ8cDXsPL2Ls8ggKXScmvgscITEi6zNErNCPlkgEPDyD8MjjaE%252BTW7weaH7aFGJY754fF8zLrJCR80qZVdqRXlmSuhpNxjyFDFzIvFGmKsY8cAp3eKNDiY3V4NyOgOCHaOAeKrvzqbENsLaiLH4kIXGl5SnrM8K34%252BO%252BqXnfZybukIjuk8%252FMRbJJ7M1%252FYfSg6j2eb3lBwTyfD78OZ0APlgNRTHmyhyt8%252FwzQxF0KJV3b%252BpDRR3chuAH4ujZXVrfm2vlX%252FTVlJvtvVb%252F%252B5j3GBKsg%252BF26gVsjkm%252B8q9EqiMNIlxuGkFz0mblDJ82eAtNU4yApLUAPdPw7rzIgAu4u2i6Rn%252FRjba7Lz5ew0tAopz2ZdXuUggig9tBifPstjmkeagg3ib9Plr8XKWfztgwCdwigXsufXcwGeYZiIftHCq1%252BOGNR9RoDpzGjxPdjIOKWcZ7rB6YYIr71g8qT%252Ftj4GvotkkLpVqeMke5TOTp0%252B5mWMIHi4v1J%252Bzw6FoUCaNbeThlBSMPl51rD76AADhREWLhbeNGa%252FuRMmRuWuyUj4tAPtmuriww%252BRmtBNIhav9pRS%252FZP6Mpu1ZHzZQ%252FCIu2lLDU9%252FBdYJiWfbO6mE9SfKev%7Cclp%3A2499334%7Ctkp%3ABFBM_KvUrq5f&var=623091307196,False,,,,,,,0
62,https://www.ebay.com/itm/353752750162?_trkparms=ispr%3D1&hash=item525d4e9852:g:XK4AAOSwwqVcLB1P&amdata=enc%3AAQAGAAACkPYe5NmHp%252B2JMhMi7yxGiTJkPrKr5t53CooMSQt2orsSL18zNWkBdjtrQvAkAXIw%252B1jTs0PLfl49TVDIkEAKzSBlld1ptDlT1xB%252FTCET91qeK8qDm5LvwErilz1q%252B5Zad8TeGg6qgszpcoqQUhk9s%252FnvK4mtFPktHB%252Fp4gMGhKbz6A6ZCmB4AwTWMilwt4IjA5BZd4XRCgjgBkP%252FCa5tbcup5rj4deF1f%252BIAl76FfLDhseGi7pNIRkJprp00jYbWG%252Bfe%252FBdd5eR5coWg29otX165jTjHXsm%252F0bp95dpMtdh5%252BTTcHcU2Qc3Smb%252BoD1k%252FypZP49zXgiiC4FaeAdFLToAyjgiFLKmhKQJQ9%252BA3A%252B2Z0nIYHHwZjXCpu2Flk0cfMThhb8xiqZgy%252BzSl%252BwYRb9DRxSmCWl4P6eMSyZZLtn8QNSsPyMiwohkoz4iQ4LwRjUEbKYWhqMg7uax92jHN9Utu9inivOO0j69B0RRjQ8bfXCio5LNRO4otbUcDVAqQvEsqtEoahUAMCYb9gtSV0PnSdp6HBSPsfYnsAnUH8AbCef0MR9Y9Df6%252BoJ1UXxxbRdQUtmthdIpKrSE%252BDS4pt3Gg9snsWON76cFvhHyZYfMhnVt2OOPbAZWxwc0fTxHWYOjiuS03sNq6iUm9YyJkALungGdsb6oNvjg0saBcxnApW7ORQppFSoCLK44KqBQjI3GSInqR%252FHIJzFdmRQjIo8xS7IBBeg36NPOZM3j90UFaMcrBaA455%252Bci%252B3fZgXdTjuAVpHir9PaG1ZiKjfMe7FQZfmDnon%252BZkb69ny9AeiZVrSSOe4Bbq7pltLEqVqniDbE8F%252FhxjicmmrN%252FCDzcedwxAxam04%252FE78naoUY4yvvD%7Cclp%3A2499334%7Ctkp%3ABFBM_KvUrq5f,False,,,,,,,0
63,https://www.ebay.com/itm/402966531772?_trkparms=ispr%3D1&hash=item5dd2ad4ebc:g:NukAAOSwQ8xg4B~H&amdata=enc%3AAQAGAAACkPYe5NmHp%252B2JMhMi7yxGiTJkPrKr5t53CooMSQt2orsSv8pnySnjCrvuafadD2t5dwvOZjX4JQU%252BF9lVm1B1qz3Rk8%252BDCG9bKmHZ45DQAXPsZcLT4993Xi%252BiX1ZN%252B0SVt7BA1idglPqYdzmf25rchGOCrQDBfpRa4352FYI4gmUSD9h9uOh8ABKx8QD%252FfUoAr9fOzjuggUwcoSO6nYA82IZaHy9c%252Fyk6pnVkU0sUTG4rueP6Ql8K4NliSqGjQedNgg5WVxiqllu9%252FQINAHUL%252Bbcb4YPPjFnD4tBQ5c1fPHMvGP5QR1rXWTVKBIcN%252FnYTgM20IzPojhmNpnQrWYz724%252FsbGvLbLYfXjNDKRAG7XzuA5EetRP0W8oL7ST81BCejZvRzNrosefxkXjpKvF09DsS522HcOHrp3%252FwQtahmzRSsq57MtJkAImh69vIIIVY5snoi%252FctEeR8TwHpPXDi7wFXYNNzvrRE2Wo3RPWsQKWF7ww7Al6mc6uh1C5JGgdc6PaHZNHFRiuFhinBCXbluEQLRYEeC2ykLfCVDiAbsKvQlFWtKq%252BIl0A5uFtKs%252FFaIyL7AcYKw4QUSTOF30EeaSxcsmaikzo21Ww4Lknnm6iOckekPWBNW%252FLW%252FfBcy6Wte5s56qegHH7rplIYACGp9nbaL0FRBSR7MIQ00bJMre9Vtmpu1fObrjIvWrCZ8Ia%252B6bg%252FWqpoClC3jDSG2E4YmdloC0GD1XkHpg8Bfp6ySSEA66VthNBKuCGkALwBRfN5nBlQ2zwKKACUjr0RZESEw2NmwXT6keTXu8SjAMJ3PbBDlNkUHtQ5Zti65yL%252FterSj7POadjtSYOsEIqhy2j16kgOPFUBPNv1xxuER%252BA6HB7B%7Cclp%3A2499334%7Ctkp%3ABFBM_KvUrq5f&var=673163040699,False,,,,,,,0
64,https://www.ebay.com/itm/353776731057?_trkparms=ispr%3D1&hash=item525ebc83b1:g:IywAAOSwAaNhmMK2&amdata=enc%3AAQAGAAACkPYe5NmHp%252B2JMhMi7yxGiTJkPrKr5t53CooMSQt2orsSL18zNWkBdjtrQvAkAXIw%252BwT985y0TsWu3KSoV2R8umbTdhVh1RkDldF94H19SMJ6sBw4G8A7C6bLutyz2a%252FXK4UucsK2IpcBMb5sQj98c4gLsTnJzH1d5Q1ByW7UM2wuxcvgC0XEKQ%252BeggmRYBhu%252FIXtF92JQZHGUMs3VfuJkGgtj%252FsGWEApTd0EUbLMwKQlFjGJptjNgo748%252FkInPHebav%252FIwwjOEo3YyzuzoaSM%252FunzxPbxFio0aqQrZU3vk50hQgOX5tqIhHupz24nivWRZuybE098jNIkHm9jgaqsSyQDMuxrCG3yy5UpTO8DgJKg4sZZBAVoEXVnfWQoK%252FwtHW6Y8jQ2b%252BviJ2ylMMnHStpXlAPEJBpfvSDFQBaAFTa6JIImE1b%252FK4EmF6A6BR1vc58M6bTsbVtXq%252FW8D1U1kTyfY%252BMZjfl9abL3IWxfo6J%252FQv%252FOwuR0b%252BJPCOqzJvCT2mvsiGiyWtoL5Wta7or%252B4JIsWJHZC75Ox0M5iuX0ZfgV1hlxBUC7isxo3aw1sx4GYmJJ5OOT6rdCcv0vw2OsFc8oC3lVI1C%252BbZhGttYVVtJHCMtB3mmGlR%252B%252ByGqNIeBxd1SyIQsPj7ySu8q9VnocwNxDoDkd8IVMnMUB2w9NCVBmnmg%252FzjQVKw1ZUAIwA0LJxIwUNa8bSWbdz5XDGzDcBA%252Bz0I1iHVbFIXgMRGW5G4Hvzs65nJf0Z0Crfu0Y5dF72aeEnIHhv6k2GQ3V1HKH3vD%252BKiORiZmoD4LtS6p62na86dEE0xXIJBK%252FlmpyjL7Ozjs%252Fct%252F4Cq68WNjZKMMQgPcUy6Y8V9nkniozMSuG0MD%7Cclp%3A2499334%7Ctkp%3ABFBM_KvUrq5f,False,,,,,,,0
65,https://www.ebay.com/itm/165209107341?hash=item26773aeb8d:g:ZGkAAOSwdNthg6g4,False,,,,,,,0
66,https://www.ebay.com/itm/393744476222?_trkparms=ispr%3D1&hash=item5bacffe83e:g:KCgAAOSwqBphpQ0C&amdata=enc%3AAQAGAAACkPYe5NmHp%252B2JMhMi7yxGiTJkPrKr5t53CooMSQt2orsS756jE49efRUdZ161WGGuaSgLYvdfoqBKgCjlGYCu9PFZRqm9OxErV%252FHVWHWdDI5QUrCf84%252BN44%252BRv5vMluaeX%252BfWir0ulMkbS3B9lnsCm0wgcjpdRL%252Bd0V0oaKSpJ80HORW5kwLt4ZhKlM6ovexqFOxagwoWwDldWKRwKLg53AEe%252FQJZFOFQU658TrlF6Pmre%252FhuTBSQsx%252F6cHJjKxv8f4MWpb8vauUxadgAl%252BgyVG%252BnTtUB9prnoti8t%252Fa65JpNOY9y3%252BkmryqKlYD3qhAlVt%252BM2719MT6MX9LR0oYvhtAlHBNif7HVxquNt8zQpo43ewUqRnm9WnFGTqJRauq%252BkvPkwWQFaLJoxeRQacmUU2pr2lzBcOUZuDBWVK1Kcvzer8PMbjJBTZv1muionIqWJFB510uldCR87GHP4cfEOkiLjyUkWgofbQZiQkjgNLkWdYDcXRXmYnw9Jemdyr%252Bk0%252Fc3LaN2VcxTdV2XlzKL8iHeIFECwDXGXC1i6%252FsZWNsZrdGb2294YK2j082ZoOUyPcKZiUnUJPROnwzFc4m6GNCsbfwIHUD1LcJ5FvysayO7ONBAMBVdv3urce4jzxCHj2hqN8atdpx0rKHiI3xlaxRuIM8wpe7pMIyYu4%252FI%252B8ISOApzz5Wif7PxGTuV6YMH9%252Bkdof8ITK%252FZetyuDs7Y5S7D2OX7QE74946fN3z0KF0R%252F8qOer4I2TsfKp3o8pempBoXTuTRs0NsxBBStPfjX9lRHd30oKjM%252FbELDm3zGztD9Z5o%252FGqRaf4e9l26uwd73VdCWGO2M4MzX0FTr2lphYZWIk0V874d49IQUtkIBc2W%7Cclp%3A2499334%7Ctkp%3ABFBM_KvUrq5f&var=662428184429,False,,,,,,,0
67,https://www.ebay.com/itm/203717730053?hash=item2f6e85df05:g:PnUAAOSwdkphoDfM,False,,,,,,,0
68,https://www.ebay.com/itm/373772485094?hash=item57069381e6:g:ngEAAOSwVQNhe21y&var=642813900427,False,,,,,,,0
69,https://www.ebay.com/itm/203576658528?hash=item2f661d4a60:g:68YAAOSwLllhIkqx,False,,,,,,,0
70,https://www.ebay.com/itm/284295219393?hash=item423150c8c1:g:XiAAAOSw1FRgYnYZ,False,,,,,,,0
71,https://www.ebay.com/itm/353788457294?hash=item525f6f714e:g:ZNMAAOSwyNVhPAdG,False,,,,,,,0
72,https://www.ebay.com/itm/265424121233?hash=item3dcc82ad91:g:QesAAOSwnXxhoYM7,False,,,,,,,0
73,https://www.ebay.com/itm/393744939412?hash=item5bad06f994:g:EdUAAOSwjVReVhTz,False,,,,,,,0
74,https://www.ebay.com/itm/393744884373?hash=item5bad062295:g:u-wAAOSwUl5bChvY,False,,,,,,,0
75,https://www.ebay.com/itm/174145032375?hash=item288bda50b7:g:esoAAOSwENVeD7DS,False,,,,,,,0
76,https://www.ebay.com/itm/373778396581?_trkparms=ispr%3D1&hash=item5706edb5a5:g:J5cAAOSwEq5hggm~&amdata=enc%3AAQAGAAACkPYe5NmHp%252B2JMhMi7yxGiTJkPrKr5t53CooMSQt2orsSGPM5LSpFpxB8y%252BM3EBCfFNQXfspx1cFsK4EC4u6EcvBehK34V5yDFTouhQd7R1Q6fuAyKFX5B4MatBmzLaehHYuKdn4nUD2ZqfSdLXdEXv%252BPvabdeYEwUgezayNl4zoIC7Z7NFCIK9PR3nQzaQBJKFKwTlrrVYkXTRglD0UqHzTTs3x5dz8CHQhB9TcCUeaYGDWLj9kBwSeyFP3ltiqMAQ0VMj%252BPjaPoUDvvVRsLpBt1pWjiADhOMBEvL8mIY1PHJ8qKuV2sxjsVmyYDRbzWzW3PqrmWDBq389xuj0QbDkQQzrL1A%252FQ%252FZ4v7q2tWMhlzKq5xAJFD%252FJcVAI0KvWiXGi%252FPBDdkfC2TKayxC62YPvYyfANhcmrAOsGK5EyYXgKBJ1mGInUxdhXqkr9k2eSE6wdQ6sBnMO9%252B3jIxKS1qtV%252FttnmidPN1tq%252FVG0VLWCiZWh3aCF1ZpxXV8x4W5%252BN5crY7XCKii7KoAf1HIe6Pokk2lC3ubvRCGgldV009sp7ZODg9tyFPVwi9c3K0AEOF%252B6bnKqQsi3SMLSi9q%252FEINJIcWUFpsIt7JSKKD4UUjpxa8SxrLDdahUEqs1qB2X6DE19W%252BED%252BbAAIiGI6idXc%252FG%252FpTgbB1TDfPBHhbx72g56fbJi2TCb7pRTtcO1EtNTCQ2Ibzy74uhdcNHqbWtd3XPsExq8v9UKlQWzkoomsleQyqxD01agZfe%252FloPuJmzoAqOUET%252BRiV735EzkR9S0Q%252BoAhI5%252B%252Fr81N6wUrKVTqmerVd5DMA8urQh52UyKO%252FrdBTwP%252FSw94a8sF4U0xey%252FuLSy9YwUdYENvNkEAe%252BSGFlvx%7Cclp%3A2499334%7Ctkp%3ABFBM_KvUrq5f&var=642819788127,False,,,,,,,0
77,https://www.ebay.com/itm/403059675811?_trkparms=ispr%3D1&hash=item5dd83a92a3:g:2VwAAOSw-nRfjlOy&amdata=enc%3AAQAGAAACkPYe5NmHp%252B2JMhMi7yxGiTJkPrKr5t53CooMSQt2orsSv8pnySnjCrvuafadD2t5d73UfmDaXbwuJCrnrOz1jDdYpXsAuWYpHTNm2OSZPqOcOAwrdG%252BmCCDFMFUMSZzbgDOqsLhsbOIelJwBLnKxSx6sDALEeFKx%252Bj4UJw09ga9WmfVDClqmkf3p1eF7IbX3T%252Fz%252FI7%252F0undfzs%252B6JwJtWi4qQihD6GECW94FPR9ic%252FPOOFgtNlOAysBhr2y2rMJSAcFb9VBTF1%252FwM6NRo33VI0iRtSajNJ7J7l7l7j7SdnKYLddJTNFLfuaxkCHH5OLbFw67SqBuX4hczXKzaWIo2meUcp9Oo9MoSQfQRKgSKmGM1izKzHLncd9LZOAOj8vcwy7nnDMy3irvUNic6SLnZiyJooFViCU55F1J9K0YZUXdLAhlWqQHEC1S42ig5poLefWLUdvSnsInox5bcoG9a6IvkTnto%252BZ6zz6UxBINmS25Qm7ymqXZdbuC1WA1AWld26S0T8iEgsAvxaCoX%252BmFsFhOzh3expBBJxJRl2wCTqzXRW%252FkWxb3YvOWNMJjbyNAD5fWjlz8rRP3lXJavs6LRbVzUV80O2SyFE8ocEXT8haxZeRFTIuXmpZH9VbBQJDlI7e4K0NIWUX4BriSh0%252BLkzI6lo%252BM%252FLAROYi9ne4sR7f2ngq2k5%252FP%252BOASXJzKHLClbCRcPRCJsuqoY8zsMZP16JNU4bcBnXz3b6tGjyT0tcuvflcXFHGwCdYByEgPyK6Qh%252BtebZ7pbMbQmJrj7Ln%252FFBtbi1FkovvgZVaA1ezb7q1TwhirgC4903kbeuH7hsjhQIEzBdpCGQ9DpmcslTE1Tw3ioP3iqlQg%252BVVa32uP6nyS%7Cclp%3A2499334%7Ctkp%3ABFBM_qvUrq5f&var=673224270109,False,,,,,,,0
78,https://www.ebay.com/itm/124264624649?hash=item1ceebfb209:g:DX0AAOSwGOFgm5G7,False,,,,,,,0
79,https://www.ebay.com/itm/165210205021?hash=item26774bab5d:g:rzoAAOSw2uNhpnYT,False,,,,,,,0
80,https://www.ebay.com/itm/165207305233?hash=item26771f6c11:g:nWwAAOSwvfpcFzMq&var=464763154842,False,,,,,,,0
81,https://www.ebay.com/itm/353789509209?hash=item525f7f7e59:g:g-QAAOSwAtxhpSFl,False,,,,,,,0
82,https://www.ebay.com/itm/353789509882?hash=item525f7f80fa:g:76AAAOSwkfhhpSGA,False,,,,,,,0
83,https://www.ebay.com/itm/255253127706?hash=item3b6e45a21a:g:TxMAAOSw3oRhpSFw,False,,,,,,,0
84,https://www.ebay.com/itm/133945827249?hash=item1f2fcb1fb1:g:pMMAAOSwBZRhoGDe,False,,,,,,,0
85,https://www.ebay.com/itm/165210205505?hash=item26774bad41:g:w7EAAOSwyKNhpnYZ,False,,,,,,,0
86,https://www.ebay.com/itm/353752738310?_trkparms=ispr%3D1&hash=item525d4e6a06:g:S1wAAOSwq1FftckQ&amdata=enc%3AAQAGAAACkPYe5NmHp%252B2JMhMi7yxGiTJkPrKr5t53CooMSQt2orsSL18zNWkBdjtrQvAkAXIw%252B3uNvZw2dTfqtWLQ4Di%252FSrs4qtRWJJeN%252Bm5jGfIsqRHLq8WnYxxbz0nFnaRJ33QIpPWKIIjKdKmTM5dEZLEer9QziKFOvD5od4cQzDcINbe%252BcSWmAHfKMGscf07f%252BxKM5T4lPsD2rBn5hBp645CgS9I9fgiMII0mvkBsO0VS2J1KfqqoUTkV7H3rX9%252BIB0P2gcJfEY%252BXGj6c8WLlt%252BYysigTvGWdB8hKJx1galXILuy9CZeS%252BKmjmPw3gCo73kf3zPITnWu2dV7DTpZt3fJ1xO7xVEHz0G9734vgb%252F3%252B6RCPhdrFNiqV8WEOWkvL5ywCKw55DouEIX2VoooYKqH%252BopPMgxHkEGvYDsxvahjPd4ZbTMtmMOzlNPiZmB%252FIEpyasZCu%252FAbygCSSE8peoeVa4R2A%252BXy1wI3V5Ba8JJ2OFHGJg7NtLBOMd%252BYs6746gHVZpBPmWRfc1sX19nB3GBpaQ7eOMSWQaco5ddOanlBwx6NfybTG2KiVoOiJ9inYQFsGmwjCVe459eQU7OmawvWWPvGknHda95PYP6GwF%252FPQk2mjDVc73BJtcoRTXElhUc%252B27ddweAbhW0Ky6qAYkA%252FHmF4ABUgVRnw6Pmr2GebMByaEWjbYU5Rj%252FkDuXmuELoazstVJEjiRF1QXePsNZZ3wzcGLnWKzoB3tRphaXHydW9EutEtfU5z0UMQ2jUYxicCQWQIbEnrFmhHFjbJfy09n382qwwb2CWCls6ljM5B%252B3B%252F4bm4ANO98m3f0kxTj0oSC%252F8jPhvVvHtDvpj8uktE13jMwaq8FzArFnsodeKHPJEW8%7Cclp%3A2499334%7Ctkp%3ABFBM_qvUrq5f,False,,,,,,,0
87,https://www.ebay.com/itm/194379798711?_trkparms=ispr%3D1&hash=item2d41f058b7:g:478AAOSw9s5hSYXU&amdata=enc%3AAQAGAAACkPYe5NmHp%252B2JMhMi7yxGiTJkPrKr5t53CooMSQt2orsSMJP5lymjvym%252B0KHUMc1dIcfd96z%252BJCbdZEA9Ygf%252FbLBYj7%252BMeKp2F2%252B7I1aQgWeQmhWcnFzXSV2x%252F4O%252B9PD3axTXMr4zRIZoVGQO%252BSyPCu2QFI2WTCW97rK5t7R6kzjeVoQ8g9l6g%252Bh7eI3Le%252BOg3PmFKA7siAFuC8h7pEda0U%252BTYj8Ns9px0b1ukSsUX%252FhhqtZRYQuGKnT4xTiqTSGXS6w1GBGbKpnb5rWVyLpQBBhVjlEuATPrslHA%252F1M%252Fu1xXPKqj08v7Amjha2y4FC3yp7IO4TviBkUF%252BaWA0biELiFwbm%252Bgg2PqMxPVkusOPGm2PCSkPnKtWYKyM4jJSMYSyT0%252BKTR%252B5gi%252FDuLiX8HidqX%252FJEs4mCp8dyeBxsnaWLx4xYK%252FUel1QYmXiH4QbBkv2mj4ExBz9KgPTfuOhKocLyD5LUfv7lz%252BqV11GF8kg1lYM7v1Wqb42q7xbCL%252Blu6ahc3qVq6mK2wbjuCHVE5tGVyKnDCY1tLtzWF1bzxV1oGzVjKaL3JsOYaGBxfYFWM4j5Od3gE3Ex%252F0XXdJd3DIaiNvDhJHv57VgaUVn%252BJM6imxNNd570kZRk%252FWrUYfLjdt1ihMMnw6swytacur9rBU%252BrDO4b56wDxVup%252Ffu90jVU3mon49WJw%252B5pzWzGay%252B1NX2tfg7kcJJUJyt1%252BMHnvAy0P%252ByzQKhBfyV2UIFUvHmRQ%252BV5cpxnIZ%252BK53zxvv4xGJeYHphoVRH%252FSqHpAw23TTrR8wsZxGhjQkZxS2eF9m9Fcl7rFf3yLAsmHoR2LJl4i%252FWy%252F0s7r0E5wBpKXsoyyJFlPZyZJWRhZksuPR9e%252Bkm%252F5N%7Cclp%3A2499334%7Ctkp%3ABFBM_qvUrq5f,False,,,,,,,0
88,https://www.ebay.com/itm/154724686933?hash=item24064f5c55:g:q2gAAOSwsJ9hpJDK,False,,,,,,,0
89,https://www.ebay.com/itm/203728064552?hash=item2f6f239028:g:KgQAAOSws2JhpNJo,False,,,,,,,0
90,https://www.ebay.com/itm/255253127949?hash=item3b6e45a30d:g:5IYAAOSwlFhhpSF-,False,,,,,,,0
91,https://www.ebay.com/itm/165210205103?hash=item26774babaf:g:2jAAAOSwW~5hpnYU,False,,,,,,,0
92,https://www.ebay.com/p/27016607724?iid=304081231967,False,,,,,,,0
93,https://www.ebay.com/itm/384537954517?hash=item59883f88d5:g:fNUAAOSwFN5hjM5j&var=652612735115,False,,,,,,,0
94,https://www.ebay.com/itm/304237750080?hash=item46d5fba740:g:deYAAOSwM1FhnhrY,False,,,,,,,0
95,https://www.ebay.com/itm/334236220389?hash=item4dd207fbe5:g:YFAAAOSwBLxhpNEG,False,,,,,,,0
96,https://www.ebay.com/itm/154611660304?_trkparms=ispr%3D1&hash=item23ff92b610:g:sVkAAOSw00phQXMH&amdata=enc%3AAQAGAAACkPYe5NmHp%252B2JMhMi7yxGiTJkPrKr5t53CooMSQt2orsSrvYRR9YP5PP7PIDqIHX%252BhMV9cZSeKywPTARo8nWxs6NFgDDVQtFxbf3KrA6jsObkNcAA9%252Fq5%252B0X8BjdU71k3oryMzU5dq4y%252FnTIzbAaqykItoFJpktkiQWcgpQAax8tjprFSgTtFlJPFIBJNlWTNIDuTiA7bIpOv7bEeyuEYQVkCy4znDdSDUIh3PCFBWB4izWRIwkGH4BTDeAZmCHVlb4%252FQ5FurNB6gp0ko5HUm0f18LCJKl137MiBmp4TAgjoRNekNGCVavWfe0u0oyqvnqwGsJD0MThwmWM%252FrsK29p1y8eSiv6r0bU1LtBPJkfakR5M4rJq1bRB6UsEIXtBYf1olEhvqrS4AyUWH7vPINCg7gesKn8xWLGYxBWsMM5uPPKV33n1A35AuSWYPuR2oIf8Te46aU%252FALd%252BxJcLLX2nzpCVnw%252FZk8x7AnBHm%252F4Oh5ES%252BYBehhW5UJ3%252Fq539SQBCPiG0BEgjHNK9xTtQbsQewPr0oKz59DBmvjjgVB%252F7Ud4luAZdR7CHGWruHzGIDkI4facFn56SghjzTyYAXdjL25YX%252Bo3QwPUSWKdHTFOwFO3W%252Bo9DRWD1h5cd5Gmm3tP%252FGJoB7YeK5I9H3vTurHPsqNEjb0hbGP6KB7yPlxNiisnRcKJj8Bam43%252FnXoruNGhdbvngQ4xxiknc8A4UIPg7J%252BSXcXWVsfQmyXja7iSD8U%252BLBmVZYpQHdO1F%252FPlDEg14Pd1ghHfhJuFishI3hM%252F72pmMJzav0pK6N4umalPIPIaduVuwnQpgPpCm0b7Gk8E4nkSdSHZjRYTwzW84%252Fr%252FnoNHRZqxWPb2U%252F%252FOvujzwH0i%7Cclp%3A2499334%7Ctkp%3ABFBMytDUrq5f,False,,,,,,,0
97,https://www.ebay.com/itm/403297441927?_trkparms=ispr%3D1&hash=item5de6669887:g:QykAAOSwmolhkOi8&amdata=enc%3AAQAGAAACkPYe5NmHp%252B2JMhMi7yxGiTJkPrKr5t53CooMSQt2orsSv8pnySnjCrvuafadD2t5dzE40i9pcv9pf3u3NEkuqPAfNj8Xz19YayzACR1dHX6t6awCtisz4r808blWwroE%252BarWqoL%252F6buurrYcSyz8zEYUEjDgoEqoF01%252BjP2AQG5eYt98uMqAs0YhLDDdt5p3PszE5zAswLZ72dswDR%252BN63LttwFX%252FI6FWJaC4tHw6Lx6Bn640pFNUU52IP2yZH9rB6XJthqfYNlFnYDkA7sjTGesmNEk9GtRecutELq4RPY946ZU0fNJXUb2yIaDpdtGQS7osuF1YvN5eYP%252FRw00aE4qF1OWasnHufN2Ov%252BfP0ns3ENqpCOImIrA1LJAwqUtBI2bjGlyXxtxnn4pofMxPwNqyYIt7pznSnF9s8OkbQU%252Bwudj3TVcQwzdTxzYLjHexF0B7s9doDtK8wihd%252FuSquNmnlwsFaILOdux5ybQASjNHxfhZiszJsKmYXheY82D5V0PPEjE%252Bd6uIFaRtAK1k4CUtA%252FSqncW6OL2ep85irdoCZBNVzJVPH7BX0DO1H1websViVPdHYr3hwDv0BApmmAbaRggexeSvbMOzMKUpNlOzjrkeo%252BgkBgjaryIguU5G%252FrE1tczQOTuUPG2LpqPCHbK4HB%252BxLkHILWh2q1FxeiYpFDtP98H20BUfj39NVmUIn8lCvwaIBe8G0CLq77PmWLYuLjA9ALhiLiELrZ8y%252FlMStj0kvqFfR2SWKQIl5bgh3moW2HmluyBlBTvbVn%252FsT%252BX%252B5ibBnVe6U6d0Zm2sW%252Fy%252FeSIPWsV8CZ%252BNoDlSHdS63crLsWvrTqo0E%252F3M0DznUsS4oV2V40qEAbkQUPbtdDf%7Cclp%3A2499334%7Ctkp%3ABFBMytDUrq5f,False,,,,,,,0
98,https://www.ebay.com/itm/185190060299?_trkparms=ispr%3D1&hash=item2b1e30110b:g:RXcAAOSwZnBhgShP&amdata=enc%3AAQAGAAACkPYe5NmHp%252B2JMhMi7yxGiTJkPrKr5t53CooMSQt2orsSiVOxdKebFepbzBLdar3mpXPvmmssvJN%252FldwfJlCL9etKr3xZqU%252BZPgyCGn1Q5vgjaifMym%252Fdva7Owov%252FAt%252FZTdQOEk4aVcUUcfhiuY8v6FBwS6cO%252F%252BKhk0984O2KiwZ9OumwqZg7%252B9BvU1W0J%252BXXbiGH8Ro4MYF9I%252F8SRrfN2X06ceiS7IYBpdSx5iIjB1DhWxP0dUijfu4WFCACLtu%252FWKWEZJmQGhkp9XiRLRuyk2HPw%252F88ZzZCTBMd9TXc5PimqR8nITybZOivbHH5KBZrhApemA185NSLnA6gUldW1AD%252Fbiv5mAYogp18JiSJksAfIa0vWSzTf5GUl%252BgLpm8rqEVtGzXuLGJd2sO4sRskpK9%252F5zYGN5HjKPwQfXTgiMrAe88OumfbvfTgdQKl3m8eEiiLQ7kLk4B9wf2lYpdgfncNrRxGuKfuyNLRE4TX%252Fsl%252Fd%252F5RVD3rXPSXG2T6ELeZhvLxw4OvdE878i3Sd7Nb6T4Go5J07C121gWdfEcvJzE8f%252BzeKFzdSNP9YTvJQ90lC66z42NtF1Zv0CfI%252BUaIs2V8BdZu%252B4%252BF7mnjI8m629fc%252F2QRxVQ7ddawoqv32IgBSJIakixsxaGLRb92xRT4oYazEoz1QY6Op5huv87MWtrVk%252BDEFAq6DfW57i%252Bc1GquG0ZIVgGV%252BV6ZzH0DSdf%252FCJSoypwWsyiCpGkNV%252B7lwJuTjI%252FRcu2aXJQNbNsLJK6L10we0Nelrr%252FZrBXXEqC5TrHuViuvjQVILhkzRWDUqZk8mDypr%252Fas93j7S78l59lFIl7wLdUkN0x32y0E22IY3nLlyLUozvp1pHTc%252BHKnK189%7Cclp%3A2499334%7Ctkp%3ABFBMytDUrq5f,False,,,,,,,0
99,https://www.ebay.com/itm/384547099694?_trkparms=ispr%3D1&hash=item5988cb142e:g:ScQAAOSwbblhpGe7&amdata=enc%3AAQAGAAACkPYe5NmHp%252B2JMhMi7yxGiTJkPrKr5t53CooMSQt2orsSpngC8TtjPC1%252FgpUwC4Gby5lmC7KOtFIXd04wkAbkEvtoCpAyn26QiraVGbf5nRCY1U8ViChzkTvBcd8S4LW%252B9nmXfB2rbG0WvKqzdqwwOJlmR8CZfceyfPXxat92iAnCgkDfg5i0cm4XU6USORoXa1bEFpXybLRZiuA%252FXhRdOSu4BCzlRx4IuaP%252BE%252F2ahMPBBDj05B4iue5io3oHrjFgm0MnOHhYrrEnSBTHV6LAFYv75xrt6xc%252FCzIaGXwfa3r%252FwMU%252BbAmWmiQqwM%252F4wN8ndlWvktNuSWUyHND71gxgJvOdzu7IXbo4i68BR0Zz8SvOnQ9diJ4GVv%252Fr8aN4KoC1UVHW8uZVKYlwTkMKJ8YKkbzlugHzJNsDrxrE%252Bg0xSwazJSj%252BHJ4NiK%252BpDVn6OnQf3PGzOki2MzRNAnzLlp3KuU%252BrWg7Io8Qtc6sAAz9ZuNzPE2fYYlUfPkm6alInAiWv1WqxuHU0qATIZE6FX4ZtPJcwy3tS0kh%252FCgDlfCN2p%252FUZ%252BbhFjfpfQF%252BEoW6PrvgWp%252B2BD%252BXdM2UEXNWht6BnS51tQmnpnvmAqQWdW8TUTtWN2fKwWhFxzT2k7NKw9eQ%252BQaPOFL7DZxnjxKd9J0vSnASTt4ZIqfHSZidNx1rJT7zt3iwprSn10LmwdDRNDulkSY8j4RPqAjcFxxfV50wDEShCVL%252F5yYD742C%252FsS0GYV0AmL8XdAtdEmNB2xlN1N2BUTM9bZiwM5mr%252Fu7Mlas%252F%252BxNyVEVYc1PtYNSy%252FEWkrq3gQWkaLF3ECps9MGgNPRdwrpyKznosd4nQ60hOPEyBYi3AH1KbCMmH%252Byf59aRNHyUK%7Cclp%3A2499334%7Ctkp%3ABFBMytDUrq5f,False,,,,,,,0
100,https://www.ebay.com/itm/154726555933?hash=item24066be11d:g:68AAAOSwZdBhpeIe,False,,,,,,,0
101,https://www.ebay.com/itm/384547099785?_trkparms=ispr%3D1&hash=item5988cb1489:g:DGgAAOSwmBdhpGfU&amdata=enc%3AAQAGAAACkPYe5NmHp%252B2JMhMi7yxGiTJkPrKr5t53CooMSQt2orsSpngC8TtjPC1%252FgpUwC4Gby48LwmSJ8AL14%252FXt0NRF4mr34gGkf5EbbdaAGyEa%252B1dG1D94itf2vWNCd8ZVCV401I6nBi9UwpD4U0dikF5lDh1doviIm8of3niLZP5IkOcbMV%252FH%252F%252FMcET9bJMqsloPH4%252FvaeYheKyi0dEI3BbufkN%252FE6oNcFiYrqgHL2sm9RTUOceaqDZEZHE2vIOd2mYx5q9aGcSsZX8FcnK%252BUBeAQ3sxBW0IABNWPjFXZ3kj411ZcIaM4vp%252BIS4pICk%252BxSVa%252BgUGaMFdKntyWjA778U8uoUjNipXDp%252FxtbIu%252BL5DKQnP5HjPMVFZzD7jmTA4LvSbpEW%252F%252BpX0%252Ffg9B2%252Bw6gX9IG3M2m7wZzhIWevITboavi%252FqPqVQlCkN1zngpmjI7KT4Ndab9SsFjRmK%252FmKQTLlCAYBR8pGiuI33wNCPKKbneOC7oFUlxJ5k%252FniMZZpL43PJXfW9An2cdhxYHvf1e71nTiA%252FbgxIcRRT3Z%252Fby%252BljI7HVTw24racJhwt0GDoOkXRST%252Fay0YxhLdVhx5QXzuSYw1f3QUmFAP%252BBnvr2PogeC7hM%252FTnkIzdMjbrdS%252FUDiWlF8G8XdtQ1x4hPtRLH%252B%252BNook6S4IaiwzF0OnBfeYl2ReSKE2kiM5aOpnYSHCtg4oLaQ%252B7D4BNptsX8L9MQkkVUIDH9QRSzGMA3N7SDJZC%252BgWZBAzXlR7FnJuvFVAxN9OGmYG7Ym2AGHb0hBBKF%252B6Z4Jphu6owtPwG4eK0yVR5N3ED3hgthO88U2%252BaXC%252BMChjN9G6azwuGdoyj6Go5Ua9zC5R3QVQ7P09NIrhPpGq%252BojKKQz%7Cclp%3A2499334%7Ctkp%3ABFBMzNDUrq5f,False,,,,,,,0
102,https://www.ebay.com/itm/154726555939?hash=item24066be123:g:MEsAAOSwix9hpeIo,False,,,,,,,0
103,https://www.ebay.com/itm/165209525825?hash=item2677414e41:g:7MEAAOSwe9hhpeIc,False,,,,,,,0
104,https://www.ebay.com/itm/154724686925?hash=item24064f5c4d:g:AtoAAOSwSilhpJDK,False,,,,,,,0
105,https://www.ebay.com/itm/165209096830?hash=item26773ac27e:g:S8kAAOSwoBpheo6P,False,,,,,,,0
106,https://www.ebay.com/itm/393743941627?hash=item5bacf7bffb:g:LegAAOSwvPZbSdiA,False,,,,,,,0
107,https://www.ebay.com/itm/393743975104?hash=item5bacf842c0:g:O7sAAOSwh4Ne6z5-,False,,,,,,,0
108,https://www.ebay.com/itm/393744065795?hash=item5bacf9a503:g:D5IAAOSwn1dfGAik,False,,,,,,,0
109,https://www.ebay.com/itm/184589156795?_trkparms=ispr%3D1&hash=item2afa5f01bb:g:2VwAAOSw-nRfjlOy&amdata=enc%3AAQAGAAACkPYe5NmHp%252B2JMhMi7yxGiTJkPrKr5t53CooMSQt2orsSiVOxdKebFepbzBLdar3mpbcUi022pz8cm4dadbCAaiEwga3LODjSF6QctVYds%252BfPfiWHlOubsFtZm6a6CzLY2iNsRRw%252FTeJkGxVnUI96Thwiv5ZP0wVIZ8TxLa48i0%252FrxO759F%252F%252FXUHSjvpNaUIzqb5DvvUI8zof3aqEmWy9pfaucjUDXV86LkduNUwjHzYTD%252FjyqD0buY93P%252FspR0qSpniY%252Baj4bLdVOhi%252F9SS1jYm8BZOvVUWttxPvzS9oVoeONKyOaQALgtp6Wve%252BaNvjC9m5cULl3Eq67awX3xsjzRDGdDTAM3JIXlnUPe2DbnLABlPcLNVmOYEpPHDVYkzMfqKwSj3fROuxPl7Y%252FY2fAj1bJ5ZAKbBoiZcMzH%252F4ITchbsEn2UPpzKfCIqcF%252ByVi1h8vY3Hm1xVx97qx7nsErWZNOxP2k97kZW%252BYS%252BSAw6Mcf0uPfJqMx%252BBzokKEumRre2Crwa7h89zlnx%252B3eFiLOwEi%252Bu%252FdivMWWSNF06mhwtqzKLZ1gToKToY%252BbqNg7KYMAywIlirXS9c3QPkJq7CaZcGHG63WTUPpgLvuuxJDuWY%252BYiEc2cqWLwXxaWUqiEVNIQJjrcto8yPE5xRuVeRVPZ5PzmmfBqMbpTC%252BRNGHYLzl94UaAucjd7qYfGrLUrUsQOX%252BwEgy7yAQjmP%252FM2MNAkHSJTOMqre0%252BmTinwBs6CaYmxqU0znrW0pvoC%252F6sBnn2qdSWDnDESMCCZ6fRO%252B7K48C2A%252B02dHOjTe%252BTaqGGuT87LcVmIHB4Wz6KtdSnJEnTaqGWAU3em7QYh2pSoxRf7J8j3XDPBswXNnOgzMLYthN%7Cclp%3A2499334%7Ctkp%3ABFBMzNDUrq5f&var=692307477127,False,,,,,,,0
110,https://www.ebay.com/itm/393643143349?_trkparms=ispr%3D1&hash=item5ba6f5b0b5:g:4WEAAOSwly9hccbW&amdata=enc%3AAQAGAAACkPYe5NmHp%252B2JMhMi7yxGiTJkPrKr5t53CooMSQt2orsS756jE49efRUdZ161WGGuaW%252FcJ3HCzzCkuPupRN%252BYkGEN5OxCrWXMtDGwP6stk2fibv9A1VnPMvDRaW5kH63qvXckI4KHnVDD6NNYN1D6NsxFoRogi%252BBV%252FKn%252FoWegIcDISq50VcpSKf4t3rlFzaf6Z8lMbWCIhNMDdp8Mgz9JGxuYLNzo99bScj5QBYCfj9T1KwjQq%252Fcn49XZDSif2cDac82GVsEIiZwTi%252BJ9Mar8wYgCgMInfsIZMNbS8oA6YOtvQJ4hhJhDova5N4pnK%252FTF7cDZlbDynNksDXUA%252FJSBR0dnzGH0Th73PnjAxJSRsjDrKGywAZwdd0kBMW7mVHScwpuPmXcinwfT85TylhxiAwG2KqImcSXvwNFqoly5pKam3nCJZIXahwXyZUFpuzkJMozRgQipnRzu3dBr9sYWBo5JmWwEHHl3FiUziyRT6GNSDxzTH8QNMTGPn0kAqb%252FR0i6cSBRCCpPH54w9LXTYfn0D8ermB9YR9ID%252BBMzQj4PSgDY95rnlJCdIl8mn1Q2KeKdRXnS6Q7GOZNwLGbIb%252BlYmLDGdlCdFYR4lOMjNTqjYXGPOOcOG5Q9NDQkVvyz9DjeKw6tWSu6qp8xUorzu9THq67m%252BZY8hWEkKlZOLYrFGMe87OhMGy3AYq9gqhSaMge9scg7Yojt1kv6Qg%252BVBDrVtK19RV%252BhNLEe2Gk%252Fs3urkMcxo9B%252BwgOkAvzQXwx0JKesn9xvLvcee1dKQgsn%252FFx4NGQRsbqiO2LkouyHuN9yFPceE4d8haEw486Ct75F2RhEHrT7MekOoJbyKULtJS4F8GGrjGh2A0F1AcEyDie0b%7Cclp%3A2499334%7Ctkp%3ABFBMzNDUrq5f&var=662383798363,False,,,,,,,0
111,https://www.ebay.com/itm/373666338114?_trkparms=ispr%3D1&hash=item57003fd542:g:NaQAAOSwCaNhHLW8&amdata=enc%3AAQAGAAACkPYe5NmHp%252B2JMhMi7yxGiTJkPrKr5t53CooMSQt2orsSGPM5LSpFpxB8y%252BM3EBCfFEQH2Mxi5n1j7SpChW1BcBb2ETTBvQdnj4DE0an5MRed9WFHA7mifqF0RyKbZMedTCEIrjV6jjKD3LgqatOj6PcdpHS%252Bb3ygihSzpNzFy%252ByjRFRVk0yyhN%252FEcwHbx4UwDd1RXcb1uAW7RH6eUg30j6hQJtLxQsbLsHRLeVRLwauiyuPigEyb6F4T%252BymlOgJIVOBJK7qTcalktWsdWtLUterWDAKwPeHJZWZsxKSfaFrPJlx9oesAkTwqCoNkAUz9U%252BcOv%252BtcYK3CokwUFaRFj%252BrQE0LeU5AZFZHSZfxRKUpZbNkDEhldzrRp%252B3KYpD%252FQzGITvfIzF9mHieB0o9xnc4geRFxfrMRx2Sffyzhf2Lsnf8VTZ%252FyqjTPrvtIsSRgwWwnnnBNnBTI8DvBgqbBCe9Gl0WUBg4msJEQ6PBXTlUVL747thXWMeMVezKBqhmKmSbPkjq6OmqOjxE34zCe7kr1dbhFXd9DBGdxG2ZRZ3NjyzLXeny5GeyBl6MfTgzQIO51n6wTGZ6tYYcTywm8lGGVTBx%252BlJ9OE%252B5mlsxlSOWrDkDlnXWDwL3FUREUPEdlhUodPzu2ypzhTJ5E4I34N4Br3RJTBQy1E63yoyNml4CKIftOmWXJZrdP5fYItTbkQwArIgBFAXFxNrB%252FWQpbdchRZexJ%252BCjBdEEnmG9SecT0R0q3QPeJTx%252BeOYhNA7iBFdnkwWd0ttc5Uq9fqUjpAvkUS5lYrb3OPm6GvRUzu1UnqHk4gVt%252BPmRralZgOWLqKih0jelbxobyobB1pyEsVSeK%252Fop9NSU7osx05yHRQWnSJ%7Cclp%3A2499334%7Ctkp%3ABFBMzNDUrq5f,False,,,,,,,0
112,https://www.ebay.com/itm/184833758641?_trkparms=ispr%3D1&hash=item2b08f355b1:g:GKkAAOSwcUBYKqIh&amdata=enc%3AAQAGAAACkPYe5NmHp%252B2JMhMi7yxGiTJkPrKr5t53CooMSQt2orsSiVOxdKebFepbzBLdar3mpXA1wf8WEcgAlRQiLH8FzdJYENJ8JE4xT3ZWxa1pkwJimzR3o42qeXcQSuPqvqkMmV4o%252BYuoH6dU%252BoahrIRvonJC8JCym9tk3bP3U5wKWMeELGtBzbIE9ur0CUIo4jZ9%252FU1%252FgsyhbweVb3afQzb1OINR0C7XPDj7tDbQQzIF86Pro2IXHR6uy4V5H3Ftt7OjoBsbgU9u9WS%252FHtM0liwFnnFbBt14kXzTWH9s1UvCDq4U%252FM4sl8Quq0lpvPx1NHCMxM5iFOlJgKB4uut%252F7LG6EvphkUioLScTvG8QgxBqI%252BKKt9FlgLJ4nbmj5OAzVG4dh3VgtnZ4l%252FAYDnod2k8jm%252BrW69fpQy0hYhBvD0OJY6LBfukAKmhfRpE3OGjFA%252BkJ0S7iamb8ClwjInqh0ldJsuxLIB%252FNQBshl%252BaXaR9XAiPIFJOG1RqhEGtxIs1uywOvnRgj94GVHCkN4Oo%252BTMnva9OTMyoGE5vUn5GbivlGJ0TAQ5H8v9tvMtQTD%252B1d9ZYUhD9Pxs8ZvuWd7mWssDTj%252FllywqcAX2PDZyKnmxBWaA1sX2Bmw4iuZhVwLNQ33R3MNNaDd7dKgTX2Qt73%252FvrYHLF6HDpeRCk4xq383JFMOK%252BJuhRXj2fKBeUJRqB1EoiUYvQkiAP3G7azCmlF%252BjrwD%252FuPfuMHnDcSdCnCwTafFZ5e4UsC0j%252FFFMPlPuA2FPOb2X9sVSJs%252FNp32GoZk2ymhlLJd0RgWLAHumX6JmR7dbdENYanSXzIKfnKKokcwDIJCnun5B9M5BfJ4tIP2U3t%252BFJnlUtUEh7Xii75ESn6IdbG%7Cclp%3A2499334%7Ctkp%3ABFBMzNDUrq5f,False,,,,,,,0
113,https://www.ebay.com/itm/203520994238?hash=item2f62cbebbe:g:LhoAAOSwyKtg6bmb&var=503901800512,False,,,,,,,0
114,https://www.ebay.com/itm/334235586161?_trkparms=ispr%3D1&hash=item4dd1fe4e71:g:RrcAAOSwMtJho-k0&amdata=enc%3AAQAGAAACkPYe5NmHp%252B2JMhMi7yxGiTJkPrKr5t53CooMSQt2orsSJQp8uqlJ8r7SZitI9gA%252F1btMtaPnG31xQEiWVJ%252FPtXb4RxkwvaVjM1Jr37CVNlFP5%252BOLMRdPzbMUcInAU8utlkOXyJWZk8opPFXj%252B6nTJm%252F9wn2%252BWi4MrjOmc3ACvZZsmMu3%252FETqNrcymjsVAscHEN7RZQL8bs26aJHhoR80RSg27FJRm01G337gfLpSW5eY81oPAMoLaRstxDdUlzm358AiE%252FAocLWzGJha2gLUlVZcNQ2bW73pjF12BIltdaYLsEa3fbIEqkUO341jjy4IWBI%252BXIRhwAURbsloUbRbHLj8iMP%252FGG7%252F5iEhHXfLA9CopDOzHpssuoQPaHw4qx3fi9UKfPKb7%252BxtdElZoXC4zMKQg1K%252FtOZ3mdk3D5IPXXo%252F8Mbwgvo4CjAVcvBpwA9eAXd44SCu9WbbNkZ3tmTHoeOUzO14Ef5uXqVM3AmZJBllT7eHVCdhexUqc4i7zBzNOzHdX1FeeYALQiglVYZw6BIe1uFEXVhvJLjvWKT1VAywJqWRYNY8hsjCI%252FDHTD8cwx9sAQnlLR83WLBQf58Fgz22YAYbijRNHlXBMtEA6wl25SchbzRJ%252BMsSdFX2wYktuLE0aLHperRV8uRc2H%252BK4%252BKdKamE2InjvDviG9M%252FepPHzQbrIe%252BvmcDVBikkuiFgz6INYaZsqM8p80S4pBO%252BOJoLWp8sL2lz0ohQ40o1ow09JG%252FflV7edQeGWPDVNMqzivSjpV1gbsElwqGzfqu2O101JU5E6g1RJkBuXCAwgIoqI88wJ2FSK7%252FyFOA%252BAexD7pHT5vLOkq%252BfAlnSmlCI9xMDHGR9AHQuCkMAjXePUOIe%7Cclp%3A2499334%7Ctkp%3ABFBMzNDUrq5f&var=543238140962,False,,,,,,,0
115,https://www.ebay.com/itm/393682287781?hash=item5ba94afca5:g:c80AAOSw2yhhhvwX,False,,,,,,,0
116,https://www.ebay.com/itm/203520991589?hash=item2f62cbe165:g:LhoAAOSwyKtg6bmb&var=503901797920,False,,,,,,,0
117,https://www.ebay.com/itm/324514547990?hash=item4b8e930916:g:o0UAAOSwoyFgSDSO,False,,,,,,,0
118,https://www.ebay.com/itm/154727142690?hash=item240674d522:g:8RcAAOSw6QFhpnYP,False,,,,,,,0
119,https://www.ebay.com/itm/393744061405?hash=item5bacf993dd:g:NrIAAOSwqatdBL1L,False,,,,,,,0
120,https://www.ebay.com/itm/224716020756?hash=item34521e5c14:g:XAYAAOSwjSxhZR1R,False,,,,,,,0
121,https://www.ebay.com/itm/165207296282?hash=item26771f491a:g:EpQAAOSwr39dTjPH&var=464762828980,False,,,,,,,0
122,https://www.ebay.com/itm/165207283702?hash=item26771f17f6:g:YZMAAOSwMZBgwd8I&var=464762990124,False,,,,,,,0
123,https://www.ebay.com/itm/165207299044?hash=item26771f53e4:g:wrsAAOSwj2hgm2XG&var=464762996585,False,,,,,,,0
124,https://www.ebay.com/itm/384418144007?_trkparms=ispr%3D1&hash=item59811b5f07:g:Cu8AAOSwlYFhU6kX&amdata=enc%3AAQAGAAACkPYe5NmHp%252B2JMhMi7yxGiTJkPrKr5t53CooMSQt2orsSpngC8TtjPC1%252FgpUwC4Gby99upTlx%252BolRXXl1zv3QBcBs3UpBGOkXt%252Br%252FMW4mjOCrUIz%252BTYInT5i5cY%252FGuueMKTcPMPcDfrPTfs%252FfXAecy7VRJRm%252F6qIxIfKF1iDEe0CC3baxGAKnA1zr8qSO%252BQRg0oGdwTGoIUScXUkgc4XiloJbFF%252BlTk22KRB8LbCNZhU%252Bv23caNe7b7XkV5Q3gYYNmT7bM33rALEBxwCdnR2%252BTfOgaexosBPCirj8MAmFg7AOL%252BalemyWecCHjHiBA4ksML6Kg8ibK3t2Xsqu4ddShIvQ%252BHgcHOzl502%252FR7BPR5Xkr1pT3CnCvOVWIY0pEMkHTv%252F555d1eTWKWai5eqODnB48%252BnKxuSZC2i9rwRcp5nxuxg46rakKEXKQ1jsyvzqOYLLcs6bOXXZpO1AstuFdmLNY2jEmUlIBWeKODVs%252BkffVYqn%252B8ByVxTP0Dys0qJJJmwt3KE1VBychO2sUzDZswA8xharLPJcY6oZl8ktpek27lQqlAjqUA3TmhVDiBSmRyC6tzVxtMVPWoJJJxCvrhhmFxzUfQMzga1e9vbmHgqTYeuY8i3DZIVUzHd57L3CY6Rs64INVSRpgboFiL1TqlMHN%252FjkhcN%252BMfvUKZHUJu2uEkbSEfFebUo35LpRy5ACvj1CGIZiwrp3Bhox2pbzRtdN3YfaP7NPgT17ZbCAUL1dQ0d3Xh46hQu%252FzZ%252Bcr%252F%252BRxbxzlmLULDON3QVF5kRJr%252B02VTAquz7Ob1moE4kF%252BbLAob1%252FmJdZwcO%252FLztrBBZ5ZRb30ggaLQ%252FVdYnjqWI4RIMpjzJUt5dgAXtQuixMfXQM%252F%7Cclp%3A2499334%7Ctkp%3ABFBMzNDUrq5f&var=652554566267,False,,,,,,,0
125,https://www.ebay.com/itm/384417670596?_trkparms=ispr%3D1&hash=item59811425c4:g:LqkAAOSwyMlhLfuR&amdata=enc%3AAQAGAAACkPYe5NmHp%252B2JMhMi7yxGiTJkPrKr5t53CooMSQt2orsSpngC8TtjPC1%252FgpUwC4GbyxFSYmNe%252FL9%252BZgtaDH%252ByBhg%252F0%252Fv%252F4DWA6twzr7JrlFe%252BVq0qSvZUFYN7DBLp1%252FcBaMpJtqHo1YJqdLYMGLPMNbd%252FQkqIU3uZMlVv%252B2Fpb%252BHB%252B8nl%252FmRrBWS4SnlcFAMIM9RTct2d%252B5R0hiKpjPdV%252BGIB4%252F25xMQh4RKixS6U5KySEUWZnvyXvlYsG6cN5TrfjMDaFTwXP2aE%252BP7IOH1GhMv6mo2jfkQ9qUi2u1FNn7F7KfhsVK0JHbnTGNBemJLF1AE0mTZ%252FacM0SdQOdYfVFH8lLAOj%252Fo9b8UCCjfd1zDB3v1qleBXUizyDqsImYmVemsfc2%252BGy%252BQ1egwrAy2OTkVgccDqqQ%252Bs16UoT%252B3ra84QEJP43diXmEWKfAWc0lwTSL2rcUirzBRlGQfZdE%252FXEd%252F4fapBkNkh%252BOVp8%252FHPXEP%252FVLoNtXOn9Xdxx4OotDd8eOaxpxTOFVcR6q1PYsfr%252BCY51dSnnVfaaKv2RiUt4t9zOAjGOQjGKfH1Z%252Bdz4Y5yGKcRSB45IvGSR7I7O6qmIlspnNGlt7Eko9grPjYwZO7K5QSVAjZaJVpOygNTGvu76OgImYMV4HDvgrps2xFZ4ju0aN7sqvjy8vVM6Vw8YoXB5Yco7dz9Hfm%252FKFKjLNQJ9nktPC9TVDNjDRz2u4u1luazK%252FNrO%252Bqy%252Fhdl%252B9YDO6Nor8YJngTpIEfw%252F3sNOrydK310Qqidh8DuinYwtuwFm%252Bsz55sPd20ZxN%252B3ckEg%252Fm7mBnZTvWoJK%252BtmlFWwjH1HneDNnvfnlwbpYRADfmUsMvU3fclpJ8074t8Fd9vUCC8%252B1%7Cclp%3A2499334%7Ctkp%3ABFBMzNDUrq5f,False,,,,,,,0
126,https://www.ebay.com/itm/165207299588?hash=item26771f5604:g:g1sAAOSwulNe-ZDL&var=464763058583,False,,,,,,,0
127,https://www.ebay.com/itm/165207296007?hash=item26771f4807:g:32kAAOSwmpBdR4s2&var=464763063340,False,,,,,,,0
128,https://www.ebay.com/itm/165207294083?hash=item26771f4083:g:6ZAAAOSwAsJgm1Cu&var=464763086066,False,,,,,,,0
129,https://www.ebay.com/itm/165207336358?hash=item26771fe5a6:g:HeoAAOSwIWNhBhkD&var=464763119175,False,,,,,,,0
130,https://www.ebay.com/itm/165207328247?hash=item26771fc5f7:g:rtsAAOSwcw5gdPW5&var=464763135396,False,,,,,,,0
131,https://www.ebay.com/itm/154727141962?hash=item240674d24a:g:d~wAAOSw9pVhpnYG,False,,,,,,,0
132,https://www.ebay.com/itm/154727142224?hash=item240674d350:g:Kk8AAOSwVDhhpnYJ,False,,,,,,,0
133,https://www.ebay.com/itm/154727142319?hash=item240674d3af:g:jtUAAOSwRpxhpnYK,False,,,,,,,0
134,https://www.ebay.com/itm/393744489206?_trkparms=ispr%3D1&hash=item5bad001af6:g:ihgAAOSwVphhpQ43&amdata=enc%3AAQAGAAACkPYe5NmHp%252B2JMhMi7yxGiTJkPrKr5t53CooMSQt2orsS756jE49efRUdZ161WGGuaaVpW2vg05AgXNEa2jX8oDV135xioNd%252F5NAMcbs62oCu8JIeaEansKOmiKgFdp47dslZKq93jlP2hbChQjV36MQV%252B82ftm2CYhQ9cT7jDR%252BdonYIm9oDJJKjatsA7jTCUO0dpaOltmXOnfDeoszBWBDkZvKukU0BcbF0%252FR43%252F6zfNkpHtZfmS%252BBXoeur80m9%252FMjih0Vam%252Fhl27daZME44AU3WtlC42Iju0Vi5yceUC7AKXv0%252Bhg0LGNW%252FZ%252BKOKd52G5jWY8d4l49No9NBclcdNlaFaryQsop52F3yji9Dvuj%252FAfOtE8iw08LK9it0XO7bYzJDYFGkL5cgH2%252FZLr54ZUSEma5xLOVpWKKXsiTwnYv4ksmdLgMua8F8hfFdJ9szFX17h51%252FcJ43oDjZJp08ARvs0QwBJFA9d%252F8guvLZI1FjRoCd9qicEv3utooeQ7XWF%252FprG5SgGPyOdHZ4RI%252BlRRP3cI8u%252FUkOGRAxTPTHnIDcJ2xC0XgVvYKDjHxmO4hzr8CUq0%252B3jozoiA7zE2deI9G0nv3LKkNPyEjP0lE7uk%252F4lW2xWy1MCtDTj%252BizAl5bGgdK1mNAxsDOoq%252FHe2TncC7yxxRAP1cbbQR6dzf%252FfMrYFLIzA%252BwHgrK5ZmDXVVtxl%252F0Brul2dYXrk2mN2mNq00ZH%252BYPeqrLpsmXx5TLopO8T7%252Bn9eLuEvytfXBK%252FZ9NRn7Aa%252BuE3dSEzqK4zwbfhbT18hjbV0vittzUGXkwh%252BkWHlZKgPu5uNxV8viY%252BrZGwLgrQuu6hKD3JjrEvVuilm260KVSZTI%252Fb154Qa9TNJ62%7Cclp%3A2499334%7Ctkp%3ABFBMzNDUrq5f&var=662427825092,False,,,,,,,0
135,https://www.ebay.com/itm/353752738310?_trkparms=ispr%3D1&hash=item525d4e6a06:g:S1wAAOSwq1FftckQ&amdata=enc%3AAQAGAAACkPYe5NmHp%252B2JMhMi7yxGiTJkPrKr5t53CooMSQt2orsSL18zNWkBdjtrQvAkAXIw%252B3uNvZw2dTfqtWLQ4Di%252FSrs4qtRWJJeN%252Bm5jGfIsqRHLq8WnYxxbz0nFnaRJ33QIpPWKIIjKdKmTM5dEZLEer9QziKFOvD5od4cQzDcINbe%252BcSWmAHfKMGscf07f%252BxKM5T4lPsD2rBn5hBp645CgS9I9fgiMII0mvkBsO0VS2J1KfqqoUTkV7H3rX9%252BIB0P2gcJfEY%252BXGj6c8WLlt%252BYysigTvGWdB8hKJx1galXILuy9CZeS%252BKmjmPw3gCo73kf3zPITnWu2dV7DTpZt3fJ1xO7xVEHz0G9734vgb%252F3%252B6RCPhdrFNiqV8WEOWkvL5ywCK2CeB6kijWHaVXy2B%252BM04GDm3ERY9l8318Yp7pK16JUZ%252BuqG7Lkg4CobKtP6Fs2JLN9K7twxp%252FRdrxE5BVQvRBklCfjSrfXFeDmwyYM2xwpeKynutEQgjAcDPidHQjQn%252BQbiROPr52dUBHZtdXXxbZXMruqABASEHjX8sy%252FSpuHizE%252BbEk5ll1V76cGRsv34qKBnOwyUXikQsLdnMlqG1EVqCQmM%252FYJYJ8%252BvNyo3q7lPos9k%252BvWFCO7koiZ1ppbLKVaBPJqAYI10VHg5diCDxr6XFpLVylmzjlmOUIK2%252Fm9BtY4wrylA5t0v9emp0gGRc%252FFtwLHAfdZ50UwuhgGh%252BUnQNeOQF5f2zmLW1b97IVE%252BdfL57PJOaSQE2i4XldQ1Tlreg9oYr4gpntJBvYWXr4hwVHG9apytuaiaWk8k%252BHUqUGoWvmoMSd91rqTit%252F8S4yDFFR2jGIgxvt8cq%252BuYAzyPN%252B0YQfgwh8Lox4W0XnFW%7Cclp%3A2499334%7Ctkp%3ABFBMzNDUrq5f,False,,,,,,,0
136,https://www.ebay.com/itm/154727142884?hash=item240674d5e4:g:6YgAAOSw~V1hpnYR,False,,,,,,,0
137,https://www.ebay.com/itm/154727143340?hash=item240674d7ac:g:wewAAOSwzOxhpnYX,False,,,,,,,0
138,https://www.ebay.com/p/26048026972?iid=154727144780&rt=nc,False,,,,,,,0
139,https://www.ebay.com/p/17048827276?iid=154114396471&rt=nc,False,,,,,,,0
140,https://www.ebay.com/itm/373809094113?hash=item5708c21de1:g:4osAAOSwM6Rhpcn8,False,,,,,,,0
141,https://www.ebay.com/itm/165210055226?hash=item267749623a:g:Rs8AAOSwA~lhphD3,False,,,,,,,0
142,https://www.ebay.com/itm/165210055263?hash=item267749625f:g:Rs8AAOSwA~lhphD3,False,,,,,,,0
143,https://www.ebay.com/itm/174525158545?hash=item28a2829491:g:IqkAAOSwP4NftkTY,False,,,,,,,0
144,https://www.ebay.com/itm/353752736845?_trkparms=ispr%3D1&hash=item525d4e644d:g:ZMEAAOSwE3Bf0tC1&amdata=enc%3AAQAGAAACkPYe5NmHp%252B2JMhMi7yxGiTJkPrKr5t53CooMSQt2orsSL18zNWkBdjtrQvAkAXIw%252B3NOALoPqO%252F7uJLTHPPGTx%252BsOdtl%252Flf79ehWHP7BubEregI9WvbG79YIcb77uL%252BYkGDR26E%252F5q6bPXXdJASeZ7%252FKYzaRhfpJqHJd3atEzaWUJCihcZo5XAvCmsm8dIZYeLvzuauMvVO5khxFamSPBFx%252FurJPILPVslG76m0QzSgC0omxCAa%252FZz2y%252Fo%252BfMHLRDWVwFVHQSuYKsLPf%252B%252By8gs2iLAfUIThCfsYL%252BIl%252BA%252BciTYfoQB2XhRZAN3WwAz8RF1LnocqKzBFZ9O5ViwxmLYQP6xO1RllHVrZrSF5CKD6Z%252B6pDXzMkieqMjYKB4kK06AdTUCtOgSMGo3eXuVZFcFACwVALM2KLRHTlwUGII8nN%252BynwaNmeM%252FdMJFTMdDX3eR9%252F7tIOleEeAwbi1YBAvk0q1jKwkn%252BKLX4GjPxvli8nlifXCxwOGGXhvwrnA7PdQHkv5M5wtVwXDIrZq%252FdMtuQDW5UEZXCGNfwNAyUcPC8SH4mK47VYBIgHpv7BHCZm0cfIr3s7e4zljmt7OBvpVe3qGJ34jAxqkTfjoimKKJ%252BUsObsUBFHqyjDQ68Jtq6DwXT2eQSYRxvIyqqH%252FTx2%252BI6okXvWlpoX0BZOJPOXrsRbAG7BtZKVlHo4ucnAQEEdWQi99OsLoqnwR%252F2U9y2OTblBH2L7qwcaBoWYM%252BoFKLE%252BCMUp%252Fw07vUDR0PAcmOmvnaIuTjuuaa1LNu4cU94Os1TnRHTr7YdFSLyA6KjS%252F9bfhNgI0w7jP8QjVaC67hOEDexLJONP9tZ%252FZz4IVeJc9KXQraMQoUOjsEchPr%252BbPLgF%7Cclp%3A2499334%7Ctkp%3ABFBM8O3Urq5f,False,,,,,,,0
145,https://www.ebay.com/itm/384450327086?_trkparms=ispr%3D1&hash=item598306722e:g:hjsAAOSwQeJhayAR&amdata=enc%3AAQAGAAACkPYe5NmHp%252B2JMhMi7yxGiTJkPrKr5t53CooMSQt2orsSpngC8TtjPC1%252FgpUwC4Gby7Smcbqk%252BSQbZ5gjx22enG79kwfx2RxDQxCBG3WJveDJDKuNNmBOJ%252B3blpasRqoTofAJIr7BWwuwy%252F2XPoSe0F2UlQb%252FmUaWmU1Sp1nJvHSvC2sjcBNbzqxf0iFoo8ead2E3nVbYQ%252FIsvAx5IoOZmaSm808KiPpSO%252BqwlGpAqNmd8Z8yGhQBsyREr3kPCajOR5jxAR8RiH9yGp6s7jMXLd3ZBhuWp%252BpWEH8ugObeTS8K6e6ymOsrODK2T1i%252BycyIprNFkwLXCqtxoPMNbE91FIGfu85%252FBJILKicyWPKmUFrN6f6V0%252Fe2Rxghu%252FXoIier3t0m7WWG02C%252Fxv3bj7QAJEa9YJsykQIyRA%252Fh5gx9WxhY5qcPPPwpHnBejnDcPVWt80SGordeHrJ90h97xiwrQSJd5IybypfnQ235T1GNUZBLJK9b0RFS%252FUzts7v99XQ3%252BpF20BIDuqU%252F40eMo10ttd4Frkk1NIbItmJW8%252BuW2MN1Eg3IqIwhhbKpC%252FGKVn9DNqOLf7cqzYLVQARK21B4GF4%252BQnZWummK5xASdBMbgwUFLEJX4Cb6BiLqa6hAiWcvtbNhDQqmbb8BL4EJYg03e8hPbQmjSkuT2TQjqOWJvL5m8fnPdXM7T9n75%252BbBJp5m5HwHUL1vzzwAihPey7fENTgu4SBn4RK50XxG6YIAly8kzzzUCR5PQ5pFBUwkJFuM3w38M3XIcgm%252FO1YXgAqeiDIKYJsvwRKiOWQ76pZYuaK4R216FiD79zr06uje0%252BqDjJJltkDHvBariYOQ48MQ1D4mTYto%252B8p6XkT7GDNZdJeD%7Cclp%3A2499334%7Ctkp%3ABFBM8O3Urq5f,False,,,,,,,0
146,https://www.ebay.com/itm/384542890582?_trkparms=ispr%3D1&hash=item59888ada56:g:qxAAAOSwi0Fho-pl&amdata=enc%3AAQAGAAACkPYe5NmHp%252B2JMhMi7yxGiTJkPrKr5t53CooMSQt2orsSpngC8TtjPC1%252FgpUwC4Gbyw7P2tShWia0HmAn2hz3d5147JQspeEXf%252Ft0i1OW2L0oPtUa6%252B4CNGTUhxpGqPVAgNMWZTI0HFqhb9r8Te1gUICboV8NHvN1iUOwEE7iq0humtrWvsu6XD6RttbFVPt6eMA%252Bqtdect5md6T%252FukbN5eu3bL07WptwEmHY%252BCKvzHWnINeQnbqraJYLaQBqjs0SeO4mjLNQ%252BNhzTRH4XNV7MN0uJzuD7HP9kxNTMeIzcdrYvoJdLUYx9Exzgzh6aY9Cbx9qufP%252Bh4xei0XTaVYl7B55DfwKr8XdXcVglCQeeOQPSmqYDnFF3NYG5Ya%252FiTn%252F6KjLJYQOqGyqOvFp2yKhYMeSvEcnK%252BJO5eg7u%252FxzKSp6W5AOrxAwthffp1Ch6ZYkY0p16DMqqhu1q7Ns20xacCVQDigYsVyxATFIpEuMs68pu8P1we%252BWXaVq9vUXH36xPeVbK5YeseTOToNdDEjBlqBw8kY2fqLvFvtXVfaRpwgRBYjuckvNenlQ1Wg68g7e2FNkVLgb3%252B4z6Ea2hrm5AA%252BUutB%252Fm64EewEBEDaPHJ4ceqtc3t3Ki%252FUHqx2x2fqM0jgJS09maaHRP3qYb%252FLZuZKKL1Dj0YBNP6iIMvTx8PsAkyWTjFLQ2O1CGa0UHmbqwu8Elt%252FKV6eql%252Bv8vQoH%252F%252BV7SSpMg8LCfKz1Md1er4nIOKLY5UDKs1VQtqQ9aB5dsnwASHAKh%252BHx9jmwy1g7rYz9ogGwB8KIA%252BlY7XPOPwMZJpbPmHatkrX2cpcwzRlO9O05v62%252FQEHKC2I9iu2U3vMgiMm2NhclrmIEbVq9rMSk%7Cclp%3A2499334%7Ctkp%3ABFBM8u3Urq5f&var=652613880747,False,,,,,,,0
147,https://www.ebay.com/itm/194442835627?_trkparms=ispr%3D1&hash=item2d45b236ab:g:ON4AAOSwkfFharVz&amdata=enc%3AAQAGAAACkPYe5NmHp%252B2JMhMi7yxGiTJkPrKr5t53CooMSQt2orsSMJP5lymjvym%252B0KHUMc1dId2X8wT5uFzyAJijuu%252FXAjZs7Ng%252ByOkhcj3VdrpU0vVxTpeznw8E3dGgM8R62Hh6rNxRLHuk%252Ft3oQeRKpeG0TGgWWG%252BgormpELDcEwnyuqi6Hhy89YfDwmCtKytZ9qAgCRvD%252BXPkzGNeOrJgTLFLxVnGKdmshXlZE1V%252FweZngjhpC7byTI7fRD%252BU%252BoyKymSkiIRTC%252BLHXf2BNNW77wwGlXBWJXGL%252BpglM8drhnkWz3odWbeyIOoZ6m%252F%252BwytoEB6NxKprnI6JJ8LVrrZZJpsB802mnRdPuAJ06Rw85nGGCGneeNaUGfd8xL5dhMvrz22ooc55ylR53YerPi%252Fw5N%252B%252Fy%252F4RRdgvWo1hTOJIxKdygrEkg6Nvng1yxPVwCdtMh7EUMQSuLuAtpBtRSDlyTL%252FoU2tCw%252BTnvKDj0z%252FN9ZCLarSXzTKw5EeSGGuPUkHH7%252F74yOpGnPj15MaO6z%252FF3nnp2KtHBo1UIJA4BgZ2VXnd7gdyyP%252BbVkEa79CN8obMHzHhRf%252Fdc4Hhau3BPrFuvoK4UtvnzlO49vPCkzorzOkxMzN2MorHLLzdID28F9MkVll2NsvL7RbULgEj2WSHuwjWOvuRIdKuDhlE299rVT%252BJ9ZAtzKr%252B6Gj02GmH3QMA2Rj6dGMP5rDlNQAhtZMq%252BUeGpQu4sa0Hhhq0z2bAQHtORIMaZnUKDrKQhUbclexzE%252BiiPBAQeYHaCtyzcG7XC8kzI%252FnOQTxsWbns2mH86eJyO0YeT%252FJBM9OoK61nrBJkJlaljPyzWy0Ul4R2eRXq8d%252FU7mRHZ%252BO1JOxd5NXV%252F2ZwCRv8%7Cclp%3A2499334%7Ctkp%3ABFBM8u3Urq5f,False,,,,,,,0
148,https://www.ebay.com/itm/165207283592?hash=item26771f1788:g:dsMAAOSwig9dAcoW&var=464763093559,False,,,,,,,0
149,https://www.ebay.com/itm/334236086759?_trkparms=ispr%3D1&hash=item4dd205f1e7:g:y7IAAOSwvCphpKz1&amdata=enc%3AAQAGAAACkPYe5NmHp%252B2JMhMi7yxGiTJkPrKr5t53CooMSQt2orsSJQp8uqlJ8r7SZitI9gA%252F1V8ILY8wx2BY%252BEXiHdrahyF7G9jp0l1s0xY0isApztmOedUcu%252BQKru5h8ZPS2PdtToXzlcFZ0DMquy02uZ6IbT7cS1q7T3ursGDApOyY4ATiKa%252FBj%252BNPrs%252Bhq8w41fI0vtcjo0fZSb7Bx0J7w8i8gK99xqNqfmjKy%252BR4WaaEfjftHSFNWbhgNGZVL3Yi%252Fy7cL9TAbm0BdLsQ6lMO1ouBENxgyN6ui75HN82jt0rzFsopN6E3YVPl%252F6yNMGrk0fvDZ4fZPHHyv0BIm75KXdrayxyNbsFswP734%252F4CNaqkGQN8ytIq4wqYMbCTA5Z6p1BwFcGpcOL37CBkCIyttIRTObBqG9dj6ui1sDom8xPyjmiWlC4T0zYbuJbvD4ufdMhHw0DX1M91HFtkf1sSLaMYJoshj%252BlzPsA8d2e1rZQ%252BZ%252BemoXF4%252Fd88SnswmbqDy%252BNGoBeJTxcbepizuEdjvhIfTyA%252FOUsznljzApUuj6K%252FcZfSrWxDdGllJc01PsVaPDLSJhQp1sFiB7oEldb4MWJAbiM5LSISs3OBO%252FIe7zTQ1wP%252Fp9MSPDzBlPT%252BbHn5rbkl1lnMn3O2TR%252B8B%252FyhYp%252BcpywxLvxwYDLmjempDif6aSgZeCUXqlJVHNdr2ZWhEWQR317TcPy8%252FqQAcL9JBAhEfwVUyitYgq%252BJ9jmrWB%252F8TASd%252F%252F0VqLvqXIy9UpjTnpKz%252Byi3hLGalvmbtsGwSxubDD%252BXgkR08NBZMSrT1trJJQjWxpRTWJxoDnpMP4eVdigBP1xwsyzNrBqqK7Rdk%252B%252BGckAJH5lyCpy2QPa2oNSeySm%252B%7Cclp%3A2499334%7Ctkp%3ABFBM8u3Urq5f&var=543238656185,False,,,,,,,0
150,https://www.ebay.com/itm/165207337594?hash=item26771fea7a:g:ytAAAOSwYBZg-lr2&var=464763252580,False,,,,,,,0
151,https://www.ebay.com/itm/133948433065?hash=item1f2ff2e2a9:g:rCEAAOSwOMthpHOI,False,,,,,,,0
152,https://www.ebay.com/itm/384546177183?hash=item5988bd009f:g:GeQAAOSwgjhhpKJO,False,,,,,,,0
153,https://www.ebay.com/itm/165207302399?hash=item26771f60ff:g:hE0AAOSwqOBe2MFl&var=464762828484,False,,,,,,,0
154,https://www.ebay.com/itm/165207294877?hash=item26771f439d:g:iZEAAOSw9-hggOBf&var=464762909255,False,,,,,,,0
155,https://www.ebay.com/p/28005556867?iid=154726130534&rt=nc,False,,,,,,,0
156,https://www.ebay.com/itm/165209525761?hash=item2677414e01:g:bk0AAOSwKr1hpeIY,False,,,,,,,0
157,https://www.ebay.com/itm/353752722871?_trkparms=ispr%3D1&hash=item525d4e2db7:g:p~4AAOSw-DtgQJu8&amdata=enc%3AAQAGAAACkPYe5NmHp%252B2JMhMi7yxGiTJkPrKr5t53CooMSQt2orsSL18zNWkBdjtrQvAkAXIw%252BwLqesK6kKe1XBRjJXpUhauBF7s6D1Em3qm2%252FBM3yjaNQOR5%252Fe%252F4rh8EhR0CGtf7p0D3703wsFl3nLtxjirv8zhTsKDhY4UD9%252FECrkXUMCyjp85N8SfessckJhiNpYjD87a7j6Hw7b%252Bh7kjEJxQTYVeYvTg92Vj9LQUGbIMyg%252F%252FqvRddKnm1GczyD9LgjIKljGAYgidjV7gKWxzHOYWDFHBJOvi3veQGumZ5tuyZdxJVIlsi0wugVb4QIxKtHz3bUcDhK4evoLTupjtzGUKByTU%252FidQjjR7tFq7wazp1vhz0a0wY2PAyzi7nbs69dRTnQ%252B%252Fk0UWGGc39sVWLvkIBAoN53TszMQmwQrwe17k6WuH7%252B3Icsrl4WOY%252FGIGLvAGkW177Xpkg1KWPiXLK0O8PFfw3lUPgi9Vy2zD1TZCPfH0ap3TqoAamW%252F64oUpItaGoaehwNxq8aGFE3rx41ZW87dtz0LP0sQNy2TCKqYpaOlax0wGalykCwv8l5BUIIGn%252BTKF5p0lYmzovhRsk7Wmaedf9tRh%252Ff%252FNjU5OCNzLAe%252BB8LqicUx3hLdvblrup9fyedUIAFQ5%252FxoP%252BcJXIsYpLL80O7tPLwv32UT%252F2KRbNJTNkkqWQXOr2v%252B4MpV26QaPV3ClNxZ%252BYMbt0qgAmwJSEIY8xkXXcpNuvyfC838QI8oJzJ7oERiDW6lWYuvJKVy1RiS4RqBp5TFAf1BlLh9ktrbMzS2396CNCZ0uO87nk6JDYCSt7BoSJvBWeUAD02S4ltTW7g2b7f%252F4Evxx8OLPnTOpDWm6po5rD2PzVUDPv1%252F1r%7Cclp%3A2499334%7Ctkp%3ABFBM8u3Urq5f,False,,,,,,,0
158,https://www.ebay.com/itm/133802541802?_trkparms=ispr%3D1&hash=item1f2740c2ea:g:ts0AAOSwnp9c3m7N&amdata=enc%3AAQAGAAACkPYe5NmHp%252B2JMhMi7yxGiTJkPrKr5t53CooMSQt2orsSJcgWtcHxuyer6ttTfG2RgeeGVmfa27rbA5GpsPzdd8oRt%252FJMYkD9%252BFu1Ev5aXUyQbSCcQ9wyLRrMC%252FIOmfvi1%252FDf5VwglN6fOk5UL%252BrNTKnWkfqR21xJvLjkiFu0xWLeFfSuzluJvLDx8tQlrzqNP63eiAuxr7pGHGyHMi1TC6CMf3frWjO4kz%252BEC8u%252BmsX3G%252BAkc5ehMBbTJiS3U0JImMBJiX2Z1FbAEOWmfuRIPGfqqfAOzRxTfwtydzdpuINGYhy3yoY%252F0No6rQgAt3K%252FC%252Bff6M4Zkq9hTUmE40ict6xc9OklsGw%252Fvq1CYcqZsg%252BLfNzyH4miRRr2tj4rbmZ0FZuto6sJMQLKGEEQG5EZmfaP7rr%252BH2xE7%252FDgdR7Ql09CQQLeEpiZOdIXuqKq0B7Vv4vWVsfKGjJvKWJa7cMiT%252BbkzY7gsZ1KA%252FbBW6P7gPLJQKRp0kUAxwPhoKZXVbT%252FUf1pGsEqVaEWkc9Z3FokDH4mFOL1gZ5iJoZLSzbvo4vs2EiBazSxpeP5zhJ7ZEBsPloWDTMq1RKzpBNvAhX%252B20Xv7mwgnzwgWloWn8TGk%252FOUMJpklJAkrJUwAMqzXwhlDkboaJyvAQ4g%252BU0uoR7W8DPsWVNnCPhrdU69Gbh0BxisPN5q65qGnWuFWliM5DS2pV7EGO1jP5QFtyUjXj1usV9qRnIJzBUZRH9JPN%252B8oSmZoFeXiv1wqZzCQt168sP3Mx%252FaRLumLSy%252FWQ39F8jWGYrnNSdpsrGIP8ohKKCVLWVIUveOvmJakaPJ77SyvPMnSM%252Fhn5w0Bi1aYo63hJ4nz9cxI89ZV6CWoTYNojo9R09G%7Cclp%3A2499334%7Ctkp%3ABFBM8u3Urq5f,False,,,,,,,0
159,https://www.ebay.com/itm/353752739339?_trkparms=ispr%3D1&hash=item525d4e6e0b:g:8R8AAOSwhPZdgupA&amdata=enc%3AAQAGAAACkPYe5NmHp%252B2JMhMi7yxGiTJkPrKr5t53CooMSQt2orsSL18zNWkBdjtrQvAkAXIw%252B0hbSeZe4AKwFa43g2pXfOpGqbC%252BbM%252Bc%252B7qH6xjxV3TuKNKUDkl%252BrlVjnZH5y8kVKb%252BSyXmZF5D1ar5KBe9OA6kX9vD8bXoApre%252BPWS8sQ0KQqQQJfalL3IOcf2tRBiTzxKiyIVStHQRY3XKhAO8j8PVLaqknLKdV33TnEM%252BcG4S8GAyt8AVKUSqIwOsWHrrL%252FP%252FgEOrdrCeGF3%252BaO4e393zunUKvazCCgUBD%252BWW8wlPcAy5uAsb%252FBAKMce8ftwaXpTVlQdRtCbN1TIC1canFUcVvU58ovrXlGy1ZbHT2URawQV0KS%252B0v92FaBFjLajxzhamsw%252FF%252F6W%252BuYYB1X6fYQQ0vsDyH8FQ0NjnH%252BzVK3djShTQ5vEEjsKEr5PdDo3DlO6281oy%252F8IFTTJSu5tABfIMfPhqO0S6N1nEHKqB0TSfeyV%252F69H5Xjcpla%252BiPHnZMkmtLog7pEAalJ2OlA9K2Yz7mmw3RM4Nnv%252BSTjKkVnl89Be7vSSG52VlCkRy8i2pCpj7V9zWWMdQtbZqONV7TIN72Q888NGgEksTzWth%252BpBnMjTrXTtVQlz9vIDvTWakampcK7pduqqUFGUMU89c83oG2%252BJBXs0yeVdp4npn1toIhHdROrkEdTiVTMuqQqFyp41xxK7EFwsaNQMICJypD2tsjWUr46e5jrbcdHKys7oAQvKKHFw6%252BB%252FJoNmFp4RSkWL1CnYyq9H338qyjVYJb5eVBQICBxSkJiofCCUn59IcrwL3TKjrvNl68HzYICM9gWR9yKYmMH3fJQ4PJvLNuu78DwJKk8CThJBkQFX7oUye%7Cclp%3A2499334%7Ctkp%3ABFBM8u3Urq5f,False,,,,,,,0
160,https://www.ebay.com/itm/393706134686?_trkparms=ispr%3D1&hash=item5baab6dc9e:g:EskAAOSwfP5hlK-S&amdata=enc%3AAQAGAAACkPYe5NmHp%252B2JMhMi7yxGiTJkPrKr5t53CooMSQt2orsS756jE49efRUdZ161WGGuaS1tbG9lnXiikqNlOvTa1WA4gP2fr0kNjP7Htk2U%252Fe7K9%252F2FbeNFO973pjVvWO9Tcws2JnC16%252BHuxBS5n1vBhlG5akKjDN4iSqViId7SnZf9A5eVxg6sr5W3TwAEkfeeJ1CbnEXVC0FAJWz91Q4YLYOXpNyI1Z93l3NxTSlNwLCEPVoYK6aKfIw2Kz0L%252Bz3ePbIfRGd%252B9ux9T8a1%252Br6bmQ9IWhWIENRTyeG1mWK%252Fdk%252FQ7btmknT%252BYuhGzLkJPg2dMLFQKIVDn4Z6zhRFTXtYX8AJ663Fa0SQaiKnoa3Gb%252Fv65essjVEyvotVG5K2WLF2F8Ono5Esh975ptphDGxuULUH4xX3NDcJGVN4u1pPKSvOjIHEjNO7aSmzOI%252B5i8wXAdl2NIRhB9t%252FGuPS6rM7BmXmQ1xPmZAOtvUhqI4zcrQ6L3YqtIRedNR3b%252BIFxiN6zdCxeeF2k5VW8fNFfyAlFb%252Fmk98%252FtQQCeY1bGm%252FVIy33FIPo2Vls%252FoiJpFNXwGw9stbC6yZBAc5Jq76uXIEjCXkjMuyuqxP3Mn%252FbnAgfwjwCbKvoLj1s1Gp37X4%252B6o9p2DASD2RzW%252BeplnJu0RaSTyzPmbl7ONrYveR82vr2rJcqvTw0NvDh5%252FcPNes3V8ncJRh%252BYG8U0Lf3N58Q37qcXwfusgkDzTXHP7IeuvWN7%252BQic%252FRQld4kDGH3cWOS8RodASh5I66r3ogA1a4hfTPq0FId6KB6EfwUubIouosJ%252FeMF2uiU6PoDlc6JwzM01Aln0CArgIv5h7TRTc4VRsjhOmO0iEA02S9PfdBYKx78fB1B%7Cclp%3A2499334%7Ctkp%3ABFBM8u3Urq5f,False,,,,,,,0
161,https://www.ebay.com/itm/165210055315?hash=item2677496293:g:Rs8AAOSwA~lhphD3,False,,,,,,,0
162,https://www.ebay.com/itm/384545834738?_trkparms=ispr%3D1&hash=item5988b7c6f2:g:N7gAAOSw1BdhcNab&amdata=enc%3AAQAGAAACoPYe5NmHp%252B2JMhMi7yxGiTJkPrKr5t53CooMSQt2orsSpngC8TtjPC1%252FgpUwC4Gby6RZ4tkaPp23cMfvTMz7NT6MmhekjovqWh365SIw0jTo9eZFhyT%252FT0dyCM8PL8ppuSq50xjrnR6%252FdAzkkOYrvYBJo2JKxIV9uYJrV2yfGtYe30R1qJVSaCi46bMgxdTD9687dXAofrZcuxMCNsXVXgi%252BmmUHnO9eTZhScgjKzISs0KUU43EH8AWjVpXfNrIcGyMu48HuTNiJFkVeLcogHLNBcdzTwRr%252FDWQxwlXAiXBZcZLPyEwwCfubc5874KMs0Vj2znk0noGZrb0VeOo7Y0%252F7cEHIJDa9fEaMbrUPGyycF8LrqVseMepgT5mZeG6x8tVFxhhFHOPmBSnW%252BYekc5TV31geyXPQjBxGOb%252F7moW8UHYVqInAGK4kPkd%252FhI4Zna0%252FcBOubEUakKfod70JpE03bmDJVERGrCGpC4uDZ0fAh%252BwfmCnBuLH2Tg507Qi52%252Bn7MtnX16IpCmrIE0OXW7Z4FNaVeXjzbbR%252FjCIZeoMCt3N0mj8AWtye6Hyd68o5ZXjIhv8uU1u6%252Fte0d6mjAAv7s701xmYXg4he1Xth3baUH6A%252F54bn60ms4JX%252FAi48K7c6BARDMA3PYZS1p5ExmRzRp9PHKthhO9JAR3fuiYlPO1gP1SrPZCJIauKUn69odRu2GP1guZFpHHgqZ73eft%252FewIbmCah8KVi5VWItQi6rio2lm5vLsvcl6MKHxaSnhndyGZ6GH8Q8StV1BsMI8CbyUUFHfov4n8R02QzxfHg6OEH%252F4BMXN%252BSg9UTX8uXoJBm2FzKe7QCrF6xWWxeHLfaxuV2EjCfYJtH9%252FSYKeFdRRCV%252FR5fYvDTxpjsrQ%252BS43Q%253D%253D%7Cclp%3A2499334%7Ctkp%3ABFBM8u3Urq5f,False,,,,,,,0
163,https://www.ebay.com/itm/203448654734?hash=item2f5e7c1b8e:g:howAAOSwJoZgmpCd,False,,,,,,,0
164,https://www.ebay.com/itm/233659115125?hash=item36672b2675:g:ZlEAAOSwDbJfGm6A&var=533346290759,False,,,,,,,0
165,https://www.ebay.com/itm/165210205085?hash=item26774bab9d:g:0TIAAOSwb8VhpnYU,False,,,,,,,0
166,https://www.ebay.com/itm/165207336453?hash=item26771fe605:g:iRwAAOSwIvRhpHkw,False,,,,,,,0
167,https://www.ebay.com/itm/144310422781?hash=item2199924cfd:g:TigAAOSwuzVhpD-B,False,,,,,,,0
168,https://www.ebay.com/itm/154726113023?hash=item2406651eff:g:sEMAAOSwNNBheo6P,False,,,,,,,0
169,https://www.ebay.com/p/17048882836?iid=154726113345&rt=nc,False,,,,,,,0
170,https://www.ebay.com/itm/154726113426?hash=item2406652092:g:4M8AAOSwBbdhk1Vo,False,,,,,,,0
171,https://www.ebay.com/itm/154726113526?hash=item24066520f6:g:4xcAAOSwX1phpRPz,False,,,,,,,0
172,https://www.ebay.com/itm/392874861373?_trkparms=ispr%3D1&hash=item5b792aa33d:g:H6UAAOSwLhpg5APa&amdata=enc%3AAQAGAAACkPYe5NmHp%252B2JMhMi7yxGiTJkPrKr5t53CooMSQt2orsS756jE49efRUdZ161WGGuaSOLAZdaXBfE0h3aVnVrszdZIVFtaGBHQIFCVjeOgcNcmuuyYJgpOAevdRWyjiXFB%252BiOx46DAf6K%252BIbUTZw1oOT8EenUL0xb6QD27D1snWXoaHlEo%252Ft6nFrw4xu3xN0Mba5%252F%252FgxJrN1Rp1xZT9M1SaumJjYfGr5IQ256jRsZAqls9QWv29mifgSWz4yJUtxb36isnfa%252BiUNOaPn%252FXkPgFS40Lpl%252BSgl71N6tl8nDqDI%252BKlLgus2oVARBk39VU1E7zhrMRMoqXW0sl2s5L5OzlZ3Bo3Wi8OxSGs54BUUZYL9YQRZ4%252F42cBRNpbqGXWQ%252Bk9eVpuaSGY8Ur9sHf559tFMGg3DCoenPEfOhPoXafio0wun6vITyxBSvy6%252FxylBkJx3IMr2Jief%252Bbm3a4svnrx%252B9NXPvFsbV5xos6kVJRjcUbmqt8%252B8ULf3AQ8EOI6Nw%252B7Np%252FkXjvNlhaErkPbIRjaFHKhTy56z7VnORUwKzqMSa93TbCtLZkFzf%252FVJDYMmztxIXP0gPv%252Fg7eqDn20hwf4baB5fOf5l9%252Bd%252B9V8e%252B%252B6oLygycD0vT3UXYWpCJ%252BpBdTGfxXEVkA0rAB8k%252BtX1We%252BNpHdSIOYsvGq3UWbyQ%252BSc4iTI7kM3v3%252BMnk4kLWfCGY%252BZ0Bh5KNE8prGlxD6%252Bpj%252Bek8FqyI8pkV9LSkAehelX7mt%252Br6PRoWPCzPzARkDIGlMGTKeEWvkj9nt8x%252FhqW5xpdSTMnf9ozhWJzTUr%252BbywHOYI7XlGq9M%252BI%252FRX9Gm2mtGOifV24LYt9Q6RK3IO0TvYWJtTkCbxVAa%252Fz2JQ6wtw0y%7Cclp%3A2499334%7Ctkp%3ABFBM8u3Urq5f&var=661780206815,False,,,,,,,0
173,https://www.ebay.com/itm/125025413199?_trkparms=ispr%3D1&hash=item1d1c18684f:g:XH0AAOSwadNhpKJl&amdata=enc%3AAQAGAAACkPYe5NmHp%252B2JMhMi7yxGiTJkPrKr5t53CooMSQt2orsSdklQMNJI57wiNVfrbj6jFgXFixl%252B1fU7ivZA9WZtT4EPOhruOlQ7Al4g786nEkCsJaEZr6VQ9OnGqArMUvRN0Q17ff%252F3rCs9aIboRFQail1fCm0XQWb%252Fe5%252BhlRraqzoM4qPmuMch4WOEBbIaoCvtBPt%252FqX7kcngnM%252BHontEvz9LCFbHLqSIWSwNJtJxCS%252BhVB1706jvJFjk2cp%252BSk8PuXOsbyDTMVPkWSkKrVjnsgx1J%252B3PqvpXCfiIEET%252F2FkEwEe2ykI2%252Fr5jCEyDfydJlpfvEmM5d3%252FrAkmTMhkdYODy%252FMlnWY6OQVSK7AARbRvgbAWLfqQgHylffEWdjBX0kt0U1ZK6JqJpqufiVezP%252B2wyesd9%252BHjpqwqL75YpNs4BU5uzLsZD%252BDIrrXfQ1nsQ116CYYTuBQfsTrI6eotpFw5PqrQjXQL3h3yBT%252FT8YLo731GmfdGnbK6UIBeYySdqQAz2Eshuh6hWs%252BvfdYp1KeBPCmCanA9RG5FqrqsOmg%252BaOWbjb9pwgd0HE5dhKSy0J9Y1iB5Gtycy6Xwf65J%252BARdfogAdWUg3BKedX%252BNxpmuyciyUFH%252BL1BNsK2VmeVpZ9Unfrzt1sxJ7y84NgZXTLh9weeZDMq9qg4qDp%252FO3haghL3iSLn57flAt918iMvT%252Fy0vkOOng3Q46jzeJ3j3UlWwYmfNNYCqG6bCM5oeOHuHhoyY1%252FvvCV%252F1hS6ulH1V2LvzfLEISG%252FZX0AWDKFzUpdSd3V2sxQrigcxfottnmiZo5%252FZefCIYISiBAIxImmpTJkyKORHOpAlLqq4aIfXOgThcENewuvfoVYO8%252FmucC9%252BLI%7Cclp%3A2499334%7Ctkp%3ABFBM8u3Urq5f&var=426098296741,False,,,,,,,0
174,https://www.ebay.com/itm/154726130888?hash=item24066564c8:g:qgAAAOSw-jBhpQUi,False,,,,,,,0
175,https://www.ebay.com/itm/154726555898?hash=item24066be0fa:g:twIAAOSwLfBhpeIY,False,,,,,,,0
176,https://www.ebay.com/itm/154726556007?hash=item24066be167:g:Gc0AAOSwCQ5hpeIa,False,,,,,,,0
177,https://www.ebay.com/itm/184580981496?hash=item2af9e242f8:g:BwwAAOSw3olf2GJj&var=692299850617,False,,,,,,,0
178,https://www.ebay.com/itm/154726113203?hash=item2406651fb3:g:zbkAAOSwmDFhjhdo,False,,,,,,,0
179,https://www.ebay.com/itm/154726555717?hash=item24066be045:g:eQgAAOSwd95hpeII,False,,,,,,,0
180,https://www.ebay.com/itm/154726555775?hash=item24066be07f:g:gM8AAOSwTMhhpeIA,False,,,,,,,0
181,https://www.ebay.com/itm/154726130872?hash=item24066564b8:g:S8kAAOSwoBpheo6P,False,,,,,,,0
182,https://www.ebay.com/itm/133802501345?_trkparms=ispr%3D1&hash=item1f274024e1:g:DgMAAOSwPuFevQZ-&amdata=enc%3AAQAGAAACkPYe5NmHp%252B2JMhMi7yxGiTJkPrKr5t53CooMSQt2orsSJcgWtcHxuyer6ttTfG2RgbzbqvcWS9VrlfA%252B6F9NLH%252FH4u4ZBo3buUGuYP2hiNGXG2Gk6Mm3WpTz9eCE4MKkOZTIyk6%252BjbtUSe2i0sq1r17za4wLN51VYYJOwf4Ynt5e2f%252F6AXPpL%252F8tVO9zqazMZezGnJOXBWQ4aJNII2k30GAG%252FNWdNbY9EGsy3XNJV6Lw1kweFwOCksO5rmPzv0gT9jv5end4cNFRMPyJlJi8aQ5JCy1OyvLFsm4rqqd0GpVDgeKCe4oMvRbaoT74ADOblONwfXCQlDOfywtieTyUgakoc%252FayXzDKogcXOlQhg5wL0muAjlkhA35h1kbE5VcC6NOqGHzOZ%252B8WvyA8ZwnKOnjvypPcTP9QclJGAluamrLx2DjKcVjHVKkdnokbS3Dm41uy4j4UByi88Zof8AvdEKwedkmZZzVT%252F3nYYv7BFR07b5d1tCflvbIe2M5BG5eSWlsDiWHt10jP5n3s6s6x82O3zZ7zO49jdQS2KAdQLnT%252B1RnVPSGvLHbz7whm09m%252FwBtptVcAjzkQ21eNFQGJb2vX8%252BEtheTH2TrW7TsvlN4vOf4Ka2F3tyRW8h58F7c0JdKZIACctK9%252B7WmqX0Ke8AXaPJUt1HqCLCiEj7xjLZGthyjK6hZX090scWIeqp3rDGk5uLnfAd%252BU7I4GgaFaz6V7NYXvp10hrr%252Fq9r25CsA1e8jUWUKMsjiMcAtWx0WEC%252FvTcuJS25tsjYA%252BHXdrzZVegY7s6eFeEnLnFrXEKkS40C0lPwZTK%252F2qilrAGFGaIyRV7VIGwz4zrz0HmfDCb7eXMTD%252BrnYh7DuI9GI9lsVr%7Cclp%3A2499334%7Ctkp%3ABFBM8u3Urq5f,False,,,,,,,0
183,https://www.ebay.com/itm/393631148842?_trkparms=ispr%3D1&hash=item5ba63eab2a:g:k38AAOSwZBJhaemM&amdata=enc%3AAQAGAAACkPYe5NmHp%252B2JMhMi7yxGiTJkPrKr5t53CooMSQt2orsS756jE49efRUdZ161WGGuadi2igTVHhwWnk5cTPHlB7QgnHxjlklrMCUg0yK2bu3d6eoG6XQt7kwm3%252FMrH0ZtxvUb4v%252B8bEPNwD%252BM5JDJNJO0pQHaegHnN7%252FtsKJtfbMmmdGFtk74DhypwqzHZ2e8XZ9QH66UCK%252B%252BAc9TvTAo7GhwtHFOBDDTvjkwuWxQOo%252FmKvYCR7bZtYMcpuXPKSF2ipPoqvxiNKp6gnz%252Bo93sjSC4va4fLoJ4OqLnTscAcYXhsZRW9IGWHL6RevRLUMpO4rNm5heQhTRWmPEVM6M%252B2pwnK4heXOnRcI%252BQ%252FZO8mWU9rbNniLWe7aYv2soVNlQkC1zSodVMz9H7kpbUstuBUKDjGqmPddjYEOYjae3Mz8aucRUOD2E9rPtAUUGxj5wSrwyl7YYwAR%252BT9rxYdG5g47k0%252BkL%252F4q1Xd3oWy7Z0mqbulc33qtRX53MiKmkVKNLwbOTlW2Dn8sSdHnksbWVjiiF%252Fi9Fi8JT7juFyo5XTrONm5G4l0HalTIfl3m9%252FUY4IvpVyi70QbxLr3SyhJVTX7wgxiOfEgOjiyjCJ9BgZBBhI56oD9jD1COBRjwCBI7lRh978sreuSB6IgF1aVcMzB2Sj4NX%252F4ccEzkwK2UuBQAAJxKsBkGSaxpKQ0LCZgnoaARae9aq6%252FrYIZTxCklPbJ%252FMmlPOLJOMvGYUS7Ga%252FF7%252FwrAULD2ysXgHD%252BmIwGaaatftzLF1iZg1kVXGGlnc4qfguAAk%252B%252BLm0%252FP3maB7FvbVmP1UnGR3UzAzclb%252F59BGRW8j6QE1DHymoiV28YC7QpDDJJzvgBO9JsPRAKCkEnZl%252F%7Cclp%3A2499334%7Ctkp%3ABFBM8u3Urq5f&var=662376795488,False,,,,,,,0
184,https://www.ebay.com/itm/154726131933?hash=item24066568dd:g:zbkAAOSwmDFhjhdo,False,,,,,,,0
185,https://www.ebay.com/itm/223307718468?hash=item33fe2d5f44:g:fgEAAOSwEoBhnYvr,False,,,,,,,0
186,https://www.ebay.com/itm/165207293157?hash=item26771f3ce5:g:-nMAAOSwgeVgwdzB&var=464762790984,False,,,,,,,0
187,https://www.ebay.com/itm/165207333035?hash=item26771fd8ab:g:FA8AAOSwsV1dB1SQ&var=464762913761,False,,,,,,,0
188,https://www.ebay.com/itm/165207337423?hash=item26771fe9cf:g:2bcAAOSwxOBdTj7t&var=464763009473,False,,,,,,,0
189,https://www.ebay.com/itm/165207293733?hash=item26771f3f25:g:Zs8AAOSwhkFgybK0&var=464763025836,False,,,,,,,0
190,https://www.ebay.com/itm/165207335362?hash=item26771fe1c2:g:DEcAAOSwTw9gYXqw&var=464763033489,False,,,,,,,0
191,https://www.ebay.com/itm/165207282651?hash=item26771f13db:g:V7oAAOSwq9ZgnQDZ&var=464763042629,False,,,,,,,0
