"ROI"	"X"	"Y"	"Amp.F.F0."	"Time.s."	"duration.s."	"attack.s."	"decay.s."	"A.U.C..F.s.F0."	"Spread.pixels.2."
1	143	93	4.49	515	34	7	27	125.79	143
6	425	238	2.4	466	23	5.5	17.5	48.27	43
8	205	244	1.36	362.5	8.5	2	6.5	11.44	107
8	205	244	1.34	471	13	5.5	7.5	17.18	109
8	205	244	1.34	521	10.5	3	7.5	13.84	124
8	205	244	1.41	581.5	13.5	4	9.5	18.09	114
10	458	371	3.18	455	53.5	26.5	27	138.28	123
16	247	406	2.2	575.5	65.5	52	13.5	122.4	71
19	54	410	6.54	555	43.5	10	33.5	221	94
20	102	415	5.46	477.5	37	19.5	17.5	162.02	145
20	102	415	6.73	575	24.5	9.5	15	134.17	319
26	454	399	3.16	521.5	41	27	14	102.82	156
26	454	399	3.41	585	27.5	13	14.5	77.82	208
31	177	284	1.54	399	51.5	16.5	35	71.99	50
31	177	284	1.53	457.5	53.5	20.5	33	74.41	53
31	177	284	1.47	547.5	23	9.5	13.5	32.03	52
37	394	284	4.47	350.5	46	16.5	29.5	185.02	110
38	6	336	2.62	420.5	3	0.5	2.5	6.82	66
39	149	133	2.21	408	22.5	5	17.5	42.98	102
39	149	133	2.48	454.5	16.5	7.5	9	35.65	122
39	149	133	2.53	498	15	4.5	10.5	32.8	189
39	149	133	2.67	544	13.5	4.5	9	31.26	198
41	87	332	3.06	414	21.5	2.5	19	53.91	76
41	87	332	2.74	550	22	3	19	48.59	62
43	457	279	3.1	372.5	7.5	1.5	6	20.72	39
43	457	279	3.26	397.5	7.5	2.5	5	21.44	50
43	457	279	3.47	419.5	8	1.5	6.5	24.8	64
43	457	279	3.36	440.5	9.5	2.5	7	27.26	57
43	457	279	3.09	461	15.5	2	13.5	39.77	42
43	457	279	3.4	491.5	6.5	2	4.5	19.52	59
43	457	279	3.28	512.5	8.5	2	6.5	24.36	50
43	457	279	3.22	534	8.5	2.5	6	23.35	48
43	457	279	3.14	552.5	9	2.5	6.5	25.04	44
43	457	279	3.19	576.5	8.5	2.5	6	24.35	48
44	171	408	3.79	450.5	37.5	5	32.5	110.33	117
44	171	408	3.91	524.5	32.5	11	21.5	100.11	89
45	100	336	3.1	421	12.5	1	11.5	27.83	111
46	216	239	2.33	412	23	5.5	17.5	45.93	100
63	384	260	3.42	436	21	5	16	59.68	85
63	384	260	2.95	505.5	22.5	8.5	14	56.6	73
73	25	206	2.87	365	6	2	4	15.69	51
75	421	269	3.06	384.5	24.5	3	21.5	60.01	49
75	421	269	3.37	449	22	3	19	58.15	59
75	421	269	3.41	507.5	12	3	9	33.39	58
79	296	309	1.73	395.5	18	5.5	12.5	28.34	38
82	170	125	2.11	408.5	22.5	8	14.5	42.75	81
82	170	125	2.03	445.5	24	7	17	43.78	68
82	170	125	2.02	565.5	50.5	22	28.5	91.99	75
87	204	228	1.63	426	42.5	22	20.5	61.38	205
88	272	259	2.6	476.5	13.5	4.5	9	30.31	112
92	121	388	2.04	426.5	21	8	13	38.15	42
93	355	384	2.44	474.5	13.5	7.5	6	30.53	40
93	355	384	2.89	530	9.5	4.5	5	24.27	188
93	355	384	3.15	584.5	13	2.5	10.5	34.7	235
95	322	170	2.03	403	24	6	18	42.6	34
102	425	284	3.02	415	14.5	2.5	12	37.54	152
102	425	284	2.76	509	21.5	3.5	18	48.4	115
108	20	317	3.66	469.5	43	7.5	35.5	125.65	53
115	104	134	2.64	381	9	4	5	21.17	33
118	29	158	3.49	409.5	20	3.5	16.5	56.75	34
118	29	158	3.49	492.5	32	4	28	87.95	37
120	248	175	2.91	467	5	1.5	3.5	12.77	37
120	248	175	2.33	523.5	9	2.5	6.5	18.68	31
129	425	316	1.58	355	10	4	6	14.78	39
129	425	316	1.47	388	11	2.5	8.5	15.97	30
129	425	316	3.15	402.5	6	1	5	16.61	42
129	425	316	3.02	480.5	16	1	15	40.65	41
129	425	316	3.19	551.5	5	1.5	3.5	14.07	41
136	367	150	3.19	440	19	4	15	51.52	30
136	367	150	3.23	512	28.5	3.5	25	74.98	30
139	80	228	4.34	397	41.5	16	25.5	152.43	108
140	243	247	3.4	440.5	38.5	3	35.5	102.53	166
140	243	247	3.34	540.5	9.5	4	5.5	27.29	162
140	243	247	2.96	575.5	12.5	5	7.5	31.47	142
143	346	267	1.96	515.5	15.5	4	11.5	27.72	50
144	288	290	2.25	537.5	9	3	6	18.6	46
148	344	335	2.68	393.5	16.5	7.5	9	37.4	43
148	344	335	3.15	521.5	36.5	30	6.5	85.93	69
151	436	140	2.32	566.5	18	3.5	14.5	37.18	32
152	469	140	2.8	423.5	27	7.5	19.5	65.91	34
154	287	162	1.88	473.5	40	8	32	68.18	83
156	114	181	3.17	356	4	1.5	2.5	11.34	47
156	114	181	3.08	408.5	3.5	1	2.5	9.99	33
156	114	181	2.25	554.5	32	18	14	62.73	77
163	224	291	2.32	543	23.5	6	17.5	47.93	29
167	429	353	2.54	472	87	28	59	186.33	49
169	53	379	1.63	461	96	68	28	145.73	55
179	266	344	2.61	413.5	26	4	22	56.95	47
186	378	122	2.81	420.5	63	9	54	148.38	28
187	300	147	1.79	447	75.5	61.5	14	135.67	46
189	439	280	1.93	432.5	36	3	33	60.75	29
189	439	280	1.7	507	16.5	5	11.5	26.53	49
194	161	389	2.57	445.5	66.5	53	13.5	143.05	55
194	161	389	2.62	497	31	17	14	68.75	93
194	161	389	2.63	569	46	35	11	100.64	90
195	346	104	1.88	453	22.5	12.5	10	35.99	42
195	346	104	2.75	501	24.5	13.5	11	58.16	43
195	346	104	3.71	573.5	22	8.5	13.5	67.99	187
201	135	390	2.16	416.5	35.5	12.5	23	65.18	32
202	372	392	2.88	432	24.5	4.5	20	60.18	67
204	429	405	2.78	476.5	45.5	21	24.5	102.46	70
208	374	411	3.51	438	25	4	21	72.63	69
208	374	411	3.64	512.5	28	4.5	23.5	84.93	64
209	399	122	3.63	371	16	4	12	47.8	34
209	399	122	3.42	429	20	5.5	14.5	57.2	28
209	399	122	3.44	496	13	3	10	39.25	28
210	117	366	2.58	390	44.5	8	36.5	94.96	29
212	154	109	2.58	498.5	12	3.5	8.5	26.91	31
214	451	354	3.38	418	20.5	4.5	16	55.9	60
220	126	123	2.44	383	14.5	4.5	10	31.9	55
220	126	123	2.56	443	21.5	6.5	15	49.11	158
220	126	123	2.27	500	25	5.5	19.5	50.09	39
220	126	123	2.08	563.5	28.5	9.5	19	53.6	30
226	130	424	2.32	492.5	74	22.5	51.5	149.83	51
227	362	94	2.8	454	31	5	26	76.48	42
235	178	423	1.48	490	7	2.5	4.5	10.28	77
237	301	286	2.55	424.5	29	2.5	26.5	62.04	46
239	269	272	2.33	558	20	3	17	41.19	29
243	91	125	1.45	381	4.5	1	3.5	6.75	33
243	91	125	3.37	426.5	21.5	4.5	17	59.45	41
243	91	125	3.4	538	19	6.5	12.5	54.41	44
247	90	320	1.55	414.5	106	4.5	101.5	148.65	76
248	111	81	3.55	552.5	20.5	10.5	10	62.17	37
249	38	364	1.76	390	8	3.5	4.5	13.05	35
249	38	364	1.47	404.5	10.5	5	5.5	14.73	61
249	38	364	1.92	443.5	9	2	7	16.29	51
249	38	364	1.81	496	10.5	4	6.5	17.62	32
249	38	364	1.67	549	10	4.5	5.5	15.98	34
252	202	281	3.49	391	6	2.5	3.5	18.67	104
252	202	281	3.51	429	6.5	1.5	5	20.32	104
252	202	281	3.01	446.5	6	3	3	16.01	67
252	202	281	3.44	492.5	6	1.5	4.5	18.33	97
252	202	281	3.36	537	6	1	5	18	98
252	202	281	2.99	555.5	5	2.5	2.5	13.57	59
252	202	281	3.39	595	5.5	1.5	4	16.81	93
253	445	409	1.54	447	42.5	3.5	39	58.29	280
254	485	90	2.26	473	9.5	4.5	5	19.48	38
254	485	90	2.21	568	12	4	8	24.11	40
257	335	413	3.12	434.5	34	12.5	21.5	89.2	126
257	335	413	1.56	509	20	11	9	29.7	81
257	335	413	1.54	584	23.5	12	11.5	33.59	88
262	364	300	3.78	399	27	4	23	81.35	73
262	364	300	3.43	486	25.5	2.5	23	73.33	67
263	188	179	2.54	422.5	27.5	7	20.5	59.75	56
263	188	179	2.89	508	19.5	5.5	14	48.38	77
263	188	179	2.85	586.5	19.5	6.5	13	45.97	75
265	286	396	3.85	416.5	12.5	2.5	10	40.56	120
265	286	396	4.06	489	14.5	3	11.5	49.72	130
265	286	396	3.67	567	17	4	13	52.01	137
266	345	397	2.23	574	16	6.5	9.5	32.53	38
268	95	369	1.73	433	7	4	3	11.51	73
268	95	369	1.89	456.5	11	5	6	19.3	49
268	95	369	1.71	483.5	7	2	5	11.54	71
268	95	369	1.71	580	9	3.5	5.5	14.45	67
270	197	165	2.88	347.5	10.5	6.5	4	26.67	66
270	197	165	2.52	503.5	12	5.5	6.5	26.97	36
270	197	165	2.93	577.5	16	8	8	41.21	80
271	308	355	2.56	486.5	16	4.5	11.5	36.29	28
271	308	355	2.55	534	14.5	5.5	9	33.36	28
271	308	355	2.61	583.5	15	5	10	35.02	32
272	435	218	3.27	462	26	3	23	75.42	47
273	175	219	3.42	450	19	5	14	55.05	67
273	175	219	3.32	516.5	22	3	19	63.32	72
274	235	380	2.95	396.5	27.5	7.5	20	68.31	62
274	235	380	2.97	477.5	28	7.5	20.5	68.73	63
276	110	392	1.9	427	25.5	10.5	15	42.59	42
278	377	336	3.53	353.5	6	2	4	18.72	55
278	377	336	3.03	402	8	3	5	20.61	41
278	377	336	3.28	437.5	6	1.5	4.5	17.01	51
278	377	336	3.1	461.5	5.5	2	3.5	15.28	45
278	377	336	2.92	478	8.5	4	4.5	20.89	40
278	377	336	2.99	507	5.5	2	3.5	14.54	40
278	377	336	3.02	531	4.5	1.5	3	12.52	38
278	377	336	2.97	558.5	5	1.5	3.5	13.56	34
278	377	336	2.91	581.5	5.5	1.5	4	14.27	37
279	463	419	1.58	439	28	6.5	21.5	41.49	30
280	248	225	3.08	445	47.5	7.5	40	127.06	64
280	248	225	2.82	541	23.5	5	18.5	56.46	37
281	369	187	3.54	446.5	8.5	2	6.5	25.93	147
281	369	187	3.45	514.5	8	2.5	5.5	23.85	118
281	369	187	3.52	592	8	2.5	5.5	24.68	145
282	435	317	3.6	448.5	31.5	3	28.5	91.32	62
282	435	317	3.86	564	28	3	25	85.61	68
283	65	412	7.54	480	34.5	11	23.5	207	204
284	388	370	2.98	500.5	42	4	38	99.46	65
286	298	353	2.56	496	14.5	3	11.5	30.88	29
286	298	353	2.59	580	11	1.5	9.5	25.91	31
287	310	410	3.74	538	32	6.5	25.5	98.79	67
288	324	95	2.45	530.5	17.5	5.5	12	38.43	163
291	211	216	2.55	552.5	9.5	2.5	7	21.66	190
