"ROI"	"X"	"Y"	"Amp.F.F0."	"Time.s."	"duration.s."	"attack.s."	"decay.s."	"A.U.C.F.s.F0."	"Spread.pixels.2."
23	132	260	1.87	58	4.5	1	3.5	8.32	28
23	132	260	1.51	76	6	3	3	9.26	30
23	132	260	1.93	142	4.5	1.5	3	8.45	28
36	439	371	2.01	287	8	3.5	4.5	15.1	28
