{
	"name": "http://purl.org/goodrelations/v1#name",
	"numSpace": "http://ontology.eil.utoronto.ca/icity/Parking/hasNumSpacePrivateCar", 
    "numSpaceCapacity": "http://ontology.eil.utoronto.ca/icity/Parking/hasVehicleCapacity",
	"policy": "http://ontology.eil.utoronto.ca/icity/Parking/ParkingPolicy",
	"policyPHolidays":"http://ontology.eil.utoronto.ca/icity/Parking/ParkingPolicy",
	"location": "https://schema.org/location"
}