EESchema Schematic File Version 4
EELAYER 26 0
EELAYER END
$Descr A4 11693 8268
encoding utf-8
Sheet 12 15
Title ""
Date ""
Rev ""
Comp ""
Comment1 ""
Comment2 ""
Comment3 ""
Comment4 ""
$EndDescr
Text HLabel 9925 1725 2    60   Input ~ 0
3V6OUT
$Comp
L SFUSat-cap:C_100n0_10%_6.3V_X5R_0402 C25
U 1 1 5AC0441D
P 8200 3975
F 0 "C25" H 8200 4025 50  0000 L BNN
F 1 "100nF" H 8200 3925 50  0000 L TNN
F 2 "SFUSat-cap:C_0402" H 8200 3975 50  0001 C CNN
F 3 "" H 8200 3975 50  0001 C CNN
F 4 "General Purpose" H 8200 3975 50  0001 C CNN "Applications"
F 5 "0.1µF" H 8200 3975 50  0001 C CNN "Capacitance"
F 6 "Capacitors - Ceramic Capacitors" H 8200 3975 50  0001 C CNN "Categories"
F 7 "-" H 8200 3975 50  0001 C CNN "Features"
F 8 "-" H 8200 3975 50  0001 C CNN "Height - Seated (Max)"
F 9 "Lead free / RoHS Compliant" H 8200 3975 50  0001 C CNN "Lead Free Status / RoHS Status"
F 10 "-" H 8200 3975 50  0001 C CNN "Lead Spacing"
F 11 "Murata Electronics North America" H 8200 3975 50  0001 C CNN "Manufacturer 1"
F 12 "GRM155R60J104KA01D" H 8200 3975 50  0001 C CNN "Manufacturer Part Number 1"
F 13 "Surface Mount, MLCC" H 8200 3975 50  0001 C CNN "Mounting Type"
F 14 "-55°C ~ 85°C" H 8200 3975 50  0001 C CNN "Operating Temperature"
F 15 "0402 (1005 Metric)" H 8200 3975 50  0001 C CNN "Package / Case"
F 16 "Active" H 8200 3975 50  0001 C CNN "Part Status"
F 17 "-" H 8200 3975 50  0001 C CNN "Ratings"
F 18 "GRM" H 8200 3975 50  0001 C CNN "Series"
F 19 "0.039\" L x 0.020\" W (1.00mm x 0.50mm)" H 8200 3975 50  0001 C CNN "Size / Dimension"
F 20 "Digi-Key" H 8200 3975 50  0001 C CNN "Supplier 1"
F 21 "490-6287-1-ND" H 8200 3975 50  0001 C CNN "Supplier Part Number 1"
F 22 "X5R" H 8200 3975 50  0001 C CNN "Temperature Coefficient"
F 23 "0.022\" (0.55mm)" H 8200 3975 50  0001 C CNN "Thickness (Max)"
F 24 "±10%" H 8200 3975 50  0001 C CNN "Tolerance"
F 25 "6.3V" H 8200 3975 50  0001 C CNN "Voltage - Rated"
	1    8200 3975
	1    0    0    -1  
$EndComp
$Comp
L SFUSat-cap:C_470n0_10%_6.3V_X5R_0402 C23
U 1 1 5AC0443B
P 6775 3000
F 0 "C23" H 6775 3050 50  0000 L BNN
F 1 "470nF" H 6775 2950 50  0000 L TNN
F 2 "SFUSat-cap:C_0402" H 6775 3000 50  0001 C CNN
F 3 "" H 6775 3000 50  0001 C CNN
F 4 "General Purpose" H 6775 3000 50  0001 C CNN "Applications"
F 5 "0.47µF" H 6775 3000 50  0001 C CNN "Capacitance"
F 6 "Capacitors - Ceramic Capacitors" H 6775 3000 50  0001 C CNN "Categories"
F 7 "-" H 6775 3000 50  0001 C CNN "Features"
F 8 "-" H 6775 3000 50  0001 C CNN "Height - Seated (Max)"
F 9 "Lead free / RoHS Compliant" H 6775 3000 50  0001 C CNN "Lead Free Status / RoHS Status"
F 10 "-" H 6775 3000 50  0001 C CNN "Lead Spacing"
F 11 "-" H 6775 3000 50  0001 C CNN "Lead Style"
F 12 "Murata Electronics North America" H 6775 3000 50  0001 C CNN "Manufacturer 1"
F 13 "GRM155R60J474KE19D" H 6775 3000 50  0001 C CNN "Manufacturer Part Number 1"
F 14 "Surface Mount, MLCC" H 6775 3000 50  0001 C CNN "Mounting Type"
F 15 "-55°C ~ 85°C" H 6775 3000 50  0001 C CNN "Operating Temperature"
F 16 "0402 (1005 Metric)" H 6775 3000 50  0001 C CNN "Package / Case"
F 17 "Active" H 6775 3000 50  0001 C CNN "Part Status"
F 18 "-" H 6775 3000 50  0001 C CNN "Ratings"
F 19 "GRM" H 6775 3000 50  0001 C CNN "Series"
F 20 "0.039\" L x 0.020\" W (1.00mm x 0.50mm)" H 6775 3000 50  0001 C CNN "Size / Dimension"
F 21 "Digi-Key" H 6775 3000 50  0001 C CNN "Supplier 1"
F 22 "490-3266-1-ND" H 6775 3000 50  0001 C CNN "Supplier Part Number 1"
F 23 "X5R" H 6775 3000 50  0001 C CNN "Temperature Coefficient"
F 24 "0.022\" (0.55mm)" H 6775 3000 50  0001 C CNN "Thickness (Max)"
F 25 "±10%" H 6775 3000 50  0001 C CNN "Tolerance"
F 26 "6.3V" H 6775 3000 50  0001 C CNN "Voltage - Rated"
	1    6775 3000
	0    -1   -1   0   
$EndComp
$Comp
L SFUSat-cap:C_680p0_5%_25V_NP0_0402 C24
U 1 1 5AC04459
P 7550 1925
F 0 "C24" H 7550 1975 50  0000 L BNN
F 1 "680pF" H 7550 1875 50  0000 L TNN
F 2 "SFUSat-cap:C_0402" H 7550 1925 50  0001 C CNN
F 3 "" H 7550 1925 50  0001 C CNN
F 4 "General Purpose" H 7550 1925 50  0001 C CNN "Applications"
F 5 "680pF" H 7550 1925 50  0001 C CNN "Capacitance"
F 6 "Capacitors - Ceramic Capacitors" H 7550 1925 50  0001 C CNN "Categories"
F 7 "-" H 7550 1925 50  0001 C CNN "Features"
F 8 "-" H 7550 1925 50  0001 C CNN "Height - Seated (Max)"
F 9 "Lead free / RoHS Compliant" H 7550 1925 50  0001 C CNN "Lead Free Status / RoHS Status"
F 10 "-" H 7550 1925 50  0001 C CNN "Lead Spacing"
F 11 "-" H 7550 1925 50  0001 C CNN "Lead Style"
F 12 "Murata Electronics North America" H 7550 1925 50  0001 C CNN "Manufacturer 1"
F 13 "GRM1555C1E681JA01D" H 7550 1925 50  0001 C CNN "Manufacturer Part Number 1"
F 14 "Surface Mount, MLCC" H 7550 1925 50  0001 C CNN "Mounting Type"
F 15 "-55°C ~ 125°C" H 7550 1925 50  0001 C CNN "Operating Temperature"
F 16 "0402 (1005 Metric)" H 7550 1925 50  0001 C CNN "Package / Case"
F 17 "Active" H 7550 1925 50  0001 C CNN "Part Status"
F 18 "-" H 7550 1925 50  0001 C CNN "Ratings"
F 19 "GRM" H 7550 1925 50  0001 C CNN "Series"
F 20 "0.039\" L x 0.020\" W (1.00mm x 0.50mm)" H 7550 1925 50  0001 C CNN "Size / Dimension"
F 21 "Digi-Key" H 7550 1925 50  0001 C CNN "Supplier 1"
F 22 "490-6182-1-ND" H 7550 1925 50  0001 C CNN "Supplier Part Number 1"
F 23 "C0G, NP0" H 7550 1925 50  0001 C CNN "Temperature Coefficient"
F 24 "0.022\" (0.55mm)" H 7550 1925 50  0001 C CNN "Thickness (Max)"
F 25 "±5%" H 7550 1925 50  0001 C CNN "Tolerance"
F 26 "25V" H 7550 1925 50  0001 C CNN "Voltage - Rated"
	1    7550 1925
	1    0    0    -1  
$EndComp
$Comp
L SFUSat-cap:C_10u0_10%_16V_X5R_1210 C16
U 1 1 5AC04477
P 2625 3000
F 0 "C16" H 2625 3050 50  0000 L BNN
F 1 "10uF" H 2625 2950 50  0000 L TNN
F 2 "SFUSat-cap:C_1210" H 2625 3000 50  0001 C CNN
F 3 "" H 2625 3000 50  0001 C CNN
F 4 "General Purpose" H 2625 3000 50  0001 C CNN "Applications"
F 5 "10µF" H 2625 3000 50  0001 C CNN "Capacitance"
F 6 "Capacitors - Ceramic Capacitors" H 2625 3000 50  0001 C CNN "Categories"
F 7 "-" H 2625 3000 50  0001 C CNN "Features"
F 8 "-" H 2625 3000 50  0001 C CNN "Height - Seated (Max)"
F 9 "Lead free / RoHS Compliant" H 2625 3000 50  0001 C CNN "Lead Free Status / RoHS Status"
F 10 "-" H 2625 3000 50  0001 C CNN "Lead Spacing"
F 11 "-" H 2625 3000 50  0001 C CNN "Lead Style"
F 12 "Taiyo Yuden" H 2625 3000 50  0001 C CNN "Manufacturer 1"
F 13 "EMK325BJ106KN-T" H 2625 3000 50  0001 C CNN "Manufacturer Part Number 1"
F 14 "Surface Mount, MLCC" H 2625 3000 50  0001 C CNN "Mounting Type"
F 15 "-55°C ~ 85°C" H 2625 3000 50  0001 C CNN "Operating Temperature"
F 16 "1210 (3225 Metric)" H 2625 3000 50  0001 C CNN "Package / Case"
F 17 "Active" H 2625 3000 50  0001 C CNN "Part Status"
F 18 "-" H 2625 3000 50  0001 C CNN "Ratings"
F 19 "M" H 2625 3000 50  0001 C CNN "Series"
F 20 "0.126\" L x 0.098\" W (3.20mm x 2.50mm)" H 2625 3000 50  0001 C CNN "Size / Dimension"
F 21 "Digi-Key" H 2625 3000 50  0001 C CNN "Supplier 1"
F 22 "587-1376-1-ND" H 2625 3000 50  0001 C CNN "Supplier Part Number 1"
F 23 "X5R" H 2625 3000 50  0001 C CNN "Temperature Coefficient"
F 24 "0.083\" (2.10mm)" H 2625 3000 50  0001 C CNN "Thickness (Max)"
F 25 "±10%" H 2625 3000 50  0001 C CNN "Tolerance"
F 26 "16V" H 2625 3000 50  0001 C CNN "Voltage - Rated"
	1    2625 3000
	1    0    0    -1  
$EndComp
$Comp
L SFUSat-cap:C_1n0_10%_16V_X5R_0402 C17
U 1 1 5AC04494
P 2925 3000
F 0 "C17" H 2925 3050 50  0000 L BNN
F 1 "1nF" H 2925 2950 50  0000 L TNN
F 2 "SFUSat-cap:C_0402" H 2925 3000 50  0001 C CNN
F 3 "" H 2925 3000 50  0001 C CNN
F 4 "General Purpose" H 2925 3000 50  0001 C CNN "Applications"
F 5 "1000pF" H 2925 3000 50  0001 C CNN "Capacitance"
F 6 "Capacitors - Ceramic Capacitors" H 2925 3000 50  0001 C CNN "Categories"
F 7 "-" H 2925 3000 50  0001 C CNN "Features"
F 8 "-" H 2925 3000 50  0001 C CNN "Height - Seated (Max)"
F 9 "Lead free / RoHS Compliant" H 2925 3000 50  0001 C CNN "Lead Free Status / RoHS Status"
F 10 "-" H 2925 3000 50  0001 C CNN "Lead Spacing"
F 11 "Murata Electronics North America" H 2925 3000 50  0001 C CNN "Manufacturer 1"
F 12 "GRM155R61C102KA01D" H 2925 3000 50  0001 C CNN "Manufacturer Part Number 1"
F 13 "Surface Mount, MLCC" H 2925 3000 50  0001 C CNN "Mounting Type"
F 14 "-55°C ~ 85°C" H 2925 3000 50  0001 C CNN "Operating Temperature"
F 15 "0402 (1005 Metric)" H 2925 3000 50  0001 C CNN "Package / Case"
F 16 "Active" H 2925 3000 50  0001 C CNN "Part Status"
F 17 "-" H 2925 3000 50  0001 C CNN "Ratings"
F 18 "GRM" H 2925 3000 50  0001 C CNN "Series"
F 19 "0.039\" L x 0.020\" W (1.00mm x 0.50mm)" H 2925 3000 50  0001 C CNN "Size / Dimension"
F 20 "Digi-Key" H 2925 3000 50  0001 C CNN "Supplier 1"
F 21 "490-6308-1-ND" H 2925 3000 50  0001 C CNN "Supplier Part Number 1"
F 22 "X5R" H 2925 3000 50  0001 C CNN "Temperature Coefficient"
F 23 "0.022\" (0.55mm)" H 2925 3000 50  0001 C CNN "Thickness (Max)"
F 24 "±10%" H 2925 3000 50  0001 C CNN "Tolerance"
F 25 "16V" H 2925 3000 50  0001 C CNN "Voltage - Rated"
	1    2925 3000
	1    0    0    -1  
$EndComp
$Comp
L SFUSat-cap:C_4u7_10%_10V_X5R_0805 C22
U 1 1 5AC044B2
P 6550 3350
F 0 "C22" H 6550 3400 50  0000 L BNN
F 1 "4.7uF" H 6550 3300 50  0000 L TNN
F 2 "SFUSat-cap:C_0805" H 6550 3350 50  0001 C CNN
F 3 "" H 6550 3350 50  0001 C CNN
F 4 "General Purpose" H 6550 3350 50  0001 C CNN "Applications"
F 5 "4.7µF" H 6550 3350 50  0001 C CNN "Capacitance"
F 6 "Capacitors - Ceramic Capacitors" H 6550 3350 50  0001 C CNN "Categories"
F 7 "-" H 6550 3350 50  0001 C CNN "Features"
F 8 "-" H 6550 3350 50  0001 C CNN "Height - Seated (Max)"
F 9 "Lead free / RoHS Compliant" H 6550 3350 50  0001 C CNN "Lead Free Status / RoHS Status"
F 10 "-" H 6550 3350 50  0001 C CNN "Lead Spacing"
F 11 "-" H 6550 3350 50  0001 C CNN "Lead Style"
F 12 "Murata Electronics North America" H 6550 3350 50  0001 C CNN "Manufacturer 1"
F 13 "GRM219R61A475KE34D" H 6550 3350 50  0001 C CNN "Manufacturer Part Number 1"
F 14 "Surface Mount, MLCC" H 6550 3350 50  0001 C CNN "Mounting Type"
F 15 "-55°C ~ 85°C" H 6550 3350 50  0001 C CNN "Operating Temperature"
F 16 "0805 (2012 Metric)" H 6550 3350 50  0001 C CNN "Package / Case"
F 17 "Active" H 6550 3350 50  0001 C CNN "Part Status"
F 18 "-" H 6550 3350 50  0001 C CNN "Ratings"
F 19 "GRM" H 6550 3350 50  0001 C CNN "Series"
F 20 "0.079\" L x 0.049\" W (2.00mm x 1.25mm)" H 6550 3350 50  0001 C CNN "Size / Dimension"
F 21 "Digi-Key" H 6550 3350 50  0001 C CNN "Supplier 1"
F 22 "490-3339-1-ND" H 6550 3350 50  0001 C CNN "Supplier Part Number 1"
F 23 "X5R" H 6550 3350 50  0001 C CNN "Temperature Coefficient"
F 24 "0.037\" (0.95mm)" H 6550 3350 50  0001 C CNN "Thickness (Max)"
F 25 "±10%" H 6550 3350 50  0001 C CNN "Tolerance"
F 26 "10V" H 6550 3350 50  0001 C CNN "Voltage - Rated"
	1    6550 3350
	1    0    0    -1  
$EndComp
$Comp
L SFUSat-ind:L_10u0_20%_2.7A_- L4
U 1 1 5AC044D3
P 7300 1725
F 0 "L4" H 7300 1775 50  0000 C BNN
F 1 "10uH" H 7300 1675 50  0000 C TNN
F 2 "SFUSat-ind:SLF6045" H 7300 1725 50  0001 C CNN
F 3 "" H 7300 1725 50  0001 C CNN
F 4 "Inductors, Coils, Chokes - Fixed Inductors" H 7300 1725 50  0001 C CNN "Categories"
F 5 "1.6A" H 7300 1725 50  0001 C CNN "Current - Saturation"
F 6 "2.7A" H 7300 1725 50  0001 C CNN "Current Rating"
F 7 "46.8 mOhm Max" H 7300 1725 50  0001 C CNN "DC Resistance (DCR)"
F 8 "100kHz" H 7300 1725 50  0001 C CNN "Frequency - Test"
F 9 "0.189\" (4.80mm)" H 7300 1725 50  0001 C CNN "Height - Seated (Max)"
F 10 "10µH" H 7300 1725 50  0001 C CNN "Inductance"
F 11 "Lead free / RoHS Compliant" H 7300 1725 50  0001 C CNN "Lead Free Status / RoHS Status"
F 12 "TDK Corporation" H 7300 1725 50  0001 C CNN "Manufacturer 1"
F 13 "SLF6045T-100M1R6-3PF" H 7300 1725 50  0001 C CNN "Manufacturer Part Number 1"
F 14 "14 Weeks" H 7300 1725 50  0001 C CNN "Manufacturer Standard Lead Time 1"
F 15 "Ferrite" H 7300 1725 50  0001 C CNN "Material - Core"
F 16 "Surface Mount" H 7300 1725 50  0001 C CNN "Mounting Type"
F 17 "-40°C ~ 105°C" H 7300 1725 50  0001 C CNN "Operating Temperature"
F 18 "Nonstandard" H 7300 1725 50  0001 C CNN "Package / Case"
F 19 "Active" H 7300 1725 50  0001 C CNN "Part Status"
F 20 "-" H 7300 1725 50  0001 C CNN "Q @ Freq"
F 21 "-" H 7300 1725 50  0001 C CNN "Ratings"
F 22 "SLF" H 7300 1725 50  0001 C CNN "Series"
F 23 "Shielded" H 7300 1725 50  0001 C CNN "Shielding"
F 24 "0.236\" L x 0.236\" W (6.00mm x 6.00mm)" H 7300 1725 50  0001 C CNN "Size / Dimension"
F 25 "Digi-Key" H 7300 1725 50  0001 C CNN "Supplier 1"
F 26 "-" H 7300 1725 50  0001 C CNN "Supplier Device Package"
F 27 "445-4573-1-ND" H 7300 1725 50  0001 C CNN "Supplier Part Number 1"
F 28 "±20%" H 7300 1725 50  0001 C CNN "Tolerance"
F 29 "Wirewound" H 7300 1725 50  0001 C CNN "Type"
	1    7300 1725
	1    0    0    -1  
$EndComp
$Comp
L SFUSat-res:R_3R01_1%_0.063W_0402 R10
U 1 1 5AC044EF
P 8200 3575
F 0 "R10" H 8200 3625 50  0000 C BNN
F 1 "3.01R" H 8200 3525 50  0000 C TNN
F 2 "SFUSat-res:R_0402" H 8200 3575 50  0001 C CNN
F 3 "" H 8200 3575 50  0001 C CNN
F 4 "Resistors - Chip Resistor - Surface Mount" H 8200 3575 50  0001 C CNN "Categories"
F 5 "Thick Film" H 8200 3575 50  0001 C CNN "Composition"
F 6 "-" H 8200 3575 50  0001 C CNN "Failure Rate"
F 7 "Automotive AEC-Q200" H 8200 3575 50  0001 C CNN "Features"
F 8 "0.016\" (0.40mm)" H 8200 3575 50  0001 C CNN "Height - Seated (Max)"
F 9 "Lead free / RoHS Compliant" H 8200 3575 50  0001 C CNN "Lead Free Status / RoHS Status"
F 10 "Vishay Dale" H 8200 3575 50  0001 C CNN "Manufacturer 1"
F 11 "CRCW04023R01FKED" H 8200 3575 50  0001 C CNN "Manufacturer Part Number 1"
F 12 "2" H 8200 3575 50  0001 C CNN "Number of Terminations"
F 13 "-55°C ~ 155°C" H 8200 3575 50  0001 C CNN "Operating Temperature"
F 14 "0402 (1005 Metric)" H 8200 3575 50  0001 C CNN "Package / Case"
F 15 "Active" H 8200 3575 50  0001 C CNN "Part Status"
F 16 "0.063W, 1/16W" H 8200 3575 50  0001 C CNN "Power (Watts)"
F 17 "3.01 Ohms" H 8200 3575 50  0001 C CNN "Resistance"
F 18 "CRCW" H 8200 3575 50  0001 C CNN "Series"
F 19 "0.039\" L x 0.020\" W (1.00mm x 0.50mm)" H 8200 3575 50  0001 C CNN "Size / Dimension"
F 20 "Digi-Key" H 8200 3575 50  0001 C CNN "Supplier 1"
F 21 "0402" H 8200 3575 50  0001 C CNN "Supplier Device Package"
F 22 "541-3.01LLCT-ND" H 8200 3575 50  0001 C CNN "Supplier Part Number 1"
F 23 "±100ppm/°C" H 8200 3575 50  0001 C CNN "Temperature Coefficient"
F 24 "±1%" H 8200 3575 50  0001 C CNN "Tolerance"
	1    8200 3575
	0    -1   -1   0   
$EndComp
$Comp
L SFUSat-res:R_19k1_1%_0.125W_0805 R9
U 1 1 5AC0450B
P 7950 2325
F 0 "R9" H 7950 2375 50  0000 C BNN
F 1 "19K1" H 7950 2275 50  0000 C TNN
F 2 "SFUSat-res:R_0805" H 7950 2325 50  0001 C CNN
F 3 "" H 7950 2325 50  0001 C CNN
F 4 "Resistors - Chip Resistor - Surface Mount" H 7950 2325 50  0001 C CNN "Categories"
F 5 "Thick Film" H 7950 2325 50  0001 C CNN "Composition"
F 6 "-" H 7950 2325 50  0001 C CNN "Failure Rate"
F 7 "Automotive AEC-Q200" H 7950 2325 50  0001 C CNN "Features"
F 8 "0.028\" (0.70mm)" H 7950 2325 50  0001 C CNN "Height - Seated (Max)"
F 9 "Lead free / RoHS Compliant" H 7950 2325 50  0001 C CNN "Lead Free Status / RoHS Status"
F 10 "Panasonic Electronic Components" H 7950 2325 50  0001 C CNN "Manufacturer 1"
F 11 "ERJ-6ENF1912V" H 7950 2325 50  0001 C CNN "Manufacturer Part Number 1"
F 12 "2" H 7950 2325 50  0001 C CNN "Number of Terminations"
F 13 "-55°C ~ 155°C" H 7950 2325 50  0001 C CNN "Operating Temperature"
F 14 "0805 (2012 Metric)" H 7950 2325 50  0001 C CNN "Package / Case"
F 15 "Active" H 7950 2325 50  0001 C CNN "Part Status"
F 16 "0.125W, 1/8W" H 7950 2325 50  0001 C CNN "Power (Watts)"
F 17 "19.1 kOhms" H 7950 2325 50  0001 C CNN "Resistance"
F 18 "ERJ" H 7950 2325 50  0001 C CNN "Series"
F 19 "0.079\" L x 0.049\" W (2.00mm x 1.25mm)" H 7950 2325 50  0001 C CNN "Size / Dimension"
F 20 "Digi-Key" H 7950 2325 50  0001 C CNN "Supplier 1"
F 21 "0805" H 7950 2325 50  0001 C CNN "Supplier Device Package"
F 22 "P19.1KCCT-ND" H 7950 2325 50  0001 C CNN "Supplier Part Number 1"
F 23 "±100ppm/°C" H 7950 2325 50  0001 C CNN "Temperature Coefficient"
F 24 "±1%" H 7950 2325 50  0001 C CNN "Tolerance"
	1    7950 2325
	0    1    1    0   
$EndComp
$Comp
L SFUSat-res:R_49k9_1%_0.125W_0805 R4
U 1 1 5AC04527
P 7950 1925
F 0 "R4" H 7950 1975 50  0000 C BNN
F 1 "49k9" H 7950 1875 50  0000 C TNN
F 2 "SFUSat-res:R_0805" H 7950 1925 50  0001 C CNN
F 3 "" H 7950 1925 50  0001 C CNN
F 4 "Resistors - Chip Resistor - Surface Mount" H 7950 1925 50  0001 C CNN "Categories"
F 5 "Thick Film" H 7950 1925 50  0001 C CNN "Composition"
F 6 "-" H 7950 1925 50  0001 C CNN "Failure Rate"
F 7 "Automotive AEC-Q200" H 7950 1925 50  0001 C CNN "Features"
F 8 "0.028\" (0.70mm)" H 7950 1925 50  0001 C CNN "Height - Seated (Max)"
F 9 "Lead free / RoHS Compliant" H 7950 1925 50  0001 C CNN "Lead Free Status / RoHS Status"
F 10 "Panasonic Electronic Components" H 7950 1925 50  0001 C CNN "Manufacturer 1"
F 11 "ERJ-6ENF4992V" H 7950 1925 50  0001 C CNN "Manufacturer Part Number 1"
F 12 "2" H 7950 1925 50  0001 C CNN "Number of Terminations"
F 13 "-55°C ~ 155°C" H 7950 1925 50  0001 C CNN "Operating Temperature"
F 14 "0805 (2012 Metric)" H 7950 1925 50  0001 C CNN "Package / Case"
F 15 "Active" H 7950 1925 50  0001 C CNN "Part Status"
F 16 "0.125W, 1/8W" H 7950 1925 50  0001 C CNN "Power (Watts)"
F 17 "49.9 kOhms" H 7950 1925 50  0001 C CNN "Resistance"
F 18 "ERJ" H 7950 1925 50  0001 C CNN "Series"
F 19 "0.079\" L x 0.049\" W (2.00mm x 1.25mm)" H 7950 1925 50  0001 C CNN "Size / Dimension"
F 20 "Digi-Key" H 7950 1925 50  0001 C CNN "Supplier 1"
F 21 "0805" H 7950 1925 50  0001 C CNN "Supplier Device Package"
F 22 "P49.9KCCT-ND" H 7950 1925 50  0001 C CNN "Supplier Part Number 1"
F 23 "±100ppm/°C" H 7950 1925 50  0001 C CNN "Temperature Coefficient"
F 24 "±1%" H 7950 1925 50  0001 C CNN "Tolerance"
	1    7950 1925
	0    1    1    0   
$EndComp
Text HLabel 6550 2650 2    60   Input ~ 0
Vin
$Comp
L SFUSat-cap:C_10u0_10%_16V_X5R_1210 C2
U 1 1 5AC04546
P 2325 3000
F 0 "C2" H 2325 3050 50  0000 L BNN
F 1 "10uF" H 2325 2950 50  0000 L TNN
F 2 "SFUSat-cap:C_1210" H 2325 3000 50  0001 C CNN
F 3 "" H 2325 3000 50  0001 C CNN
F 4 "General Purpose" H 2325 3000 50  0001 C CNN "Applications"
F 5 "10µF" H 2325 3000 50  0001 C CNN "Capacitance"
F 6 "Capacitors - Ceramic Capacitors" H 2325 3000 50  0001 C CNN "Categories"
F 7 "-" H 2325 3000 50  0001 C CNN "Features"
F 8 "-" H 2325 3000 50  0001 C CNN "Height - Seated (Max)"
F 9 "Lead free / RoHS Compliant" H 2325 3000 50  0001 C CNN "Lead Free Status / RoHS Status"
F 10 "-" H 2325 3000 50  0001 C CNN "Lead Spacing"
F 11 "-" H 2325 3000 50  0001 C CNN "Lead Style"
F 12 "Taiyo Yuden" H 2325 3000 50  0001 C CNN "Manufacturer 1"
F 13 "EMK325BJ106KN-T" H 2325 3000 50  0001 C CNN "Manufacturer Part Number 1"
F 14 "Surface Mount, MLCC" H 2325 3000 50  0001 C CNN "Mounting Type"
F 15 "-55°C ~ 85°C" H 2325 3000 50  0001 C CNN "Operating Temperature"
F 16 "1210 (3225 Metric)" H 2325 3000 50  0001 C CNN "Package / Case"
F 17 "Active" H 2325 3000 50  0001 C CNN "Part Status"
F 18 "-" H 2325 3000 50  0001 C CNN "Ratings"
F 19 "M" H 2325 3000 50  0001 C CNN "Series"
F 20 "0.126\" L x 0.098\" W (3.20mm x 2.50mm)" H 2325 3000 50  0001 C CNN "Size / Dimension"
F 21 "Digi-Key" H 2325 3000 50  0001 C CNN "Supplier 1"
F 22 "587-1376-1-ND" H 2325 3000 50  0001 C CNN "Supplier Part Number 1"
F 23 "X5R" H 2325 3000 50  0001 C CNN "Temperature Coefficient"
F 24 "0.083\" (2.10mm)" H 2325 3000 50  0001 C CNN "Thickness (Max)"
F 25 "±10%" H 2325 3000 50  0001 C CNN "Tolerance"
F 26 "16V" H 2325 3000 50  0001 C CNN "Voltage - Rated"
	1    2325 3000
	1    0    0    -1  
$EndComp
$Comp
L power:GND #PWR0107
U 1 1 5AC0454D
P 2325 3200
F 0 "#PWR0107" H 2325 2950 50  0001 C CNN
F 1 "GND" H 2325 3050 50  0000 C CNN
F 2 "" H 2325 3200 50  0001 C CNN
F 3 "" H 2325 3200 50  0001 C CNN
	1    2325 3200
	1    0    0    -1  
$EndComp
$Comp
L power:GND #PWR0108
U 1 1 5AC04553
P 2625 3200
F 0 "#PWR0108" H 2625 2950 50  0001 C CNN
F 1 "GND" H 2625 3050 50  0000 C CNN
F 2 "" H 2625 3200 50  0001 C CNN
F 3 "" H 2625 3200 50  0001 C CNN
	1    2625 3200
	1    0    0    -1  
$EndComp
$Comp
L power:GND #PWR0109
U 1 1 5AC04559
P 2925 3200
F 0 "#PWR0109" H 2925 2950 50  0001 C CNN
F 1 "GND" H 2925 3050 50  0000 C CNN
F 2 "" H 2925 3200 50  0001 C CNN
F 3 "" H 2925 3200 50  0001 C CNN
	1    2925 3200
	1    0    0    -1  
$EndComp
$Comp
L power:GND #PWR0110
U 1 1 5AC04562
P 6550 3550
F 0 "#PWR0110" H 6550 3300 50  0001 C CNN
F 1 "GND" H 6550 3400 50  0000 C CNN
F 2 "" H 6550 3550 50  0001 C CNN
F 3 "" H 6550 3550 50  0001 C CNN
	1    6550 3550
	1    0    0    -1  
$EndComp
$Comp
L power:GND #PWR0111
U 1 1 5AC04576
P 8200 4175
F 0 "#PWR0111" H 8200 3925 50  0001 C CNN
F 1 "GND" H 8200 4025 50  0000 C CNN
F 2 "" H 8200 4175 50  0001 C CNN
F 3 "" H 8200 4175 50  0001 C CNN
	1    8200 4175
	1    0    0    -1  
$EndComp
$Comp
L power:GND #PWR0112
U 1 1 5AC0457E
P 7950 2525
F 0 "#PWR0112" H 7950 2275 50  0001 C CNN
F 1 "GND" H 7950 2375 50  0000 C CNN
F 2 "" H 7950 2525 50  0001 C CNN
F 3 "" H 7950 2525 50  0001 C CNN
	1    7950 2525
	1    0    0    -1  
$EndComp
$Comp
L SFUSat-cap:C_47u0_10%_6.3V_X5R_1206 C26
U 1 1 5AC0459C
P 8550 1925
F 0 "C26" H 8550 1975 50  0000 L BNN
F 1 "47uF" H 8550 1875 50  0000 L TNN
F 2 "SFUSat-cap:C_1206" H 8550 1925 50  0001 C CNN
F 3 "" H 8550 1925 50  0001 C CNN
F 4 "General Purpose" H 8550 1925 50  0001 C CNN "Applications"
F 5 "47µF" H 8550 1925 50  0001 C CNN "Capacitance"
F 6 "Capacitors - Ceramic Capacitors" H 8550 1925 50  0001 C CNN "Categories"
F 7 "-" H 8550 1925 50  0001 C CNN "Features"
F 8 "-" H 8550 1925 50  0001 C CNN "Height - Seated (Max)"
F 9 "Lead free / RoHS Compliant" H 8550 1925 50  0001 C CNN "Lead Free Status / RoHS Status"
F 10 "-" H 8550 1925 50  0001 C CNN "Lead Spacing"
F 11 "-" H 8550 1925 50  0001 C CNN "Lead Style"
F 12 "Murata Electronics North America" H 8550 1925 50  0001 C CNN "Manufacturer 1"
F 13 "GRM31CR60J476KE19L" H 8550 1925 50  0001 C CNN "Manufacturer Part Number 1"
F 14 "Surface Mount, MLCC" H 8550 1925 50  0001 C CNN "Mounting Type"
F 15 "-55°C ~ 85°C" H 8550 1925 50  0001 C CNN "Operating Temperature"
F 16 "1206 (3216 Metric)" H 8550 1925 50  0001 C CNN "Package / Case"
F 17 "Active" H 8550 1925 50  0001 C CNN "Part Status"
F 18 "-" H 8550 1925 50  0001 C CNN "Ratings"
F 19 "GRM" H 8550 1925 50  0001 C CNN "Series"
F 20 "0.126\" L x 0.063\" W (3.20mm x 1.60mm)" H 8550 1925 50  0001 C CNN "Size / Dimension"
F 21 "Digi-Key" H 8550 1925 50  0001 C CNN "Supplier 1"
F 22 "490-6508-1-ND" H 8550 1925 50  0001 C CNN "Supplier Part Number 1"
F 23 "X5R" H 8550 1925 50  0001 C CNN "Temperature Coefficient"
F 24 "0.071\" (1.80mm)" H 8550 1925 50  0001 C CNN "Thickness (Max)"
F 25 "±10%" H 8550 1925 50  0001 C CNN "Tolerance"
F 26 "6.3V" H 8550 1925 50  0001 C CNN "Voltage - Rated"
	1    8550 1925
	1    0    0    -1  
$EndComp
$Comp
L power:GND #PWR0113
U 1 1 5AC045A3
P 8550 2125
F 0 "#PWR0113" H 8550 1875 50  0001 C CNN
F 1 "GND" H 8550 1975 50  0000 C CNN
F 2 "" H 8550 2125 50  0001 C CNN
F 3 "" H 8550 2125 50  0001 C CNN
	1    8550 2125
	1    0    0    -1  
$EndComp
$Comp
L SFUSat-cap:C_47u0_10%_6.3V_X5R_1206 C27
U 1 1 5AC045C1
P 8850 1925
F 0 "C27" H 8850 1975 50  0000 L BNN
F 1 "47uF" H 8850 1875 50  0000 L TNN
F 2 "SFUSat-cap:C_1206" H 8850 1925 50  0001 C CNN
F 3 "" H 8850 1925 50  0001 C CNN
F 4 "General Purpose" H 8850 1925 50  0001 C CNN "Applications"
F 5 "47µF" H 8850 1925 50  0001 C CNN "Capacitance"
F 6 "Capacitors - Ceramic Capacitors" H 8850 1925 50  0001 C CNN "Categories"
F 7 "-" H 8850 1925 50  0001 C CNN "Features"
F 8 "-" H 8850 1925 50  0001 C CNN "Height - Seated (Max)"
F 9 "Lead free / RoHS Compliant" H 8850 1925 50  0001 C CNN "Lead Free Status / RoHS Status"
F 10 "-" H 8850 1925 50  0001 C CNN "Lead Spacing"
F 11 "-" H 8850 1925 50  0001 C CNN "Lead Style"
F 12 "Murata Electronics North America" H 8850 1925 50  0001 C CNN "Manufacturer 1"
F 13 "GRM31CR60J476KE19L" H 8850 1925 50  0001 C CNN "Manufacturer Part Number 1"
F 14 "Surface Mount, MLCC" H 8850 1925 50  0001 C CNN "Mounting Type"
F 15 "-55°C ~ 85°C" H 8850 1925 50  0001 C CNN "Operating Temperature"
F 16 "1206 (3216 Metric)" H 8850 1925 50  0001 C CNN "Package / Case"
F 17 "Active" H 8850 1925 50  0001 C CNN "Part Status"
F 18 "-" H 8850 1925 50  0001 C CNN "Ratings"
F 19 "GRM" H 8850 1925 50  0001 C CNN "Series"
F 20 "0.126\" L x 0.063\" W (3.20mm x 1.60mm)" H 8850 1925 50  0001 C CNN "Size / Dimension"
F 21 "Digi-Key" H 8850 1925 50  0001 C CNN "Supplier 1"
F 22 "490-6508-1-ND" H 8850 1925 50  0001 C CNN "Supplier Part Number 1"
F 23 "X5R" H 8850 1925 50  0001 C CNN "Temperature Coefficient"
F 24 "0.071\" (1.80mm)" H 8850 1925 50  0001 C CNN "Thickness (Max)"
F 25 "±10%" H 8850 1925 50  0001 C CNN "Tolerance"
F 26 "6.3V" H 8850 1925 50  0001 C CNN "Voltage - Rated"
	1    8850 1925
	1    0    0    -1  
$EndComp
$Comp
L power:GND #PWR0114
U 1 1 5AC045C8
P 8850 2125
F 0 "#PWR0114" H 8850 1875 50  0001 C CNN
F 1 "GND" H 8850 1975 50  0000 C CNN
F 2 "" H 8850 2125 50  0001 C CNN
F 3 "" H 8850 2125 50  0001 C CNN
	1    8850 2125
	1    0    0    -1  
$EndComp
$Comp
L SFUSat-cap:C_47u0_10%_6.3V_X5R_1206 C28
U 1 1 5AC045E6
P 9150 1925
F 0 "C28" H 9150 1975 50  0000 L BNN
F 1 "47uF" H 9150 1875 50  0000 L TNN
F 2 "SFUSat-cap:C_1206" H 9150 1925 50  0001 C CNN
F 3 "" H 9150 1925 50  0001 C CNN
F 4 "General Purpose" H 9150 1925 50  0001 C CNN "Applications"
F 5 "47µF" H 9150 1925 50  0001 C CNN "Capacitance"
F 6 "Capacitors - Ceramic Capacitors" H 9150 1925 50  0001 C CNN "Categories"
F 7 "-" H 9150 1925 50  0001 C CNN "Features"
F 8 "-" H 9150 1925 50  0001 C CNN "Height - Seated (Max)"
F 9 "Lead free / RoHS Compliant" H 9150 1925 50  0001 C CNN "Lead Free Status / RoHS Status"
F 10 "-" H 9150 1925 50  0001 C CNN "Lead Spacing"
F 11 "-" H 9150 1925 50  0001 C CNN "Lead Style"
F 12 "Murata Electronics North America" H 9150 1925 50  0001 C CNN "Manufacturer 1"
F 13 "GRM31CR60J476KE19L" H 9150 1925 50  0001 C CNN "Manufacturer Part Number 1"
F 14 "Surface Mount, MLCC" H 9150 1925 50  0001 C CNN "Mounting Type"
F 15 "-55°C ~ 85°C" H 9150 1925 50  0001 C CNN "Operating Temperature"
F 16 "1206 (3216 Metric)" H 9150 1925 50  0001 C CNN "Package / Case"
F 17 "Active" H 9150 1925 50  0001 C CNN "Part Status"
F 18 "-" H 9150 1925 50  0001 C CNN "Ratings"
F 19 "GRM" H 9150 1925 50  0001 C CNN "Series"
F 20 "0.126\" L x 0.063\" W (3.20mm x 1.60mm)" H 9150 1925 50  0001 C CNN "Size / Dimension"
F 21 "Digi-Key" H 9150 1925 50  0001 C CNN "Supplier 1"
F 22 "490-6508-1-ND" H 9150 1925 50  0001 C CNN "Supplier Part Number 1"
F 23 "X5R" H 9150 1925 50  0001 C CNN "Temperature Coefficient"
F 24 "0.071\" (1.80mm)" H 9150 1925 50  0001 C CNN "Thickness (Max)"
F 25 "±10%" H 9150 1925 50  0001 C CNN "Tolerance"
F 26 "6.3V" H 9150 1925 50  0001 C CNN "Voltage - Rated"
	1    9150 1925
	1    0    0    -1  
$EndComp
$Comp
L power:GND #PWR0115
U 1 1 5AC045ED
P 9150 2125
F 0 "#PWR0115" H 9150 1875 50  0001 C CNN
F 1 "GND" H 9150 1975 50  0000 C CNN
F 2 "" H 9150 2125 50  0001 C CNN
F 3 "" H 9150 2125 50  0001 C CNN
	1    9150 2125
	1    0    0    -1  
$EndComp
$Comp
L SFUSat-cap:C_47u0_10%_6.3V_X5R_1206 C29
U 1 1 5AC0460B
P 9450 1925
F 0 "C29" H 9450 1975 50  0000 L BNN
F 1 "47uF" H 9450 1875 50  0000 L TNN
F 2 "SFUSat-cap:C_1206" H 9450 1925 50  0001 C CNN
F 3 "" H 9450 1925 50  0001 C CNN
F 4 "General Purpose" H 9450 1925 50  0001 C CNN "Applications"
F 5 "47µF" H 9450 1925 50  0001 C CNN "Capacitance"
F 6 "Capacitors - Ceramic Capacitors" H 9450 1925 50  0001 C CNN "Categories"
F 7 "-" H 9450 1925 50  0001 C CNN "Features"
F 8 "-" H 9450 1925 50  0001 C CNN "Height - Seated (Max)"
F 9 "Lead free / RoHS Compliant" H 9450 1925 50  0001 C CNN "Lead Free Status / RoHS Status"
F 10 "-" H 9450 1925 50  0001 C CNN "Lead Spacing"
F 11 "-" H 9450 1925 50  0001 C CNN "Lead Style"
F 12 "Murata Electronics North America" H 9450 1925 50  0001 C CNN "Manufacturer 1"
F 13 "GRM31CR60J476KE19L" H 9450 1925 50  0001 C CNN "Manufacturer Part Number 1"
F 14 "Surface Mount, MLCC" H 9450 1925 50  0001 C CNN "Mounting Type"
F 15 "-55°C ~ 85°C" H 9450 1925 50  0001 C CNN "Operating Temperature"
F 16 "1206 (3216 Metric)" H 9450 1925 50  0001 C CNN "Package / Case"
F 17 "Active" H 9450 1925 50  0001 C CNN "Part Status"
F 18 "-" H 9450 1925 50  0001 C CNN "Ratings"
F 19 "GRM" H 9450 1925 50  0001 C CNN "Series"
F 20 "0.126\" L x 0.063\" W (3.20mm x 1.60mm)" H 9450 1925 50  0001 C CNN "Size / Dimension"
F 21 "Digi-Key" H 9450 1925 50  0001 C CNN "Supplier 1"
F 22 "490-6508-1-ND" H 9450 1925 50  0001 C CNN "Supplier Part Number 1"
F 23 "X5R" H 9450 1925 50  0001 C CNN "Temperature Coefficient"
F 24 "0.071\" (1.80mm)" H 9450 1925 50  0001 C CNN "Thickness (Max)"
F 25 "±10%" H 9450 1925 50  0001 C CNN "Tolerance"
F 26 "6.3V" H 9450 1925 50  0001 C CNN "Voltage - Rated"
	1    9450 1925
	1    0    0    -1  
$EndComp
$Comp
L power:GND #PWR0116
U 1 1 5AC04612
P 9450 2125
F 0 "#PWR0116" H 9450 1875 50  0001 C CNN
F 1 "GND" H 9450 1975 50  0000 C CNN
F 2 "" H 9450 2125 50  0001 C CNN
F 3 "" H 9450 2125 50  0001 C CNN
	1    9450 2125
	1    0    0    -1  
$EndComp
$Comp
L SFUSat-cap:C_10u0_10%_16V_X5R_1210 C1
U 1 1 5AC0463A
P 2025 3000
F 0 "C1" H 2025 3050 50  0000 L BNN
F 1 "10uF" H 2025 2950 50  0000 L TNN
F 2 "SFUSat-cap:C_1210" H 2025 3000 50  0001 C CNN
F 3 "" H 2025 3000 50  0001 C CNN
F 4 "General Purpose" H 2025 3000 50  0001 C CNN "Applications"
F 5 "10µF" H 2025 3000 50  0001 C CNN "Capacitance"
F 6 "Capacitors - Ceramic Capacitors" H 2025 3000 50  0001 C CNN "Categories"
F 7 "-" H 2025 3000 50  0001 C CNN "Features"
F 8 "-" H 2025 3000 50  0001 C CNN "Height - Seated (Max)"
F 9 "Lead free / RoHS Compliant" H 2025 3000 50  0001 C CNN "Lead Free Status / RoHS Status"
F 10 "-" H 2025 3000 50  0001 C CNN "Lead Spacing"
F 11 "-" H 2025 3000 50  0001 C CNN "Lead Style"
F 12 "Taiyo Yuden" H 2025 3000 50  0001 C CNN "Manufacturer 1"
F 13 "EMK325BJ106KN-T" H 2025 3000 50  0001 C CNN "Manufacturer Part Number 1"
F 14 "Surface Mount, MLCC" H 2025 3000 50  0001 C CNN "Mounting Type"
F 15 "-55°C ~ 85°C" H 2025 3000 50  0001 C CNN "Operating Temperature"
F 16 "1210 (3225 Metric)" H 2025 3000 50  0001 C CNN "Package / Case"
F 17 "Active" H 2025 3000 50  0001 C CNN "Part Status"
F 18 "-" H 2025 3000 50  0001 C CNN "Ratings"
F 19 "M" H 2025 3000 50  0001 C CNN "Series"
F 20 "0.126\" L x 0.098\" W (3.20mm x 2.50mm)" H 2025 3000 50  0001 C CNN "Size / Dimension"
F 21 "Digi-Key" H 2025 3000 50  0001 C CNN "Supplier 1"
F 22 "587-1376-1-ND" H 2025 3000 50  0001 C CNN "Supplier Part Number 1"
F 23 "X5R" H 2025 3000 50  0001 C CNN "Temperature Coefficient"
F 24 "0.083\" (2.10mm)" H 2025 3000 50  0001 C CNN "Thickness (Max)"
F 25 "±10%" H 2025 3000 50  0001 C CNN "Tolerance"
F 26 "16V" H 2025 3000 50  0001 C CNN "Voltage - Rated"
	1    2025 3000
	1    0    0    -1  
$EndComp
$Comp
L power:GND #PWR0117
U 1 1 5AC04641
P 2025 3200
F 0 "#PWR0117" H 2025 2950 50  0001 C CNN
F 1 "GND" H 2025 3050 50  0000 C CNN
F 2 "" H 2025 3200 50  0001 C CNN
F 3 "" H 2025 3200 50  0001 C CNN
	1    2025 3200
	1    0    0    -1  
$EndComp
$Comp
L SFUSat-cap:C_10u0_10%_16V_X5R_1210 C20
U 1 1 5AC0465F
P 3825 3000
F 0 "C20" H 3825 3050 50  0000 L BNN
F 1 "10uF" H 3825 2950 50  0000 L TNN
F 2 "SFUSat-cap:C_1210" H 3825 3000 50  0001 C CNN
F 3 "" H 3825 3000 50  0001 C CNN
F 4 "General Purpose" H 3825 3000 50  0001 C CNN "Applications"
F 5 "10µF" H 3825 3000 50  0001 C CNN "Capacitance"
F 6 "Capacitors - Ceramic Capacitors" H 3825 3000 50  0001 C CNN "Categories"
F 7 "-" H 3825 3000 50  0001 C CNN "Features"
F 8 "-" H 3825 3000 50  0001 C CNN "Height - Seated (Max)"
F 9 "Lead free / RoHS Compliant" H 3825 3000 50  0001 C CNN "Lead Free Status / RoHS Status"
F 10 "-" H 3825 3000 50  0001 C CNN "Lead Spacing"
F 11 "-" H 3825 3000 50  0001 C CNN "Lead Style"
F 12 "Taiyo Yuden" H 3825 3000 50  0001 C CNN "Manufacturer 1"
F 13 "EMK325BJ106KN-T" H 3825 3000 50  0001 C CNN "Manufacturer Part Number 1"
F 14 "Surface Mount, MLCC" H 3825 3000 50  0001 C CNN "Mounting Type"
F 15 "-55°C ~ 85°C" H 3825 3000 50  0001 C CNN "Operating Temperature"
F 16 "1210 (3225 Metric)" H 3825 3000 50  0001 C CNN "Package / Case"
F 17 "Active" H 3825 3000 50  0001 C CNN "Part Status"
F 18 "-" H 3825 3000 50  0001 C CNN "Ratings"
F 19 "M" H 3825 3000 50  0001 C CNN "Series"
F 20 "0.126\" L x 0.098\" W (3.20mm x 2.50mm)" H 3825 3000 50  0001 C CNN "Size / Dimension"
F 21 "Digi-Key" H 3825 3000 50  0001 C CNN "Supplier 1"
F 22 "587-1376-1-ND" H 3825 3000 50  0001 C CNN "Supplier Part Number 1"
F 23 "X5R" H 3825 3000 50  0001 C CNN "Temperature Coefficient"
F 24 "0.083\" (2.10mm)" H 3825 3000 50  0001 C CNN "Thickness (Max)"
F 25 "±10%" H 3825 3000 50  0001 C CNN "Tolerance"
F 26 "16V" H 3825 3000 50  0001 C CNN "Voltage - Rated"
	1    3825 3000
	1    0    0    -1  
$EndComp
$Comp
L SFUSat-cap:C_1n0_10%_16V_X5R_0402 C21
U 1 1 5AC0467C
P 4125 3000
F 0 "C21" H 4125 3050 50  0000 L BNN
F 1 "1nF" H 4125 2950 50  0000 L TNN
F 2 "SFUSat-cap:C_0402" H 4125 3000 50  0001 C CNN
F 3 "" H 4125 3000 50  0001 C CNN
F 4 "General Purpose" H 4125 3000 50  0001 C CNN "Applications"
F 5 "1000pF" H 4125 3000 50  0001 C CNN "Capacitance"
F 6 "Capacitors - Ceramic Capacitors" H 4125 3000 50  0001 C CNN "Categories"
F 7 "-" H 4125 3000 50  0001 C CNN "Features"
F 8 "-" H 4125 3000 50  0001 C CNN "Height - Seated (Max)"
F 9 "Lead free / RoHS Compliant" H 4125 3000 50  0001 C CNN "Lead Free Status / RoHS Status"
F 10 "-" H 4125 3000 50  0001 C CNN "Lead Spacing"
F 11 "Murata Electronics North America" H 4125 3000 50  0001 C CNN "Manufacturer 1"
F 12 "GRM155R61C102KA01D" H 4125 3000 50  0001 C CNN "Manufacturer Part Number 1"
F 13 "Surface Mount, MLCC" H 4125 3000 50  0001 C CNN "Mounting Type"
F 14 "-55°C ~ 85°C" H 4125 3000 50  0001 C CNN "Operating Temperature"
F 15 "0402 (1005 Metric)" H 4125 3000 50  0001 C CNN "Package / Case"
F 16 "Active" H 4125 3000 50  0001 C CNN "Part Status"
F 17 "-" H 4125 3000 50  0001 C CNN "Ratings"
F 18 "GRM" H 4125 3000 50  0001 C CNN "Series"
F 19 "0.039\" L x 0.020\" W (1.00mm x 0.50mm)" H 4125 3000 50  0001 C CNN "Size / Dimension"
F 20 "Digi-Key" H 4125 3000 50  0001 C CNN "Supplier 1"
F 21 "490-6308-1-ND" H 4125 3000 50  0001 C CNN "Supplier Part Number 1"
F 22 "X5R" H 4125 3000 50  0001 C CNN "Temperature Coefficient"
F 23 "0.022\" (0.55mm)" H 4125 3000 50  0001 C CNN "Thickness (Max)"
F 24 "±10%" H 4125 3000 50  0001 C CNN "Tolerance"
F 25 "16V" H 4125 3000 50  0001 C CNN "Voltage - Rated"
	1    4125 3000
	1    0    0    -1  
$EndComp
$Comp
L SFUSat-cap:C_10u0_10%_16V_X5R_1210 C19
U 1 1 5AC0469A
P 3525 3000
F 0 "C19" H 3525 3050 50  0000 L BNN
F 1 "10uF" H 3525 2950 50  0000 L TNN
F 2 "SFUSat-cap:C_1210" H 3525 3000 50  0001 C CNN
F 3 "" H 3525 3000 50  0001 C CNN
F 4 "General Purpose" H 3525 3000 50  0001 C CNN "Applications"
F 5 "10µF" H 3525 3000 50  0001 C CNN "Capacitance"
F 6 "Capacitors - Ceramic Capacitors" H 3525 3000 50  0001 C CNN "Categories"
F 7 "-" H 3525 3000 50  0001 C CNN "Features"
F 8 "-" H 3525 3000 50  0001 C CNN "Height - Seated (Max)"
F 9 "Lead free / RoHS Compliant" H 3525 3000 50  0001 C CNN "Lead Free Status / RoHS Status"
F 10 "-" H 3525 3000 50  0001 C CNN "Lead Spacing"
F 11 "-" H 3525 3000 50  0001 C CNN "Lead Style"
F 12 "Taiyo Yuden" H 3525 3000 50  0001 C CNN "Manufacturer 1"
F 13 "EMK325BJ106KN-T" H 3525 3000 50  0001 C CNN "Manufacturer Part Number 1"
F 14 "Surface Mount, MLCC" H 3525 3000 50  0001 C CNN "Mounting Type"
F 15 "-55°C ~ 85°C" H 3525 3000 50  0001 C CNN "Operating Temperature"
F 16 "1210 (3225 Metric)" H 3525 3000 50  0001 C CNN "Package / Case"
F 17 "Active" H 3525 3000 50  0001 C CNN "Part Status"
F 18 "-" H 3525 3000 50  0001 C CNN "Ratings"
F 19 "M" H 3525 3000 50  0001 C CNN "Series"
F 20 "0.126\" L x 0.098\" W (3.20mm x 2.50mm)" H 3525 3000 50  0001 C CNN "Size / Dimension"
F 21 "Digi-Key" H 3525 3000 50  0001 C CNN "Supplier 1"
F 22 "587-1376-1-ND" H 3525 3000 50  0001 C CNN "Supplier Part Number 1"
F 23 "X5R" H 3525 3000 50  0001 C CNN "Temperature Coefficient"
F 24 "0.083\" (2.10mm)" H 3525 3000 50  0001 C CNN "Thickness (Max)"
F 25 "±10%" H 3525 3000 50  0001 C CNN "Tolerance"
F 26 "16V" H 3525 3000 50  0001 C CNN "Voltage - Rated"
	1    3525 3000
	1    0    0    -1  
$EndComp
$Comp
L power:GND #PWR0118
U 1 1 5AC046A1
P 3525 3200
F 0 "#PWR0118" H 3525 2950 50  0001 C CNN
F 1 "GND" H 3525 3050 50  0000 C CNN
F 2 "" H 3525 3200 50  0001 C CNN
F 3 "" H 3525 3200 50  0001 C CNN
	1    3525 3200
	1    0    0    -1  
$EndComp
$Comp
L power:GND #PWR0119
U 1 1 5AC046A7
P 3825 3200
F 0 "#PWR0119" H 3825 2950 50  0001 C CNN
F 1 "GND" H 3825 3050 50  0000 C CNN
F 2 "" H 3825 3200 50  0001 C CNN
F 3 "" H 3825 3200 50  0001 C CNN
	1    3825 3200
	1    0    0    -1  
$EndComp
$Comp
L power:GND #PWR0120
U 1 1 5AC046AD
P 4125 3200
F 0 "#PWR0120" H 4125 2950 50  0001 C CNN
F 1 "GND" H 4125 3050 50  0000 C CNN
F 2 "" H 4125 3200 50  0001 C CNN
F 3 "" H 4125 3200 50  0001 C CNN
	1    4125 3200
	1    0    0    -1  
$EndComp
$Comp
L SFUSat-cap:C_10u0_10%_16V_X5R_1210 C18
U 1 1 5AC046CD
P 3225 3000
F 0 "C18" H 3225 3050 50  0000 L BNN
F 1 "10uF" H 3225 2950 50  0000 L TNN
F 2 "SFUSat-cap:C_1210" H 3225 3000 50  0001 C CNN
F 3 "" H 3225 3000 50  0001 C CNN
F 4 "General Purpose" H 3225 3000 50  0001 C CNN "Applications"
F 5 "10µF" H 3225 3000 50  0001 C CNN "Capacitance"
F 6 "Capacitors - Ceramic Capacitors" H 3225 3000 50  0001 C CNN "Categories"
F 7 "-" H 3225 3000 50  0001 C CNN "Features"
F 8 "-" H 3225 3000 50  0001 C CNN "Height - Seated (Max)"
F 9 "Lead free / RoHS Compliant" H 3225 3000 50  0001 C CNN "Lead Free Status / RoHS Status"
F 10 "-" H 3225 3000 50  0001 C CNN "Lead Spacing"
F 11 "-" H 3225 3000 50  0001 C CNN "Lead Style"
F 12 "Taiyo Yuden" H 3225 3000 50  0001 C CNN "Manufacturer 1"
F 13 "EMK325BJ106KN-T" H 3225 3000 50  0001 C CNN "Manufacturer Part Number 1"
F 14 "Surface Mount, MLCC" H 3225 3000 50  0001 C CNN "Mounting Type"
F 15 "-55°C ~ 85°C" H 3225 3000 50  0001 C CNN "Operating Temperature"
F 16 "1210 (3225 Metric)" H 3225 3000 50  0001 C CNN "Package / Case"
F 17 "Active" H 3225 3000 50  0001 C CNN "Part Status"
F 18 "-" H 3225 3000 50  0001 C CNN "Ratings"
F 19 "M" H 3225 3000 50  0001 C CNN "Series"
F 20 "0.126\" L x 0.098\" W (3.20mm x 2.50mm)" H 3225 3000 50  0001 C CNN "Size / Dimension"
F 21 "Digi-Key" H 3225 3000 50  0001 C CNN "Supplier 1"
F 22 "587-1376-1-ND" H 3225 3000 50  0001 C CNN "Supplier Part Number 1"
F 23 "X5R" H 3225 3000 50  0001 C CNN "Temperature Coefficient"
F 24 "0.083\" (2.10mm)" H 3225 3000 50  0001 C CNN "Thickness (Max)"
F 25 "±10%" H 3225 3000 50  0001 C CNN "Tolerance"
F 26 "16V" H 3225 3000 50  0001 C CNN "Voltage - Rated"
	1    3225 3000
	1    0    0    -1  
$EndComp
$Comp
L power:GND #PWR0121
U 1 1 5AC046D4
P 3225 3200
F 0 "#PWR0121" H 3225 2950 50  0001 C CNN
F 1 "GND" H 3225 3050 50  0000 C CNN
F 2 "" H 3225 3200 50  0001 C CNN
F 3 "" H 3225 3200 50  0001 C CNN
	1    3225 3200
	1    0    0    -1  
$EndComp
$Comp
L SFUSat-cap:C_47u0_10%_6.3V_X5R_1206 C30
U 1 1 5AC04703
P 9750 1925
F 0 "C30" H 9750 1975 50  0000 L BNN
F 1 "47uF" H 9750 1875 50  0000 L TNN
F 2 "SFUSat-cap:C_1206" H 9750 1925 50  0001 C CNN
F 3 "" H 9750 1925 50  0001 C CNN
F 4 "General Purpose" H 9750 1925 50  0001 C CNN "Applications"
F 5 "47µF" H 9750 1925 50  0001 C CNN "Capacitance"
F 6 "Capacitors - Ceramic Capacitors" H 9750 1925 50  0001 C CNN "Categories"
F 7 "-" H 9750 1925 50  0001 C CNN "Features"
F 8 "-" H 9750 1925 50  0001 C CNN "Height - Seated (Max)"
F 9 "Lead free / RoHS Compliant" H 9750 1925 50  0001 C CNN "Lead Free Status / RoHS Status"
F 10 "-" H 9750 1925 50  0001 C CNN "Lead Spacing"
F 11 "-" H 9750 1925 50  0001 C CNN "Lead Style"
F 12 "Murata Electronics North America" H 9750 1925 50  0001 C CNN "Manufacturer 1"
F 13 "GRM31CR60J476KE19L" H 9750 1925 50  0001 C CNN "Manufacturer Part Number 1"
F 14 "Surface Mount, MLCC" H 9750 1925 50  0001 C CNN "Mounting Type"
F 15 "-55°C ~ 85°C" H 9750 1925 50  0001 C CNN "Operating Temperature"
F 16 "1206 (3216 Metric)" H 9750 1925 50  0001 C CNN "Package / Case"
F 17 "Active" H 9750 1925 50  0001 C CNN "Part Status"
F 18 "-" H 9750 1925 50  0001 C CNN "Ratings"
F 19 "GRM" H 9750 1925 50  0001 C CNN "Series"
F 20 "0.126\" L x 0.063\" W (3.20mm x 1.60mm)" H 9750 1925 50  0001 C CNN "Size / Dimension"
F 21 "Digi-Key" H 9750 1925 50  0001 C CNN "Supplier 1"
F 22 "490-6508-1-ND" H 9750 1925 50  0001 C CNN "Supplier Part Number 1"
F 23 "X5R" H 9750 1925 50  0001 C CNN "Temperature Coefficient"
F 24 "0.071\" (1.80mm)" H 9750 1925 50  0001 C CNN "Thickness (Max)"
F 25 "±10%" H 9750 1925 50  0001 C CNN "Tolerance"
F 26 "6.3V" H 9750 1925 50  0001 C CNN "Voltage - Rated"
	1    9750 1925
	1    0    0    -1  
$EndComp
$Comp
L power:GND #PWR0122
U 1 1 5AC0470A
P 9750 2125
F 0 "#PWR0122" H 9750 1875 50  0001 C CNN
F 1 "GND" H 9750 1975 50  0000 C CNN
F 2 "" H 9750 2125 50  0001 C CNN
F 3 "" H 9750 2125 50  0001 C CNN
	1    9750 2125
	1    0    0    -1  
$EndComp
Text HLabel 5300 3675 3    60   Input ~ 0
EN_3V6
$Comp
L SFUSat-power:LMS3635AQRNLRQ1 U4
U 1 1 5AC0471C
P 5650 2750
F 0 "U4" H 5650 2600 60  0000 C CNN
F 1 "LMS3635AQRNLRQ1" H 5700 2750 60  0000 C CNN
F 2 "SFUSat:LMS3635AQRNLTQ1" H 5650 2600 60  0001 C CNN
F 3 "" H 5650 2600 60  0001 C CNN
F 4 "296-47482-1-ND" H 5650 2750 60  0001 C CNN "Digikey"
F 5 "595-LMS3635AQRNLTQ1" H 5650 2750 60  0001 C CNN "Mouser"
	1    5650 2750
	1    0    0    -1  
$EndComp
$Comp
L power:GND #PWR0123
U 1 1 5AC2717C
P 4725 3125
F 0 "#PWR0123" H 4725 2875 50  0001 C CNN
F 1 "GND" H 4725 2975 50  0000 C CNN
F 2 "" H 4725 3125 50  0001 C CNN
F 3 "" H 4725 3125 50  0001 C CNN
	1    4725 3125
	1    0    0    -1  
$EndComp
$Comp
L power:GND #PWR0124
U 1 1 5AC272CC
P 5600 3625
F 0 "#PWR0124" H 5600 3375 50  0001 C CNN
F 1 "GND" H 5600 3475 50  0000 C CNN
F 2 "" H 5600 3625 50  0001 C CNN
F 3 "" H 5600 3625 50  0001 C CNN
	1    5600 3625
	1    0    0    -1  
$EndComp
$Comp
L power:GND #PWR0125
U 1 1 5AC2731C
P 6550 2400
F 0 "#PWR0125" H 6550 2150 50  0001 C CNN
F 1 "GND" H 6550 2250 50  0000 C CNN
F 2 "" H 6550 2400 50  0001 C CNN
F 3 "" H 6550 2400 50  0001 C CNN
	1    6550 2400
	0    -1   -1   0   
$EndComp
NoConn ~ 5450 3550
$Comp
L power:GND #PWR0126
U 1 1 5AC2B994
P 6525 2850
F 0 "#PWR0126" H 6525 2600 50  0001 C CNN
F 1 "GND" H 6525 2700 50  0000 C CNN
F 2 "" H 6525 2850 50  0001 C CNN
F 3 "" H 6525 2850 50  0001 C CNN
	1    6525 2850
	0    -1   -1   0   
$EndComp
$Comp
L power:GND #PWR0127
U 1 1 5AC2BC7C
P 5850 1850
F 0 "#PWR0127" H 5850 1600 50  0001 C CNN
F 1 "GND" H 5850 1700 50  0000 C CNN
F 2 "" H 5850 1850 50  0001 C CNN
F 3 "" H 5850 1850 50  0001 C CNN
	1    5850 1850
	-1   0    0    1   
$EndComp
$Comp
L power:GND #PWR0128
U 1 1 5AC2BCCC
P 5500 1850
F 0 "#PWR0128" H 5500 1600 50  0001 C CNN
F 1 "GND" H 5500 1700 50  0000 C CNN
F 2 "" H 5500 1850 50  0001 C CNN
F 3 "" H 5500 1850 50  0001 C CNN
	1    5500 1850
	-1   0    0    1   
$EndComp
$Comp
L power:GND #PWR0129
U 1 1 5AD173E7
P 4700 2400
F 0 "#PWR0129" H 4700 2150 50  0001 C CNN
F 1 "GND" H 4700 2250 50  0000 C CNN
F 2 "" H 4700 2400 50  0001 C CNN
F 3 "" H 4700 2400 50  0001 C CNN
	1    4700 2400
	0    1    1    0   
$EndComp
Wire Wire Line
	2925 3150 2925 3200
Wire Wire Line
	2625 3150 2625 3200
Wire Wire Line
	2325 3150 2325 3200
Wire Wire Line
	6550 3500 6550 3550
Wire Wire Line
	5700 1725 7150 1725
Connection ~ 7100 1725
Wire Wire Line
	7450 1725 9925 1725
Wire Wire Line
	7950 1725 7950 1775
Wire Wire Line
	7550 1775 7550 1725
Connection ~ 7550 1725
Wire Wire Line
	7950 2075 7950 2175
Wire Wire Line
	7250 2125 7950 2125
Connection ~ 7950 2125
Wire Wire Line
	7550 2075 7550 2125
Connection ~ 7550 2125
Wire Wire Line
	8200 3725 8200 3825
Wire Wire Line
	8200 4125 8200 4175
Wire Wire Line
	7950 2475 7950 2525
Wire Wire Line
	8550 2075 8550 2125
Wire Wire Line
	8850 2075 8850 2125
Wire Wire Line
	9150 2075 9150 2125
Wire Wire Line
	9450 2075 9450 2125
Wire Wire Line
	9450 1725 9450 1775
Connection ~ 7950 1725
Wire Wire Line
	9150 1775 9150 1725
Connection ~ 9150 1725
Wire Wire Line
	8850 1775 8850 1725
Connection ~ 8850 1725
Wire Wire Line
	8550 1775 8550 1725
Connection ~ 8550 1725
Wire Wire Line
	8200 1725 8200 3425
Connection ~ 8200 1725
Wire Wire Line
	2025 3150 2025 3200
Wire Wire Line
	4125 3150 4125 3200
Wire Wire Line
	3825 3150 3825 3200
Wire Wire Line
	3525 3150 3525 3200
Wire Wire Line
	3225 3150 3225 3200
Wire Wire Line
	1900 2800 4850 2800
Wire Wire Line
	2025 2850 2025 2800
Connection ~ 2025 2800
Wire Wire Line
	2325 2850 2325 2800
Connection ~ 2325 2800
Wire Wire Line
	2625 2850 2625 2800
Connection ~ 2625 2800
Wire Wire Line
	2925 2850 2925 2800
Connection ~ 2925 2800
Wire Wire Line
	3225 2850 3225 2800
Connection ~ 3225 2800
Wire Wire Line
	3525 2850 3525 2800
Connection ~ 3525 2800
Wire Wire Line
	3825 2850 3825 2800
Connection ~ 3825 2800
Wire Wire Line
	4125 2850 4125 2800
Connection ~ 4125 2800
Wire Wire Line
	9750 2075 9750 2125
Wire Wire Line
	9750 1725 9750 1775
Connection ~ 9450 1725
Connection ~ 9750 1725
Wire Wire Line
	6450 3150 6550 3150
Wire Wire Line
	6550 3150 6550 3200
Wire Wire Line
	4850 2650 4700 2650
Connection ~ 4700 2800
Wire Wire Line
	5300 3550 5300 3675
Wire Wire Line
	4850 3000 4725 3000
Wire Wire Line
	4725 3000 4725 3125
Wire Wire Line
	6450 2400 6550 2400
Wire Wire Line
	6450 2300 6500 2300
Wire Wire Line
	6500 2300 6500 2500
Connection ~ 6500 2400
Wire Wire Line
	6500 2500 6450 2500
Wire Wire Line
	5600 3550 5600 3625
Wire Wire Line
	6450 3000 6625 3000
Wire Wire Line
	7100 3000 6925 3000
Wire Wire Line
	7100 3000 7100 1725
Wire Wire Line
	7250 2125 7250 3875
Wire Wire Line
	7250 3875 5750 3875
Wire Wire Line
	5750 3875 5750 3550
Wire Wire Line
	5700 1725 5700 1900
Wire Wire Line
	5900 3550 5900 3800
Wire Wire Line
	5900 3800 8200 3800
Connection ~ 8200 3800
Wire Wire Line
	6450 2850 6525 2850
Wire Wire Line
	5850 1850 5850 1900
Wire Wire Line
	5500 1850 5500 1900
Wire Wire Line
	4850 2300 4775 2300
Wire Wire Line
	4775 2300 4775 2500
Wire Wire Line
	4775 2500 4850 2500
Wire Wire Line
	4700 2400 4850 2400
Connection ~ 4775 2400
Wire Wire Line
	6450 2650 6550 2650
Text HLabel 1900 2800 0    60   Input ~ 0
Vin
Wire Wire Line
	4700 2650 4700 2800
Text Label 7250 2425 0    60   ~ 0
FB
Text Label 7450 3800 0    60   ~ 0
BIAS
Text Label 6475 1725 0    60   ~ 0
SW
Text Label 6500 3000 0    60   ~ 0
BOOST
$EndSCHEMATC
