EESchema Schematic File Version 4
EELAYER 26 0
EELAYER END
$Descr A4 11693 8268
encoding utf-8
Sheet 13 15
Title ""
Date ""
Rev ""
Comp ""
Comment1 ""
Comment2 ""
Comment3 ""
Comment4 ""
$EndDescr
$Comp
L SFUSat:TLV702 U9
U 1 1 5AC11AF9
P 5550 3775
F 0 "U9" H 5800 3525 60  0000 R TNN
F 1 "TLV702" H 5550 4175 60  0000 C BNN
F 2 "SFUSat:SOT_23_5" H 5550 3775 60  0001 C CNN
F 3 "" H 5550 3775 60  0001 C CNN
F 4 "TLV70231DBVT" H 5550 3775 60  0001 C CNN "Part Number"
F 5 "296-27894-1-ND" H 5550 3775 60  0001 C CNN "Digi-Key"
F 6 "595-TLV70231DBVT" H 5550 3775 60  0001 C CNN "Mouser"
	1    5550 3775
	1    0    0    -1  
$EndComp
$Comp
L power:GND #PWR0130
U 1 1 5AC11B00
P 5500 4225
F 0 "#PWR0130" H 5500 3975 50  0001 C CNN
F 1 "GND" H 5500 4075 50  0000 C CNN
F 2 "" H 5500 4225 50  0001 C CNN
F 3 "" H 5500 4225 50  0001 C CNN
	1    5500 4225
	1    0    0    -1  
$EndComp
$Comp
L Device:C C32
U 1 1 5AC11B09
P 6250 3675
F 0 "C32" H 6275 3775 50  0000 L CNN
F 1 "1uF" H 6275 3575 50  0000 L CNN
F 2 "SFUSat:C_0402" H 6288 3525 50  0001 C CNN
F 3 "" H 6250 3675 50  0001 C CNN
F 4 "GRM155R61A105KE15D" H 6250 3675 60  0001 C CNN "Part Number"
F 5 "490-12701-1-ND" H 6250 3675 60  0001 C CNN "Digi-Key"
F 6 "81-GRM155R61A105KE1D" H 6250 3675 60  0001 C CNN "Mouser"
	1    6250 3675
	1    0    0    -1  
$EndComp
$Comp
L Device:C C31
U 1 1 5AC11B13
P 4775 3675
F 0 "C31" H 4800 3775 50  0000 L CNN
F 1 "1uF" H 4800 3575 50  0000 L CNN
F 2 "SFUSat:C_0402" H 4813 3525 50  0001 C CNN
F 3 "" H 4775 3675 50  0001 C CNN
F 4 "GRM155R61A105KE15D" H 4775 3675 60  0001 C CNN "Part Number"
F 5 "490-12701-1-ND" H 4775 3675 60  0001 C CNN "Digi-Key"
F 6 "81-GRM155R61A105KE1D" H 4775 3675 60  0001 C CNN "Mouser"
	1    4775 3675
	1    0    0    -1  
$EndComp
$Comp
L power:GND #PWR0131
U 1 1 5AC11B1A
P 4775 3875
F 0 "#PWR0131" H 4775 3625 50  0001 C CNN
F 1 "GND" H 4775 3725 50  0000 C CNN
F 2 "" H 4775 3875 50  0001 C CNN
F 3 "" H 4775 3875 50  0001 C CNN
	1    4775 3875
	1    0    0    -1  
$EndComp
$Comp
L power:GND #PWR0132
U 1 1 5AC11B20
P 6250 3875
F 0 "#PWR0132" H 6250 3625 50  0001 C CNN
F 1 "GND" H 6250 3725 50  0000 C CNN
F 2 "" H 6250 3875 50  0001 C CNN
F 3 "" H 6250 3875 50  0001 C CNN
	1    6250 3875
	1    0    0    -1  
$EndComp
Text HLabel 6750 3525 2    60   Input ~ 0
3V1OUT
Text HLabel 4525 3525 0    60   Input ~ 0
3V6IN
$Comp
L Device:R R11
U 1 1 5AC11B2B
P 5025 3325
F 0 "R11" H 4950 3325 50  0000 R CNN
F 1 "1K" V 5025 3325 50  0000 C CNN
F 2 "SFUSat:R_0402" V 4955 3325 50  0001 C CNN
F 3 "" H 5025 3325 50  0000 C CNN
F 4 "RC0402JR-071KL" H 5025 3325 60  0001 C CNN "Part Number"
F 5 "311-1.0KJRCT-ND" H 5025 3325 60  0001 C CNN "Digi-Key"
F 6 "603-RC0402JR-071KL" H 5025 3325 60  0001 C CNN "Mouser"
	1    5025 3325
	1    0    0    -1  
$EndComp
Wire Wire Line
	5025 3725 5025 3475
Wire Wire Line
	5100 3725 5025 3725
Connection ~ 6250 3525
Connection ~ 4775 3525
Wire Wire Line
	4525 3525 5100 3525
Wire Wire Line
	6000 3525 6750 3525
Wire Wire Line
	6250 3875 6250 3825
Wire Wire Line
	4775 3875 4775 3825
Wire Wire Line
	5500 4225 5500 4175
Wire Wire Line
	5025 3175 5025 3100
Text HLabel 5025 3100 1    60   Input ~ 0
3V6IN
$EndSCHEMATC
