EESchema Schematic File Version 4
EELAYER 26 0
EELAYER END
$Descr A4 11693 8268
encoding utf-8
Sheet 4 15
Title ""
Date ""
Rev ""
Comp ""
Comment1 ""
Comment2 ""
Comment3 ""
Comment4 ""
$EndDescr
Text Notes 475  805  0    250  ~ 0
PA
$Comp
L Device:C C404
U 1 1 5A58777F
P 1975 2850
AR Path="/5A585E42/5A58777F" Ref="C404"  Part="1" 
AR Path="/5A9CE314/5A58777F" Ref="C504"  Part="1" 
F 0 "C504" H 2000 2950 50  0000 L CNN
F 1 "2.2uF" H 2000 2750 50  0000 L CNN
F 2 "SFUSat:C_0402" H 2013 2700 50  0001 C CNN
F 3 "" H 1975 2850 50  0001 C CNN
F 4 "JMK105BJ225MVHF" H 1975 2850 60  0001 C CNN "Part Number"
F 5 "587-3710-1-ND" H 1975 2850 60  0001 C CNN "Digi-Key"
F 6 "963-JMK105BJ225MVHF" H 1975 2850 60  0001 C CNN "Mouser"
	1    1975 2850
	1    0    0    -1  
$EndComp
$Comp
L power:GND #PWR042
U 1 1 5A587792
P 3700 2100
AR Path="/5A585E42/5A587792" Ref="#PWR042"  Part="1" 
AR Path="/5A9CE314/5A587792" Ref="#PWR057"  Part="1" 
F 0 "#PWR057" H 3700 1850 50  0001 C CNN
F 1 "GND" H 3700 1950 50  0000 C CNN
F 2 "" H 3700 2100 50  0001 C CNN
F 3 "" H 3700 2100 50  0001 C CNN
	1    3700 2100
	1    0    0    -1  
$EndComp
$Comp
L power:GND #PWR043
U 1 1 5A587798
P 3600 3875
AR Path="/5A585E42/5A587798" Ref="#PWR043"  Part="1" 
AR Path="/5A9CE314/5A587798" Ref="#PWR058"  Part="1" 
F 0 "#PWR058" H 3600 3625 50  0001 C CNN
F 1 "GND" H 3600 3725 50  0000 C CNN
F 2 "" H 3600 3875 50  0001 C CNN
F 3 "" H 3600 3875 50  0001 C CNN
	1    3600 3875
	1    0    0    -1  
$EndComp
$Comp
L power:GND #PWR044
U 1 1 5A5877A4
P 1975 3050
AR Path="/5A585E42/5A5877A4" Ref="#PWR044"  Part="1" 
AR Path="/5A9CE314/5A5877A4" Ref="#PWR059"  Part="1" 
F 0 "#PWR059" H 1975 2800 50  0001 C CNN
F 1 "GND" H 1975 2900 50  0000 C CNN
F 2 "" H 1975 3050 50  0001 C CNN
F 3 "" H 1975 3050 50  0001 C CNN
	1    1975 3050
	1    0    0    -1  
$EndComp
$Comp
L Device:R R401
U 1 1 5A5877AD
P 1750 2650
AR Path="/5A585E42/5A5877AD" Ref="R401"  Part="1" 
AR Path="/5A9CE314/5A5877AD" Ref="R501"  Part="1" 
F 0 "R501" V 1830 2650 50  0000 C CNN
F 1 "220R" V 1750 2650 50  0000 C CNN
F 2 "SFUSat:R_0402" V 1680 2650 50  0001 C CNN
F 3 "" H 1750 2650 50  0001 C CNN
F 4 "RMC1/16S-221JTH" V 1750 2650 60  0001 C CNN "Part Number"
F 5 "N/A" V 1750 2650 60  0001 C CNN "Digi-Key"
F 6 "791-RMC1/16S-221JTH" V 1750 2650 60  0001 C CNN "Mouser"
	1    1750 2650
	0    1    1    0   
$EndComp
$Comp
L power:GND #PWR045
U 1 1 5A5877BE
P 4500 1375
AR Path="/5A585E42/5A5877BE" Ref="#PWR045"  Part="1" 
AR Path="/5A9CE314/5A5877BE" Ref="#PWR060"  Part="1" 
F 0 "#PWR060" H 4500 1125 50  0001 C CNN
F 1 "GND" H 4500 1225 50  0000 C CNN
F 2 "" H 4500 1375 50  0001 C CNN
F 3 "" H 4500 1375 50  0001 C CNN
	1    4500 1375
	1    0    0    -1  
$EndComp
$Comp
L power:GND #PWR046
U 1 1 5A5877C4
P 1325 3100
AR Path="/5A585E42/5A5877C4" Ref="#PWR046"  Part="1" 
AR Path="/5A9CE314/5A5877C4" Ref="#PWR061"  Part="1" 
F 0 "#PWR061" H 1325 2850 50  0001 C CNN
F 1 "GND" H 1325 2950 50  0000 C CNN
F 2 "" H 1325 3100 50  0001 C CNN
F 3 "" H 1325 3100 50  0001 C CNN
	1    1325 3100
	1    0    0    -1  
$EndComp
$Comp
L Device:C C406
U 1 1 5A5877CD
P 2400 2750
AR Path="/5A585E42/5A5877CD" Ref="C406"  Part="1" 
AR Path="/5A9CE314/5A5877CD" Ref="C506"  Part="1" 
F 0 "C506" H 2425 2850 50  0000 L CNN
F 1 "220pF" H 2425 2650 50  0000 L CNN
F 2 "SFUSat:C_0402" H 2438 2600 50  0001 C CNN
F 3 "" H 2400 2750 50  0001 C CNN
F 4 "GRM1555C1H221JA01E" H 2400 2750 60  0001 C CNN "Part Number"
F 5 "490-1293-1-ND" H 2400 2750 60  0001 C CNN "Digi-Key"
F 6 "81-GRM1555C1H221JA01" H 2400 2750 60  0001 C CNN "Mouser"
	1    2400 2750
	1    0    0    -1  
$EndComp
$Comp
L power:GND #PWR047
U 1 1 5A5877D4
P 2400 2950
AR Path="/5A585E42/5A5877D4" Ref="#PWR047"  Part="1" 
AR Path="/5A9CE314/5A5877D4" Ref="#PWR062"  Part="1" 
F 0 "#PWR062" H 2400 2700 50  0001 C CNN
F 1 "GND" H 2400 2800 50  0000 C CNN
F 2 "" H 2400 2950 50  0001 C CNN
F 3 "" H 2400 2950 50  0001 C CNN
	1    2400 2950
	1    0    0    -1  
$EndComp
$Comp
L Device:C C407
U 1 1 5A5877DD
P 2950 1350
AR Path="/5A585E42/5A5877DD" Ref="C407"  Part="1" 
AR Path="/5A9CE314/5A5877DD" Ref="C507"  Part="1" 
F 0 "C507" H 2975 1450 50  0000 L CNN
F 1 "1uF" H 2975 1250 50  0000 L CNN
F 2 "SFUSat:C_0402" H 2988 1200 50  0001 C CNN
F 3 "" H 2950 1350 50  0001 C CNN
F 4 "GRM155R61A105KE15D" H 2950 1350 60  0001 C CNN "Part Number"
F 5 "490-12701-1-ND" H 2950 1350 60  0001 C CNN "Digi-Key"
F 6 "81-GRM155R61A105KE1D" H 2950 1350 60  0001 C CNN "Mouser"
	1    2950 1350
	1    0    0    -1  
$EndComp
$Comp
L power:GND #PWR048
U 1 1 5A5877E4
P 2950 2200
AR Path="/5A585E42/5A5877E4" Ref="#PWR048"  Part="1" 
AR Path="/5A9CE314/5A5877E4" Ref="#PWR063"  Part="1" 
F 0 "#PWR063" H 2950 1950 50  0001 C CNN
F 1 "GND" H 2950 2050 50  0000 C CNN
F 2 "" H 2950 2200 50  0001 C CNN
F 3 "" H 2950 2200 50  0001 C CNN
	1    2950 2200
	1    0    0    -1  
$EndComp
$Comp
L power:GND #PWR049
U 1 1 5A5877EA
P 2950 1550
AR Path="/5A585E42/5A5877EA" Ref="#PWR049"  Part="1" 
AR Path="/5A9CE314/5A5877EA" Ref="#PWR064"  Part="1" 
F 0 "#PWR064" H 2950 1300 50  0001 C CNN
F 1 "GND" H 2950 1400 50  0000 C CNN
F 2 "" H 2950 1550 50  0001 C CNN
F 3 "" H 2950 1550 50  0001 C CNN
	1    2950 1550
	1    0    0    -1  
$EndComp
$Comp
L Device:R R402
U 1 1 5A5877F3
P 2600 1150
AR Path="/5A585E42/5A5877F3" Ref="R402"  Part="1" 
AR Path="/5A9CE314/5A5877F3" Ref="R502"  Part="1" 
F 0 "R502" V 2680 1150 50  0000 C CNN
F 1 "390R" V 2600 1150 50  0000 C CNN
F 2 "SFUSat:R_0402" V 2530 1150 50  0001 C CNN
F 3 "" H 2600 1150 50  0001 C CNN
F 4 "RMC1/16S-391JTH" V 2600 1150 60  0001 C CNN "Part Number"
F 5 "N/A" V 2600 1150 60  0001 C CNN "Digi-Key"
F 6 "791-RMC1/16S-391JTH" V 2600 1150 60  0001 C CNN "Mouser"
	1    2600 1150
	0    1    1    0   
$EndComp
Text HLabel 600  1800 1    60   Input ~ 0
3V6
Text HLabel 3550 1550 1    60   Input ~ 0
3V6
$Comp
L SFUSat:OP275 U401
U 1 1 5A58780E
P 2300 5850
AR Path="/5A585E42/5A58780E" Ref="U401"  Part="1" 
AR Path="/5A9CE314/5A58780E" Ref="U501"  Part="1" 
F 0 "U501" H 2300 6000 50  0000 L CNN
F 1 "LMV358" H 2300 5700 50  0000 L CNN
F 2 "SFUSat:TSSOP-8_4.4x3mm_Pitch0.65mm" H 2200 5900 50  0001 C CNN
F 3 "http://www.st.com/content/ccc/resource/technical/document/datasheet/b9/d8/3b/8f/a1/8f/46/01/CD00079372.pdf/files/CD00079372.pdf/jcr:content/translations/en.CD00079372.pdf" H 2300 6000 50  0001 C CNN
F 4 "LMV358IYDT" H 2300 5850 60  0001 C CNN "Part Number"
F 5 "497-10524-1-ND" H 2300 5850 60  0001 C CNN "Digi-Key"
F 6 "511-LMV358IPT" H 2300 5850 60  0001 C CNN "Mouser"
	1    2300 5850
	-1   0    0    1   
$EndComp
$Comp
L Device:R R404
U 1 1 5A587818
P 2825 5750
AR Path="/5A585E42/5A587818" Ref="R404"  Part="1" 
AR Path="/5A9CE314/5A587818" Ref="R504"  Part="1" 
F 0 "R504" V 2905 5750 50  0000 C CNN
F 1 "1K" V 2825 5750 50  0000 C CNN
F 2 "SFUSat:R_0402" V 2755 5750 50  0001 C CNN
F 3 "" H 2825 5750 50  0001 C CNN
F 4 "RC0402JR-071KL" V 2825 5750 60  0001 C CNN "Part Number"
F 5 "311-1.0KJRCT-ND" V 2825 5750 60  0001 C CNN "Digi-Key"
F 6 "603-RC0402JR-071KL" V 2825 5750 60  0001 C CNN "Mouser"
	1    2825 5750
	0    1    1    0   
$EndComp
$Comp
L Device:R R405
U 1 1 5A587822
P 3500 5250
AR Path="/5A585E42/5A587822" Ref="R405"  Part="1" 
AR Path="/5A9CE314/5A587822" Ref="R505"  Part="1" 
F 0 "R505" V 3580 5250 50  0000 C CNN
F 1 "3k2" V 3500 5250 50  0000 C CNN
F 2 "SFUSat:R_0402" V 3430 5250 50  0001 C CNN
F 3 "" H 3500 5250 50  0001 C CNN
F 4 "RT0402DRE073K2L" V 3500 5250 60  0001 C CNN "Part Number"
F 5 "311-2283-1-ND" V 3500 5250 60  0001 C CNN "Digi-Key"
F 6 "603-RT0402DRE073K2L" V 3500 5250 60  0001 C CNN "Mouser"
	1    3500 5250
	0    1    1    0   
$EndComp
$Comp
L power:GND #PWR050
U 1 1 5A587853
P 2825 5325
AR Path="/5A585E42/5A587853" Ref="#PWR050"  Part="1" 
AR Path="/5A9CE314/5A587853" Ref="#PWR065"  Part="1" 
F 0 "#PWR065" H 2825 5075 50  0001 C CNN
F 1 "GND" H 2825 5175 50  0000 C CNN
F 2 "" H 2825 5325 50  0001 C CNN
F 3 "" H 2825 5325 50  0001 C CNN
	1    2825 5325
	-1   0    0    1   
$EndComp
$Comp
L power:GND #PWR051
U 1 1 5A587859
P 3775 6275
AR Path="/5A585E42/5A587859" Ref="#PWR051"  Part="1" 
AR Path="/5A9CE314/5A587859" Ref="#PWR066"  Part="1" 
F 0 "#PWR066" H 3775 6025 50  0001 C CNN
F 1 "GND" H 3775 6125 50  0000 C CNN
F 2 "" H 3775 6275 50  0001 C CNN
F 3 "" H 3775 6275 50  0001 C CNN
	1    3775 6275
	1    0    0    -1  
$EndComp
Text HLabel 2975 6200 3    60   Input ~ 0
3V1
Text HLabel 9225 3125 2    60   Input ~ 0
3V1
Text Notes 1375 1775 0    79   ~ 0
Amplifier
Text Notes 1850 4875 0    79   ~ 0
Output Power Feedback
Text Notes 8650 3000 0    79   ~ 0
Output Power\nControl
Text Notes 2400 7000 0    79   ~ 0
R*05,R*06/R*07,R*08 * (Vref - Vsense) = Vout
$Comp
L power:GND #PWR052
U 1 1 5A587B1E
P 1975 2325
AR Path="/5A585E42/5A587B1E" Ref="#PWR052"  Part="1" 
AR Path="/5A9CE314/5A587B1E" Ref="#PWR067"  Part="1" 
F 0 "#PWR067" H 1975 2075 50  0001 C CNN
F 1 "GND" H 1975 2175 50  0000 C CNN
F 2 "" H 1975 2325 50  0001 C CNN
F 3 "" H 1975 2325 50  0001 C CNN
	1    1975 2325
	1    0    0    -1  
$EndComp
$Comp
L Device:C C410
U 1 1 5A587B76
P 4050 1125
AR Path="/5A585E42/5A587B76" Ref="C410"  Part="1" 
AR Path="/5A9CE314/5A587B76" Ref="C510"  Part="1" 
F 0 "C510" H 4075 1225 50  0000 L CNN
F 1 "2.2uF" H 4075 1025 50  0000 L CNN
F 2 "SFUSat:C_0402" H 4088 975 50  0001 C CNN
F 3 "" H 4050 1125 50  0001 C CNN
F 4 "JMK105BJ225MVHF" H 4050 1125 60  0001 C CNN "Part Number"
F 5 "587-3710-1-ND" H 4050 1125 60  0001 C CNN "Digi-Key"
F 6 "963-JMK105BJ225MVHF" H 4050 1125 60  0001 C CNN "Mouser"
	1    4050 1125
	1    0    0    -1  
$EndComp
$Comp
L Device:C C408
U 1 1 5A587B8A
P 2950 2000
AR Path="/5A585E42/5A587B8A" Ref="C408"  Part="1" 
AR Path="/5A9CE314/5A587B8A" Ref="C508"  Part="1" 
F 0 "C508" H 2975 2100 50  0000 L CNN
F 1 "1uF" H 2975 1900 50  0000 L CNN
F 2 "SFUSat:C_0402" H 2988 1850 50  0001 C CNN
F 3 "" H 2950 2000 50  0001 C CNN
F 4 "GRM155R61A105KE15D" H 2950 2000 60  0001 C CNN "Part Number"
F 5 "490-12701-1-ND" H 2950 2000 60  0001 C CNN "Digi-Key"
F 6 "81-GRM155R61A105KE1D" H 2950 2000 60  0001 C CNN "Mouser"
	1    2950 2000
	1    0    0    -1  
$EndComp
$Comp
L Device:C C409
U 1 1 5A587B94
P 3700 1900
AR Path="/5A585E42/5A587B94" Ref="C409"  Part="1" 
AR Path="/5A9CE314/5A587B94" Ref="C509"  Part="1" 
F 0 "C509" H 3725 2000 50  0000 L CNN
F 1 "1uF" H 3725 1800 50  0000 L CNN
F 2 "SFUSat:C_0402" H 3738 1750 50  0001 C CNN
F 3 "" H 3700 1900 50  0001 C CNN
F 4 "GRM155R61A105KE15D" H 3700 1900 60  0001 C CNN "Part Number"
F 5 "490-12701-1-ND" H 3700 1900 60  0001 C CNN "Digi-Key"
F 6 "81-GRM155R61A105KE1D" H 3700 1900 60  0001 C CNN "Mouser"
	1    3700 1900
	1    0    0    -1  
$EndComp
$Comp
L Device:R R409
U 1 1 5A587BB2
P 4350 925
AR Path="/5A585E42/5A587BB2" Ref="R409"  Part="1" 
AR Path="/5A9CE314/5A587BB2" Ref="R509"  Part="1" 
F 0 "R509" V 4430 925 50  0000 C CNN
F 1 "220R" V 4350 925 50  0000 C CNN
F 2 "SFUSat:R_0402" V 4280 925 50  0001 C CNN
F 3 "" H 4350 925 50  0001 C CNN
F 4 "RMC1/16S-221JTH" V 4350 925 60  0001 C CNN "Part Number"
F 5 "N/A" V 4350 925 60  0001 C CNN "Digi-Key"
F 6 "791-RMC1/16S-221JTH" V 4350 925 60  0001 C CNN "Mouser"
	1    4350 925 
	0    1    1    0   
$EndComp
$Comp
L Device:R R403
U 1 1 5A587BDC
P 2600 1800
AR Path="/5A585E42/5A587BDC" Ref="R403"  Part="1" 
AR Path="/5A9CE314/5A587BDC" Ref="R503"  Part="1" 
F 0 "R503" V 2680 1800 50  0000 C CNN
F 1 "390R" V 2600 1800 50  0000 C CNN
F 2 "SFUSat:R_0402" V 2530 1800 50  0001 C CNN
F 3 "" H 2600 1800 50  0001 C CNN
F 4 "RMC1/16S-391JTH" V 2600 1800 60  0001 C CNN "Part Number"
F 5 "N/A" V 2600 1800 60  0001 C CNN "Digi-Key"
F 6 "791-RMC1/16S-391JTH" V 2600 1800 60  0001 C CNN "Mouser"
	1    2600 1800
	0    1    1    0   
$EndComp
$Comp
L Device:C C402
U 1 1 5A587BE6
P 1475 2850
AR Path="/5A585E42/5A587BE6" Ref="C402"  Part="1" 
AR Path="/5A9CE314/5A587BE6" Ref="C502"  Part="1" 
F 0 "C502" H 1500 2950 50  0000 L CNN
F 1 "1uF" H 1500 2750 50  0000 L CNN
F 2 "SFUSat:C_0402" H 1513 2700 50  0001 C CNN
F 3 "" H 1475 2850 50  0001 C CNN
F 4 "GRM155R61A105KE15D" H 1475 2850 60  0001 C CNN "Part Number"
F 5 "490-12701-1-ND" H 1475 2850 60  0001 C CNN "Digi-Key"
F 6 "81-GRM155R61A105KE1D" H 1475 2850 60  0001 C CNN "Mouser"
	1    1475 2850
	1    0    0    -1  
$EndComp
$Comp
L Device:C C411
U 1 1 5A587BF0
P 4600 1125
AR Path="/5A585E42/5A587BF0" Ref="C411"  Part="1" 
AR Path="/5A9CE314/5A587BF0" Ref="C511"  Part="1" 
F 0 "C511" H 4625 1225 50  0000 L CNN
F 1 "DNF" H 4625 1025 50  0000 L CNN
F 2 "SFUSat:C_0402" H 4638 975 50  0001 C CNN
F 3 "" H 4600 1125 50  0001 C CNN
F 4 "GRM155R61A105KE15D" H 4600 1125 60  0001 C CNN "Part Number"
F 5 "490-12701-1-ND" H 4600 1125 60  0001 C CNN "Digi-Key"
F 6 "81-GRM155R61A105KE1D" H 4600 1125 60  0001 C CNN "Mouser"
	1    4600 1125
	1    0    0    -1  
$EndComp
Text HLabel 2700 3300 0    60   Input ~ 0
IN
Text HLabel 4550 3050 2    60   Input ~ 0
OUT
Text Label 4300 5650 0    60   ~ 0
PWR_SENSE
Text Label 4300 5850 0    60   ~ 0
PWR_REF
Text Label 3200 1200 3    60   ~ 0
PWR_SENSE
Text Label 3200 1900 3    60   ~ 0
PWR_REF
Text Label 1850 5850 2    60   ~ 0
VREG
Text Label 5075 925  0    60   ~ 0
VREG
Text Label 1125 2650 2    60   ~ 0
VREG
Text Label 2700 5950 0    60   ~ 0
GAIN
Text Label 9350 3650 0    60   ~ 0
GAIN
$Comp
L power:GND #PWR053
U 1 1 5AA2BE5C
P 8700 3850
AR Path="/5A585E42/5AA2BE5C" Ref="#PWR053"  Part="1" 
AR Path="/5A9CE314/5AA2BE5C" Ref="#PWR068"  Part="1" 
F 0 "#PWR068" H 8700 3600 50  0001 C CNN
F 1 "GND" H 8700 3700 50  0000 C CNN
F 2 "" H 8700 3850 50  0001 C CNN
F 3 "" H 8700 3850 50  0001 C CNN
	1    8700 3850
	1    0    0    -1  
$EndComp
$Comp
L SFUSat-cap:C_10u0_10%_16V_TANT_1411 C401
U 1 1 5ABEC321
P 1225 2850
AR Path="/5A585E42/5ABEC321" Ref="C401"  Part="1" 
AR Path="/5A9CE314/5ABEC321" Ref="C501"  Part="1" 
F 0 "C501" H 1225 2925 50  0000 L BNN
F 1 "10uF" H 1225 2775 50  0000 L TNN
F 2 "SFUSat-cap:C_TANT_1411" H 1225 2850 50  0001 C CNN
F 3 "" H 1225 2850 50  0001 C CNN
F 4 "10µF" H 1225 2850 50  0001 C CNN "Capacitance"
F 5 "Capacitors - Tantalum Capacitors" H 1225 2850 50  0001 C CNN "Categories"
F 6 "2.8 Ohm" H 1225 2850 50  0001 C CNN "ESR (Equivalent Series Resistance)"
F 7 "-" H 1225 2850 50  0001 C CNN "Failure Rate"
F 8 "General Purpose" H 1225 2850 50  0001 C CNN "Features"
F 9 "0.083\" (2.10mm)" H 1225 2850 50  0001 C CNN "Height - Seated (Max)"
F 10 "Lead free / RoHS Compliant" H 1225 2850 50  0001 C CNN "Lead Free Status / RoHS Status"
F 11 "-" H 1225 2850 50  0001 C CNN "Lead Spacing"
F 12 "-" H 1225 2850 50  0001 C CNN "Lifetime @ Temp."
F 13 "AVX Corporation" H 1225 2850 50  0001 C CNN "Manufacturer 1"
F 14 "TAJB106K016RNJ" H 1225 2850 50  0001 C CNN "Manufacturer Part Number 1"
F 15 "B" H 1225 2850 50  0001 C CNN "Manufacturer Size Code"
F 16 "20 Weeks" H 1225 2850 50  0001 C CNN "Manufacturer Standard Lead Time 1"
F 17 "Surface Mount" H 1225 2850 50  0001 C CNN "Mounting Type"
F 18 "-55°C ~ 125°C" H 1225 2850 50  0001 C CNN "Operating Temperature"
F 19 "1411 (3528 Metric), 1210" H 1225 2850 50  0001 C CNN "Package / Case"
F 20 "Active" H 1225 2850 50  0001 C CNN "Part Status"
F 21 "TAJ" H 1225 2850 50  0001 C CNN "Series"
F 22 "0.138\" L x 0.110\" W (3.50mm x 2.80mm)" H 1225 2850 50  0001 C CNN "Size / Dimension"
F 23 "Digi-Key" H 1225 2850 50  0001 C CNN "Supplier 1"
F 24 "478-1673-1-ND" H 1225 2850 50  0001 C CNN "Supplier Part Number 1"
F 25 "±10%" H 1225 2850 50  0001 C CNN "Tolerance"
F 26 "Molded" H 1225 2850 50  0001 C CNN "Type"
F 27 "16V" H 1225 2850 50  0001 C CNN "Voltage - Rated"
	1    1225 2850
	1    0    0    -1  
$EndComp
$Comp
L SFUSat-cap:C_10u0_10%_16V_TANT_1411 C412
U 1 1 5ABED10A
P 4900 1125
AR Path="/5A585E42/5ABED10A" Ref="C412"  Part="1" 
AR Path="/5A9CE314/5ABED10A" Ref="C512"  Part="1" 
F 0 "C512" H 4900 1200 50  0000 L BNN
F 1 "10uF" H 4900 1050 50  0000 L TNN
F 2 "SFUSat-cap:C_TANT_1411" H 4900 1125 50  0001 C CNN
F 3 "" H 4900 1125 50  0001 C CNN
F 4 "10µF" H 4900 1125 50  0001 C CNN "Capacitance"
F 5 "Capacitors - Tantalum Capacitors" H 4900 1125 50  0001 C CNN "Categories"
F 6 "2.8 Ohm" H 4900 1125 50  0001 C CNN "ESR (Equivalent Series Resistance)"
F 7 "-" H 4900 1125 50  0001 C CNN "Failure Rate"
F 8 "General Purpose" H 4900 1125 50  0001 C CNN "Features"
F 9 "0.083\" (2.10mm)" H 4900 1125 50  0001 C CNN "Height - Seated (Max)"
F 10 "Lead free / RoHS Compliant" H 4900 1125 50  0001 C CNN "Lead Free Status / RoHS Status"
F 11 "-" H 4900 1125 50  0001 C CNN "Lead Spacing"
F 12 "-" H 4900 1125 50  0001 C CNN "Lifetime @ Temp."
F 13 "AVX Corporation" H 4900 1125 50  0001 C CNN "Manufacturer 1"
F 14 "TAJB106K016RNJ" H 4900 1125 50  0001 C CNN "Manufacturer Part Number 1"
F 15 "B" H 4900 1125 50  0001 C CNN "Manufacturer Size Code"
F 16 "20 Weeks" H 4900 1125 50  0001 C CNN "Manufacturer Standard Lead Time 1"
F 17 "Surface Mount" H 4900 1125 50  0001 C CNN "Mounting Type"
F 18 "-55°C ~ 125°C" H 4900 1125 50  0001 C CNN "Operating Temperature"
F 19 "1411 (3528 Metric), 1210" H 4900 1125 50  0001 C CNN "Package / Case"
F 20 "Active" H 4900 1125 50  0001 C CNN "Part Status"
F 21 "TAJ" H 4900 1125 50  0001 C CNN "Series"
F 22 "0.138\" L x 0.110\" W (3.50mm x 2.80mm)" H 4900 1125 50  0001 C CNN "Size / Dimension"
F 23 "Digi-Key" H 4900 1125 50  0001 C CNN "Supplier 1"
F 24 "478-1673-1-ND" H 4900 1125 50  0001 C CNN "Supplier Part Number 1"
F 25 "±10%" H 4900 1125 50  0001 C CNN "Tolerance"
F 26 "Molded" H 4900 1125 50  0001 C CNN "Type"
F 27 "16V" H 4900 1125 50  0001 C CNN "Voltage - Rated"
	1    4900 1125
	1    0    0    -1  
$EndComp
$Comp
L SFUSat-cap:C_10u0_20%_25V_TANT_2312 C403
U 1 1 5ABEC9B2
P 1975 2125
AR Path="/5A585E42/5ABEC9B2" Ref="C403"  Part="1" 
AR Path="/5A9CE314/5ABEC9B2" Ref="C503"  Part="1" 
F 0 "C503" H 2000 2225 50  0000 L CNN
F 1 "10uF" H 2000 2025 50  0000 L CNN
F 2 "SFUSat-cap:C_TANT_2312" H 1975 2125 50  0001 C CNN
F 3 "" H 1975 2125 50  0001 C CNN
F 4 "10µF" H 1975 2125 50  0001 C CNN "Capacitance"
F 5 "Capacitors - Tantalum Capacitors" H 1975 2125 50  0001 C CNN "Categories"
F 6 "1.8 Ohm" H 1975 2125 50  0001 C CNN "ESR (Equivalent Series Resistance)"
F 7 "-" H 1975 2125 50  0001 C CNN "Failure Rate"
F 8 "General Purpose" H 1975 2125 50  0001 C CNN "Features"
F 9 "0.110\" (2.80mm)" H 1975 2125 50  0001 C CNN "Height - Seated (Max)"
F 10 "Lead free / RoHS Compliant" H 1975 2125 50  0001 C CNN "Lead Free Status / RoHS Status"
F 11 "-" H 1975 2125 50  0001 C CNN "Lead Spacing"
F 12 "-" H 1975 2125 50  0001 C CNN "Lifetime @ Temp."
F 13 "AVX Corporation" H 1975 2125 50  0001 C CNN "Manufacturer 1"
F 14 "TAJC106M025RNJ" H 1975 2125 50  0001 C CNN "Manufacturer Part Number 1"
F 15 "C" H 1975 2125 50  0001 C CNN "Manufacturer Size Code"
F 16 "16 Weeks" H 1975 2125 50  0001 C CNN "Manufacturer Standard Lead Time 1"
F 17 "Surface Mount" H 1975 2125 50  0001 C CNN "Mounting Type"
F 18 "-55°C ~ 125°C" H 1975 2125 50  0001 C CNN "Operating Temperature"
F 19 "2312 (6032 Metric)" H 1975 2125 50  0001 C CNN "Package / Case"
F 20 "Active" H 1975 2125 50  0001 C CNN "Part Status"
F 21 "TAJ" H 1975 2125 50  0001 C CNN "Series"
F 22 "0.236\" L x 0.126\" W (6.00mm x 3.20mm)" H 1975 2125 50  0001 C CNN "Size / Dimension"
F 23 "Digi-Key" H 1975 2125 50  0001 C CNN "Supplier 1"
F 24 "478-3896-1-ND" H 1975 2125 50  0001 C CNN "Supplier Part Number 1"
F 25 "±20%" H 1975 2125 50  0001 C CNN "Tolerance"
F 26 "Molded" H 1975 2125 50  0001 C CNN "Type"
F 27 "25V" H 1975 2125 50  0001 C CNN "Voltage - Rated"
	1    1975 2125
	1    0    0    -1  
$EndComp
$Comp
L Device:C C527
U 1 1 5AC5F024
P 1700 2125
AR Path="/5A9CE314/5AC5F024" Ref="C527"  Part="1" 
AR Path="/5A585E42/5AC5F024" Ref="C427"  Part="1" 
F 0 "C527" H 1725 2225 50  0000 L CNN
F 1 "DNF" H 1725 2025 50  0000 L CNN
F 2 "SFUSat:C_0402" H 1738 1975 50  0001 C CNN
F 3 "" H 1700 2125 50  0001 C CNN
	1    1700 2125
	1    0    0    -1  
$EndComp
$Comp
L Device:C C526
U 1 1 5AC5F28A
P 1425 2125
AR Path="/5A9CE314/5AC5F28A" Ref="C526"  Part="1" 
AR Path="/5A585E42/5AC5F28A" Ref="C426"  Part="1" 
F 0 "C526" H 1450 2225 50  0000 L CNN
F 1 "DNF" H 1450 2025 50  0000 L CNN
F 2 "SFUSat:C_0402" H 1463 1975 50  0001 C CNN
F 3 "" H 1425 2125 50  0001 C CNN
	1    1425 2125
	1    0    0    -1  
$EndComp
$Comp
L Device:C C525
U 1 1 5AC5F31A
P 1150 2125
AR Path="/5A9CE314/5AC5F31A" Ref="C525"  Part="1" 
AR Path="/5A585E42/5AC5F31A" Ref="C425"  Part="1" 
F 0 "C525" H 1175 2225 50  0000 L CNN
F 1 "DNF" H 1175 2025 50  0000 L CNN
F 2 "SFUSat:C_0402" H 1188 1975 50  0001 C CNN
F 3 "" H 1150 2125 50  0001 C CNN
	1    1150 2125
	1    0    0    -1  
$EndComp
$Comp
L Device:C C524
U 1 1 5AC5F3A5
P 875 2125
AR Path="/5A9CE314/5AC5F3A5" Ref="C524"  Part="1" 
AR Path="/5A585E42/5AC5F3A5" Ref="C424"  Part="1" 
F 0 "C524" H 900 2225 50  0000 L CNN
F 1 "DNF" H 900 2025 50  0000 L CNN
F 2 "SFUSat:C_0402" H 913 1975 50  0001 C CNN
F 3 "" H 875 2125 50  0001 C CNN
	1    875  2125
	1    0    0    -1  
$EndComp
$Comp
L Device:C C523
U 1 1 5AC5F437
P 600 2125
AR Path="/5A9CE314/5AC5F437" Ref="C523"  Part="1" 
AR Path="/5A585E42/5AC5F437" Ref="C423"  Part="1" 
F 0 "C523" H 625 2225 50  0000 L CNN
F 1 "DNF" H 625 2025 50  0000 L CNN
F 2 "SFUSat:C_0402" H 638 1975 50  0001 C CNN
F 3 "" H 600 2125 50  0001 C CNN
	1    600  2125
	1    0    0    -1  
$EndComp
$Comp
L Device:C C428
U 1 1 5AC758CD
P 2525 2125
AR Path="/5A585E42/5AC758CD" Ref="C428"  Part="1" 
AR Path="/5A9CE314/5AC758CD" Ref="C528"  Part="1" 
F 0 "C528" H 2550 2225 50  0000 L CNN
F 1 "DNF" H 2550 2025 50  0000 L CNN
F 2 "SFUSat:C_0402" H 2563 1975 50  0001 C CNN
F 3 "" H 2525 2125 50  0001 C CNN
	1    2525 2125
	1    0    0    -1  
$EndComp
$Comp
L power:GND #PWR069
U 1 1 5AC765FE
P 2525 2325
AR Path="/5A9CE314/5AC765FE" Ref="#PWR069"  Part="1" 
AR Path="/5A585E42/5AC765FE" Ref="#PWR054"  Part="1" 
F 0 "#PWR069" H 2525 2075 50  0001 C CNN
F 1 "GND" H 2525 2175 50  0000 C CNN
F 2 "" H 2525 2325 50  0001 C CNN
F 3 "" H 2525 2325 50  0001 C CNN
	1    2525 2325
	1    0    0    -1  
$EndComp
$Comp
L SFUSat:RF6886 U402
U 1 1 5A587750
P 3600 3100
AR Path="/5A585E42/5A587750" Ref="U402"  Part="1" 
AR Path="/5A9CE314/5A587750" Ref="U502"  Part="1" 
F 0 "U502" H 3050 3750 60  0000 C CNN
F 1 "RF6886" H 3600 3100 60  0000 C CNN
F 2 "SFUSat:QFN-24" H 3600 2750 60  0001 C CNN
F 3 "" H 3600 2750 60  0001 C CNN
F 4 "RF6886TR13" H 3600 3100 60  0001 C CNN "Part Number"
F 5 "689-1091-1-ND" H 3600 3100 60  0001 C CNN "Digi-Key"
F 6 "772-RF6886" H 3600 3100 60  0001 C CNN "Mouser"
	1    3600 3100
	1    0    0    -1  
$EndComp
$Comp
L SFUSat:BMI-S-205-F SH500
U 1 1 5ACCB65A
P 6000 2900
AR Path="/5A9CE314/5ACCB65A" Ref="SH500"  Part="1" 
AR Path="/5A585E42/5ACCB65A" Ref="SH400"  Part="1" 
F 0 "SH500" H 6250 3200 50  0000 L BNN
F 1 "BMI-S-205-F" H 6250 2600 50  0000 L TNN
F 2 "SFUSat:BMI-S-205-F" H 6000 2900 50  0001 C CNN
F 3 "" H 6000 2900 50  0001 C CNN
F 4 "RF/IF and RFID - RF Shields" H 6000 2900 50  0001 C CNN "Categories"
F 5 "0.236\" (6.00mm)" H 6000 2900 50  0001 C CNN "Height - Overall"
F 6 "Lead free / RoHS Compliant" H 6000 2900 50  0001 C CNN "Lead Free Status / RoHS Status"
F 7 "1.500\" (38.10mm)" H 6000 2900 50  0001 C CNN "Length - Overall"
F 8 "Laird Technologies EMI" H 6000 2900 50  0001 C CNN "Manufacturer 1"
F 9 "BMI-S-205-F" H 6000 2900 50  0001 C CNN "Manufacturer Part Number 1"
F 10 "4 Weeks" H 6000 2900 50  0001 C CNN "Manufacturer Standard Lead Time 1"
F 11 "Solder" H 6000 2900 50  0001 C CNN "Mounting Type"
F 12 "Active" H 6000 2900 50  0001 C CNN "Part Status"
F 13 "-" H 6000 2900 50  0001 C CNN "Series"
F 14 "Digi-Key" H 6000 2900 50  0001 C CNN "Supplier 1"
F 15 "903-1054-1-ND" H 6000 2900 50  0001 C CNN "Supplier Part Number 1"
F 16 "Frame" H 6000 2900 50  0001 C CNN "Type"
F 17 "-" H 6000 2900 50  0001 C CNN "Ventilation"
F 18 "1.000\" (25.40mm)" H 6000 2900 50  0001 C CNN "Width - Overall"
	1    6000 2900
	1    0    0    -1  
$EndComp
$Comp
L power:GND #PWR070
U 1 1 5ACCCEBA
P 6000 3450
AR Path="/5A9CE314/5ACCCEBA" Ref="#PWR070"  Part="1" 
AR Path="/5A585E42/5ACCCEBA" Ref="#PWR055"  Part="1" 
F 0 "#PWR070" H 6000 3200 50  0001 C CNN
F 1 "GND" H 6000 3300 50  0000 C CNN
F 2 "" H 6000 3450 50  0001 C CNN
F 3 "" H 6000 3450 50  0001 C CNN
	1    6000 3450
	1    0    0    -1  
$EndComp
$Comp
L SFUSat:TP_TH_150 J401
U 1 1 5ACCC1CD
P 1850 5250
AR Path="/5A585E42/5ACCC1CD" Ref="J401"  Part="1" 
AR Path="/5A9CE314/5ACCC1CD" Ref="J501"  Part="1" 
F 0 "J501" H 1850 5450 50  0000 C CNN
F 1 "TP_TH_150" H 1850 5450 50  0001 C CNN
F 2 "SFUSat:TP_TH_150" H 1850 5250 50  0001 C CNN
F 3 "" H 2050 5250 50  0000 C CNN
	1    1850 5250
	0    -1   -1   0   
$EndComp
$Comp
L SFUSat:TP_TH_150 J402
U 1 1 5ACCC995
P 2950 5550
AR Path="/5A585E42/5ACCC995" Ref="J402"  Part="1" 
AR Path="/5A9CE314/5ACCC995" Ref="J502"  Part="1" 
F 0 "J502" H 2950 5750 50  0000 C CNN
F 1 "TP_TH_150" H 2950 5750 50  0001 C CNN
F 2 "SFUSat:TP_TH_150" H 2950 5550 50  0001 C CNN
F 3 "" H 3150 5550 50  0000 C CNN
	1    2950 5550
	0    -1   -1   0   
$EndComp
$Comp
L SFUSat:TP_TH_150 J404
U 1 1 5ACCD289
P 4250 5600
AR Path="/5A585E42/5ACCD289" Ref="J404"  Part="1" 
AR Path="/5A9CE314/5ACCD289" Ref="J504"  Part="1" 
F 0 "J504" H 4250 5800 50  0000 C CNN
F 1 "TP_TH_150" H 4250 5800 50  0001 C CNN
F 2 "SFUSat:TP_TH_150" H 4250 5600 50  0001 C CNN
F 3 "" H 4450 5600 50  0000 C CNN
	1    4250 5600
	1    0    0    -1  
$EndComp
$Comp
L SFUSat:TP_TH_150 J405
U 1 1 5ACCD4FE
P 4250 5900
AR Path="/5A585E42/5ACCD4FE" Ref="J405"  Part="1" 
AR Path="/5A9CE314/5ACCD4FE" Ref="J505"  Part="1" 
F 0 "J505" H 4250 6100 50  0000 C CNN
F 1 "TP_TH_150" H 4250 6100 50  0001 C CNN
F 2 "SFUSat:TP_TH_150" H 4250 5900 50  0001 C CNN
F 3 "" H 4450 5900 50  0000 C CNN
	1    4250 5900
	-1   0    0    1   
$EndComp
$Comp
L SFUSat:TP_TH_150 J406
U 1 1 5ACD1FD2
P 9225 3650
AR Path="/5A585E42/5ACD1FD2" Ref="J406"  Part="1" 
AR Path="/5A9CE314/5ACD1FD2" Ref="J506"  Part="1" 
F 0 "J506" H 9225 3850 50  0000 C CNN
F 1 "TP_TH_150" H 9225 3850 50  0001 C CNN
F 2 "SFUSat:TP_TH_150" H 9225 3650 50  0001 C CNN
F 3 "" H 9425 3650 50  0000 C CNN
	1    9225 3650
	-1   0    0    1   
$EndComp
$Comp
L SFUSat-res:CT6EP103 RV401
U 1 1 5AD75A41
P 8700 3650
AR Path="/5A585E42/5AD75A41" Ref="RV401"  Part="1" 
AR Path="/5A9CE314/5AD75A41" Ref="RV501"  Part="1" 
F 0 "RV501" H 8700 3590 50  0000 C TNN
F 1 "CT6EP103" H 8700 3650 50  0001 C CNN
F 2 "SFUSat:CT6EP103" H 8700 3650 50  0001 C CNN
F 3 "" H 8700 3650 50  0001 C CNN
F 4 "Top Adjustment" H 8700 3650 50  0001 C CNN "Adjustment Type"
F 5 "Potentiometers, Variable Resistors - Trimmer Potentiometers" H 8700 3650 50  0001 C CNN "Categories"
F 6 "Lead free / RoHS Compliant" H 8700 3650 50  0001 C CNN "Lead Free Status / RoHS Status"
F 7 "Nidec Copal Electronics" H 8700 3650 50  0001 C CNN "Manufacturer 1"
F 8 "CT6EP103" H 8700 3650 50  0001 C CNN "Manufacturer Part Number 1"
F 9 "9 Weeks" H 8700 3650 50  0001 C CNN "Manufacturer Standard Lead Time 1"
F 10 "Through Hole" H 8700 3650 50  0001 C CNN "Mounting Type"
F 11 "1" H 8700 3650 50  0001 C CNN "Number of Turns"
F 12 "Active" H 8700 3650 50  0001 C CNN "Part Status"
F 13 "0.5W, 1/2W" H 8700 3650 50  0001 C CNN "Power (Watts)"
F 14 "10 kOhms" H 8700 3650 50  0001 C CNN "Resistance"
F 15 "Cermet" H 8700 3650 50  0001 C CNN "Resistive Material"
F 16 "CT6" H 8700 3650 50  0001 C CNN "Series"
F 17 "Square - 0.276\" x 0.276\" Face x 0.228\" L (7.00mm x 7.00mm x 5.80mm)" H 8700 3650 50  0001 C CNN "Size / Dimension"
F 18 "Digi-Key" H 8700 3650 50  0001 C CNN "Supplier 1"
F 19 "CT6EP103-ND" H 8700 3650 50  0001 C CNN "Supplier Part Number 1"
F 20 "±100ppm/°C" H 8700 3650 50  0001 C CNN "Temperature Coefficient"
F 21 "PC Pins" H 8700 3650 50  0001 C CNN "Termination Style"
F 22 "±10%" H 8700 3650 50  0001 C CNN "Tolerance"
	1    8700 3650
	0    1    1    0   
$EndComp
$Comp
L Device:R R411
U 1 1 5ADF5FF6
P 8950 3850
AR Path="/5A585E42/5ADF5FF6" Ref="R411"  Part="1" 
AR Path="/5A9CE314/5ADF5FF6" Ref="R511"  Part="1" 
F 0 "R511" V 9030 3850 50  0000 C CNN
F 1 "DNF" V 8950 3850 50  0000 C CNN
F 2 "SFUSat-res:R_0805" V 8880 3850 50  0001 C CNN
F 3 "" H 8950 3850 50  0001 C CNN
	1    8950 3850
	1    0    0    -1  
$EndComp
Wire Notes Line
	975  825  475  825 
Wire Notes Line
	975  825  975  475 
Connection ~ 1950 5850
Wire Wire Line
	3000 5250 3350 5250
Wire Wire Line
	3650 5250 3775 5250
Wire Wire Line
	1900 2650 1975 2650
Wire Wire Line
	1125 2650 1225 2650
Wire Wire Line
	2700 5950 2600 5950
Wire Wire Line
	4200 5650 4250 5650
Wire Wire Line
	4200 5850 4250 5850
Connection ~ 2825 5400
Wire Wire Line
	2825 5325 2825 5400
Wire Wire Line
	3775 6225 3775 6275
Wire Wire Line
	3450 6200 3450 6050
Wire Wire Line
	2400 6200 3450 6200
Wire Wire Line
	2400 6150 2400 6200
Wire Wire Line
	2400 5400 2400 5550
Wire Wire Line
	2400 5400 2825 5400
Wire Wire Line
	3450 5400 3450 5450
Wire Wire Line
	1850 5850 1950 5850
Wire Wire Line
	1950 5250 1950 5850
Wire Wire Line
	1850 5250 1950 5250
Connection ~ 2625 5750
Wire Wire Line
	2625 5250 2625 5750
Wire Wire Line
	2300 5250 2625 5250
Connection ~ 3775 5850
Wire Wire Line
	3775 5925 3775 5850
Wire Wire Line
	3650 5850 3775 5850
Connection ~ 3775 5650
Wire Wire Line
	3650 5650 3775 5650
Wire Wire Line
	3775 5250 3775 5650
Connection ~ 3000 5750
Wire Wire Line
	3000 5250 3000 5550
Wire Wire Line
	2600 5750 2625 5750
Wire Wire Line
	2975 5750 3000 5750
Connection ~ 4900 925 
Connection ~ 1225 2650
Connection ~ 3200 1150
Wire Wire Line
	3200 1150 3200 1200
Connection ~ 3200 1800
Wire Wire Line
	3200 1800 3200 1900
Connection ~ 3550 1700
Connection ~ 2400 1800
Wire Wire Line
	2450 1800 2400 1800
Connection ~ 2400 2550
Wire Wire Line
	2400 1150 2450 1150
Wire Wire Line
	2950 1550 2950 1500
Connection ~ 2950 1150
Wire Wire Line
	3450 1150 3450 2300
Wire Wire Line
	2950 1150 2950 1200
Wire Wire Line
	2750 1150 2950 1150
Connection ~ 2950 1800
Wire Wire Line
	2950 2150 2950 2200
Wire Wire Line
	2950 1800 2950 1850
Wire Wire Line
	3350 1800 3350 2300
Wire Wire Line
	2750 1800 2950 1800
Wire Wire Line
	2700 2550 2700 2800
Connection ~ 2700 2800
Wire Wire Line
	2700 2800 2750 2800
Connection ~ 2700 2900
Wire Wire Line
	2750 2900 2700 2900
Wire Wire Line
	2700 3000 2750 3000
Wire Wire Line
	2400 2550 2700 2550
Wire Wire Line
	2400 1150 2400 1800
Wire Wire Line
	2400 2950 2400 2900
Wire Wire Line
	2200 2650 2200 3200
Wire Wire Line
	2200 3200 2750 3200
Connection ~ 1975 2650
Connection ~ 1475 2650
Wire Wire Line
	1475 2700 1475 2650
Wire Wire Line
	1225 2700 1225 2650
Connection ~ 1325 3050
Wire Wire Line
	1325 3100 1325 3050
Wire Wire Line
	1475 3050 1475 3000
Wire Wire Line
	1225 3050 1325 3050
Wire Wire Line
	1225 3000 1225 3050
Wire Wire Line
	4050 1325 4050 1275
Connection ~ 4500 1325
Wire Wire Line
	4500 1375 4500 1325
Connection ~ 4600 1325
Wire Wire Line
	4900 1325 4900 1275
Wire Wire Line
	4600 1325 4600 1275
Wire Wire Line
	4050 1325 4500 1325
Connection ~ 4050 925 
Wire Wire Line
	3850 925  3850 2300
Wire Wire Line
	4050 925  4050 975 
Wire Wire Line
	3850 925  4050 925 
Connection ~ 4600 925 
Wire Wire Line
	4600 975  4600 925 
Wire Wire Line
	4900 925  4900 975 
Wire Wire Line
	4500 925  4600 925 
Wire Wire Line
	3700 2050 3700 2100
Wire Wire Line
	1975 3050 1975 3000
Wire Wire Line
	2750 3300 2700 3300
Wire Wire Line
	1975 2650 1975 2700
Wire Wire Line
	3550 1550 3550 1700
Wire Wire Line
	3700 1700 3550 1700
Wire Wire Line
	3700 1750 3700 1700
Connection ~ 2400 1975
Wire Wire Line
	4450 2800 4450 2900
Connection ~ 4450 2900
Connection ~ 4450 3000
Connection ~ 4450 3100
Connection ~ 4450 3200
Wire Wire Line
	4450 3050 4550 3050
Connection ~ 4450 3050
Connection ~ 1950 5250
Wire Wire Line
	8700 3850 8700 3800
Wire Wire Line
	3300 3800 3400 3800
Connection ~ 3400 3800
Connection ~ 3500 3800
Connection ~ 3600 3800
Connection ~ 3700 3800
Connection ~ 3800 3800
Wire Wire Line
	3600 3875 3600 3800
Connection ~ 1975 1975
Connection ~ 1700 1975
Wire Wire Line
	600  2275 875  2275
Connection ~ 875  2275
Connection ~ 1150 2275
Connection ~ 1425 2275
Connection ~ 1700 2275
Wire Wire Line
	600  1975 875  1975
Connection ~ 1425 1975
Connection ~ 1150 1975
Connection ~ 875  1975
Wire Wire Line
	600  1975 600  1800
Wire Wire Line
	1975 2275 1975 2325
Wire Wire Line
	2525 2275 2525 2325
Wire Wire Line
	2950 5550 3000 5550
Connection ~ 3000 5550
Wire Wire Line
	4250 5600 4250 5650
Connection ~ 4250 5650
Wire Wire Line
	4250 5850 4250 5900
Connection ~ 4250 5850
Wire Wire Line
	5550 2450 5800 2450
Connection ~ 6100 2450
Connection ~ 6000 2450
Connection ~ 5900 2450
Wire Wire Line
	5550 2450 5550 2700
Connection ~ 5800 2450
Connection ~ 5550 2700
Connection ~ 5550 2800
Connection ~ 5550 2900
Connection ~ 5550 3000
Wire Wire Line
	5550 3350 5800 3350
Connection ~ 5550 3100
Connection ~ 5800 3350
Connection ~ 5900 3350
Connection ~ 6000 3350
Connection ~ 6100 3350
Wire Wire Line
	6450 2450 6450 2700
Connection ~ 6450 3000
Connection ~ 6450 2900
Connection ~ 6450 2800
Connection ~ 6200 2450
Connection ~ 6450 2700
Wire Wire Line
	6000 3350 6000 3450
Wire Wire Line
	8850 3650 8950 3650
Connection ~ 9225 3650
Wire Wire Line
	8700 3500 8700 3125
Wire Wire Line
	8700 3125 8950 3125
Wire Wire Line
	8950 3600 8950 3650
Connection ~ 8950 3650
$Comp
L power:GND #PWR071
U 1 1 5AE5243A
P 8950 4050
AR Path="/5A9CE314/5AE5243A" Ref="#PWR071"  Part="1" 
AR Path="/5A585E42/5AE5243A" Ref="#PWR056"  Part="1" 
F 0 "#PWR071" H 8950 3800 50  0001 C CNN
F 1 "GND" H 8950 3900 50  0000 C CNN
F 2 "" H 8950 4050 50  0001 C CNN
F 3 "" H 8950 4050 50  0001 C CNN
	1    8950 4050
	1    0    0    -1  
$EndComp
Wire Wire Line
	8950 4050 8950 4000
Wire Wire Line
	8950 3300 8950 3125
Connection ~ 8950 3125
$Comp
L SFUSat-res:R_100k0_1%_0.125W_0805 R410
U 1 1 5AE2BA4E
P 8950 3450
AR Path="/5A585E42/5AE2BA4E" Ref="R410"  Part="1" 
AR Path="/5A9CE314/5AE2BA4E" Ref="R510"  Part="1" 
F 0 "R510" H 8950 3500 50  0000 C BNN
F 1 "100k" H 8950 3400 50  0000 C TNN
F 2 "SFUSat-res:R_0805" H 8950 3450 50  0001 C CNN
F 3 "" H 8950 3450 50  0001 C CNN
F 4 "Resistors - Chip Resistor - Surface Mount" H 8950 3450 50  0001 C CNN "Categories"
F 5 "Thick Film" H 8950 3450 50  0001 C CNN "Composition"
F 6 "-" H 8950 3450 50  0001 C CNN "Failure Rate"
F 7 "Automotive AEC-Q200" H 8950 3450 50  0001 C CNN "Features"
F 8 "0.028\" (0.70mm)" H 8950 3450 50  0001 C CNN "Height - Seated (Max)"
F 9 "Lead free / RoHS Compliant" H 8950 3450 50  0001 C CNN "Lead Free Status / RoHS Status"
F 10 "Panasonic Electronic Components" H 8950 3450 50  0001 C CNN "Manufacturer 1"
F 11 "ERJ-6ENF1003V" H 8950 3450 50  0001 C CNN "Manufacturer Part Number 1"
F 12 "2" H 8950 3450 50  0001 C CNN "Number of Terminations"
F 13 "-55°C ~ 155°C" H 8950 3450 50  0001 C CNN "Operating Temperature"
F 14 "0805 (2012 Metric)" H 8950 3450 50  0001 C CNN "Package / Case"
F 15 "Active" H 8950 3450 50  0001 C CNN "Part Status"
F 16 "0.125W, 1/8W" H 8950 3450 50  0001 C CNN "Power (Watts)"
F 17 "100 kOhms" H 8950 3450 50  0001 C CNN "Resistance"
F 18 "ERJ" H 8950 3450 50  0001 C CNN "Series"
F 19 "0.079\" L x 0.049\" W (2.00mm x 1.25mm)" H 8950 3450 50  0001 C CNN "Size / Dimension"
F 20 "Digi-Key" H 8950 3450 50  0001 C CNN "Supplier 1"
F 21 "0805" H 8950 3450 50  0001 C CNN "Supplier Device Package"
F 22 "P100KCCT-ND" H 8950 3450 50  0001 C CNN "Supplier Part Number 1"
F 23 "±100ppm/°C" H 8950 3450 50  0001 C CNN "Temperature Coefficient"
F 24 "±1%" H 8950 3450 50  0001 C CNN "Tolerance"
	1    8950 3450
	0    1    1    0   
$EndComp
$Comp
L SFUSat-cap:C_330n0_10%_10V_X5R_0402 C405
U 1 1 5AE2AF44
P 2150 5250
AR Path="/5A585E42/5AE2AF44" Ref="C405"  Part="1" 
AR Path="/5A9CE314/5AE2AF44" Ref="C505"  Part="1" 
F 0 "C505" H 2150 5300 50  0000 L BNN
F 1 "0.33uF" H 2150 5200 50  0000 L TNN
F 2 "SFUSat-cap:C_0402" H 2150 5250 50  0001 C CNN
F 3 "" H 2150 5250 50  0001 C CNN
F 4 "General Purpose" H 2150 5250 50  0001 C CNN "Applications"
F 5 "0.33µF" H 2150 5250 50  0001 C CNN "Capacitance"
F 6 "Capacitors - Ceramic Capacitors" H 2150 5250 50  0001 C CNN "Categories"
F 7 "-" H 2150 5250 50  0001 C CNN "Features"
F 8 "-" H 2150 5250 50  0001 C CNN "Height - Seated (Max)"
F 9 "Lead free / RoHS Compliant" H 2150 5250 50  0001 C CNN "Lead Free Status / RoHS Status"
F 10 "-" H 2150 5250 50  0001 C CNN "Lead Spacing"
F 11 "-" H 2150 5250 50  0001 C CNN "Lead Style"
F 12 "Samsung Electro-Mechanics" H 2150 5250 50  0001 C CNN "Manufacturer 1"
F 13 "CL05A334KP5NNNC" H 2150 5250 50  0001 C CNN "Manufacturer Part Number 1"
F 14 "42 Weeks" H 2150 5250 50  0001 C CNN "Manufacturer Standard Lead Time 1"
F 15 "Surface Mount, MLCC" H 2150 5250 50  0001 C CNN "Mounting Type"
F 16 "-55°C ~ 85°C" H 2150 5250 50  0001 C CNN "Operating Temperature"
F 17 "0402 (1005 Metric)" H 2150 5250 50  0001 C CNN "Package / Case"
F 18 "Active" H 2150 5250 50  0001 C CNN "Part Status"
F 19 "-" H 2150 5250 50  0001 C CNN "Ratings"
F 20 "CL" H 2150 5250 50  0001 C CNN "Series"
F 21 "0.039\" L x 0.020\" W (1.00mm x 0.50mm)" H 2150 5250 50  0001 C CNN "Size / Dimension"
F 22 "Digi-Key" H 2150 5250 50  0001 C CNN "Supplier 1"
F 23 "1276-6665-1-ND" H 2150 5250 50  0001 C CNN "Supplier Part Number 1"
F 24 "X5R" H 2150 5250 50  0001 C CNN "Temperature Coefficient"
F 25 "0.022\" (0.55mm)" H 2150 5250 50  0001 C CNN "Thickness (Max)"
F 26 "±10%" H 2150 5250 50  0001 C CNN "Tolerance"
F 27 "10V" H 2150 5250 50  0001 C CNN "Voltage - Rated"
	1    2150 5250
	0    1    1    0   
$EndComp
Wire Wire Line
	1950 5850 2000 5850
Wire Wire Line
	2825 5400 3450 5400
Wire Wire Line
	2625 5750 2675 5750
Wire Wire Line
	3775 5850 3900 5850
Wire Wire Line
	3775 5650 3900 5650
Wire Wire Line
	3000 5750 3050 5750
Wire Wire Line
	4900 925  5075 925 
Wire Wire Line
	1225 2650 1475 2650
Wire Wire Line
	3200 1150 3450 1150
Wire Wire Line
	3200 1800 3350 1800
Wire Wire Line
	3550 1700 3550 2300
Wire Wire Line
	2400 1800 2400 1975
Wire Wire Line
	2400 2550 2400 2600
Wire Wire Line
	2950 1150 3200 1150
Wire Wire Line
	2950 1800 3200 1800
Wire Wire Line
	2700 2800 2700 2900
Wire Wire Line
	2700 2900 2700 3000
Wire Wire Line
	1975 2650 2200 2650
Wire Wire Line
	1475 2650 1600 2650
Wire Wire Line
	1325 3050 1475 3050
Wire Wire Line
	4500 1325 4600 1325
Wire Wire Line
	4600 1325 4900 1325
Wire Wire Line
	4050 925  4200 925 
Wire Wire Line
	4600 925  4900 925 
Wire Wire Line
	2400 1975 2525 1975
Wire Wire Line
	2400 1975 2400 2550
Wire Wire Line
	4450 2900 4450 3000
Wire Wire Line
	4450 3000 4450 3050
Wire Wire Line
	4450 3100 4450 3200
Wire Wire Line
	4450 3200 4450 3300
Wire Wire Line
	4450 3050 4450 3100
Wire Wire Line
	1950 5250 2000 5250
Wire Wire Line
	3400 3800 3500 3800
Wire Wire Line
	3500 3800 3600 3800
Wire Wire Line
	3600 3800 3700 3800
Wire Wire Line
	3700 3800 3800 3800
Wire Wire Line
	3800 3800 3900 3800
Wire Wire Line
	1975 1975 2400 1975
Wire Wire Line
	1700 1975 1975 1975
Wire Wire Line
	875  2275 1150 2275
Wire Wire Line
	1150 2275 1425 2275
Wire Wire Line
	1425 2275 1700 2275
Wire Wire Line
	1700 2275 1975 2275
Wire Wire Line
	1425 1975 1700 1975
Wire Wire Line
	1150 1975 1425 1975
Wire Wire Line
	875  1975 1150 1975
Wire Wire Line
	3000 5550 3000 5750
Wire Wire Line
	4250 5650 4300 5650
Wire Wire Line
	4250 5850 4300 5850
Wire Wire Line
	6100 2450 6200 2450
Wire Wire Line
	6000 2450 6100 2450
Wire Wire Line
	5900 2450 6000 2450
Wire Wire Line
	5800 2450 5900 2450
Wire Wire Line
	5550 2700 5550 2800
Wire Wire Line
	5550 2800 5550 2900
Wire Wire Line
	5550 2900 5550 3000
Wire Wire Line
	5550 3000 5550 3100
Wire Wire Line
	5550 3100 5550 3350
Wire Wire Line
	5800 3350 5900 3350
Wire Wire Line
	5900 3350 6000 3350
Wire Wire Line
	6000 3350 6100 3350
Wire Wire Line
	6100 3350 6200 3350
Wire Wire Line
	6450 3000 6450 3100
Wire Wire Line
	6450 2900 6450 3000
Wire Wire Line
	6450 2800 6450 2900
Wire Wire Line
	6200 2450 6450 2450
Wire Wire Line
	6450 2700 6450 2800
Wire Wire Line
	9225 3650 9350 3650
Wire Wire Line
	8950 3650 9225 3650
Wire Wire Line
	8950 3650 8950 3700
Wire Wire Line
	8950 3125 9225 3125
$Comp
L SFUSat:OP275 U501
U 2 1 5C88AB72
P 3350 5750
AR Path="/5A9CE314/5C88AB72" Ref="U501"  Part="2" 
AR Path="/5A585E42/5C88AB72" Ref="U401"  Part="2" 
F 0 "U501" H 3350 5600 50  0000 L CNN
F 1 "LMV358" H 3500 5900 50  0000 C CNN
F 2 "SFUSat:TSSOP-8_4.4x3mm_Pitch0.65mm" H 3250 5800 50  0001 C CNN
F 3 "http://www.st.com/content/ccc/resource/technical/document/datasheet/b9/d8/3b/8f/a1/8f/46/01/CD00079372.pdf/files/CD00079372.pdf/jcr:content/translations/en.CD00079372.pdf" H 3350 5900 50  0001 C CNN
F 4 "LMV358IYDT" H 3350 5750 50  0001 C CNN "Part Number"
F 5 "497-10524-1-ND" H 3350 5750 50  0001 C CNN "Digi-Key"
F 6 "511-LMV358IPT" H 3350 5750 50  0001 C CNN "Mouser"
	2    3350 5750
	-1   0    0    -1  
$EndComp
$Comp
L Device:R R407
U 1 1 5C88494F
P 4050 5650
AR Path="/5A585E42/5C88494F" Ref="R407"  Part="1" 
AR Path="/5A9CE314/5C88494F" Ref="R507"  Part="1" 
F 0 "R507" V 4130 5650 50  0000 C CNN
F 1 "3k2" V 4050 5650 50  0000 C CNN
F 2 "SFUSat:R_0402" V 3980 5650 50  0001 C CNN
F 3 "" H 4050 5650 50  0001 C CNN
F 4 "RT0402DRE073K2L" V 4050 5650 60  0001 C CNN "Part Number"
F 5 "311-2283-1-ND" V 4050 5650 60  0001 C CNN "Digi-Key"
F 6 "603-RT0402DRE073K2L" V 4050 5650 60  0001 C CNN "Mouser"
	1    4050 5650
	0    1    1    0   
$EndComp
$Comp
L Device:R R408
U 1 1 5C8849C7
P 4050 5850
AR Path="/5A585E42/5C8849C7" Ref="R408"  Part="1" 
AR Path="/5A9CE314/5C8849C7" Ref="R508"  Part="1" 
F 0 "R508" V 4130 5850 50  0000 C CNN
F 1 "3k2" V 4050 5850 50  0000 C CNN
F 2 "SFUSat:R_0402" V 3980 5850 50  0001 C CNN
F 3 "" H 4050 5850 50  0001 C CNN
F 4 "RT0402DRE073K2L" V 4050 5850 60  0001 C CNN "Part Number"
F 5 "311-2283-1-ND" V 4050 5850 60  0001 C CNN "Digi-Key"
F 6 "603-RT0402DRE073K2L" V 4050 5850 60  0001 C CNN "Mouser"
	1    4050 5850
	0    1    1    0   
$EndComp
$Comp
L Device:R R406
U 1 1 5A58782C
P 3775 6075
AR Path="/5A585E42/5A58782C" Ref="R406"  Part="1" 
AR Path="/5A9CE314/5A58782C" Ref="R506"  Part="1" 
F 0 "R506" V 3855 6075 50  0000 C CNN
F 1 "3k2" V 3775 6075 50  0000 C CNN
F 2 "SFUSat:R_0402" V 3705 6075 50  0001 C CNN
F 3 "" H 3775 6075 50  0001 C CNN
F 4 "RT0402DRE073K2L" V 3775 6075 60  0001 C CNN "Part Number"
F 5 "311-2283-1-ND" V 3775 6075 60  0001 C CNN "Digi-Key"
F 6 "603-RT0402DRE073K2L" V 3775 6075 60  0001 C CNN "Mouser"
	1    3775 6075
	1    0    0    -1  
$EndComp
$EndSCHEMATC
