EESchema Schematic File Version 4
EELAYER 26 0
EELAYER END
$Descr A4 11693 8268
encoding utf-8
Sheet 2 15
Title ""
Date ""
Rev ""
Comp ""
Comment1 ""
Comment2 ""
Comment3 ""
Comment4 ""
$EndDescr
$Comp
L Device:R R7
U 1 1 5A585C57
P 6525 4425
F 0 "R7" V 6450 4425 50  0000 C BNN
F 1 "100" V 6525 4425 50  0000 C CNN
F 2 "SFUSat:R_0402" V 6455 4425 50  0001 C CNN
F 3 "" H 6525 4425 50  0000 C CNN
F 4 "RC0402FR-07100RL" V 6525 4425 60  0001 C CNN "Part Number"
F 5 "311-100LRCT-ND" V 6525 4425 60  0001 C CNN "Digi-Key"
F 6 "603-RC0402FR-07100RL" V 6525 4425 60  0001 C CNN "Mouser"
	1    6525 4425
	0    1    1    0   
$EndComp
$Comp
L Device:C C11
U 1 1 5A585C61
P 7525 4200
F 0 "C11" V 7400 4200 50  0000 C BNN
F 1 "100pF" V 7650 4200 50  0000 C TNN
F 2 "SFUSat:C_0402" H 7563 4050 50  0001 C CNN
F 3 "" H 7525 4200 50  0000 C CNN
F 4 "GRM1555C1H101JA01D" V 7525 4200 60  0001 C CNN "Part Number"
F 5 "490-5922-1-ND" V 7525 4200 60  0001 C CNN "Digi-Key"
F 6 "81-GRM1555C1H101JA1D" V 7525 4200 60  0001 C CNN "Mouser"
	1    7525 4200
	0    1    1    0   
$EndComp
$Comp
L power:GND #PWR034
U 1 1 5A585C68
P 5175 4875
F 0 "#PWR034" H 5175 4625 50  0001 C CNN
F 1 "GND" H 5175 4725 50  0000 C CNN
F 2 "" H 5175 4875 50  0000 C CNN
F 3 "" H 5175 4875 50  0000 C CNN
	1    5175 4875
	1    0    0    -1  
$EndComp
$Comp
L Device:L L3
U 1 1 5A585C71
P 5950 3175
F 0 "L3" H 5925 3175 50  0000 R CNN
F 1 "24nH" H 6000 3175 50  0000 L CNN
F 2 "SFUSat:L_0402" H 5950 3175 50  0001 C CNN
F 3 "" H 5950 3175 50  0000 C CNN
F 4 "0402CS-24NXGLW" H 5950 3175 60  0001 C CNN "Part Number"
F 5 "N/A" H 5950 3175 60  0001 C CNN "Digi-Key"
F 6 "994-0402CS-24NXGLW" H 5950 3175 60  0001 C CNN "Mouser"
	1    5950 3175
	1    0    0    -1  
$EndComp
$Comp
L Device:C C10
U 1 1 5A585C7B
P 6700 3175
F 0 "C10" H 6725 3275 50  0000 L CNN
F 1 "100nF" H 6725 3075 50  0000 L CNN
F 2 "SFUSat:C_0402" H 6738 3025 50  0001 C CNN
F 3 "" H 6700 3175 50  0000 C CNN
F 4 "GRM155R71C104KA88D" H 6700 3175 60  0001 C CNN "Part Number"
F 5 "490-3261-1-ND" H 6700 3175 60  0001 C CNN "Digi-Key"
F 6 "81-GRM155R71C104KA88" H 6700 3175 60  0001 C CNN "Mouser"
	1    6700 3175
	1    0    0    -1  
$EndComp
$Comp
L power:GND #PWR035
U 1 1 5A585C82
P 6700 3450
F 0 "#PWR035" H 6700 3200 50  0001 C CNN
F 1 "GND" H 6700 3300 50  0000 C CNN
F 2 "" H 6700 3450 50  0000 C CNN
F 3 "" H 6700 3450 50  0000 C CNN
	1    6700 3450
	1    0    0    -1  
$EndComp
$Comp
L Device:C C9
U 1 1 5A585C8B
P 6325 3175
F 0 "C9" H 6350 3275 50  0000 L CNN
F 1 "390pF" H 6350 3075 50  0000 L CNN
F 2 "SFUSat:C_0402" H 6363 3025 50  0001 C CNN
F 3 "" H 6325 3175 50  0000 C CNN
F 4 "GRM1555C1H391JA01J" H 6325 3175 60  0001 C CNN "Part Number"
F 5 "490-6236-1-ND" H 6325 3175 60  0001 C CNN "Digi-Key"
F 6 "81-GRM1555C1H391JA1J" H 6325 3175 60  0001 C CNN "Mouser"
	1    6325 3175
	1    0    0    -1  
$EndComp
$Comp
L power:GND #PWR036
U 1 1 5A585C92
P 6325 3450
F 0 "#PWR036" H 6325 3200 50  0001 C CNN
F 1 "GND" H 6325 3300 50  0000 C CNN
F 2 "" H 6325 3450 50  0000 C CNN
F 3 "" H 6325 3450 50  0000 C CNN
	1    6325 3450
	1    0    0    -1  
$EndComp
$Comp
L Device:C C7
U 1 1 5A585C9B
P 4675 3175
F 0 "C7" H 4700 3275 50  0000 L CNN
F 1 "56pF" H 4700 3075 50  0000 L CNN
F 2 "SFUSat:C_0402" H 4713 3025 50  0001 C CNN
F 3 "" H 4675 3175 50  0000 C CNN
F 4 "GRM1555C1H560JA01D" H 4675 3175 60  0001 C CNN "Part Number"
F 5 "490-1288-1-ND" H 4675 3175 60  0001 C CNN "Digi-Key"
F 6 "81-GRM1555C1H560JA1D" H 4675 3175 60  0001 C CNN "Mouser"
	1    4675 3175
	1    0    0    -1  
$EndComp
$Comp
L power:GND #PWR037
U 1 1 5A585CA2
P 4675 3450
F 0 "#PWR037" H 4675 3200 50  0001 C CNN
F 1 "GND" H 4675 3300 50  0000 C CNN
F 2 "" H 4675 3450 50  0000 C CNN
F 3 "" H 4675 3450 50  0000 C CNN
	1    4675 3450
	1    0    0    -1  
$EndComp
$Comp
L Device:C C5
U 1 1 5A585CAB
P 4300 3175
F 0 "C5" H 4325 3275 50  0000 L CNN
F 1 "10nF" H 4325 3075 50  0000 L CNN
F 2 "SFUSat:C_0402" H 4338 3025 50  0001 C CNN
F 3 "" H 4300 3175 50  0000 C CNN
F 4 "GRM155R71E103KA01D" H 4300 3175 60  0001 C CNN "Part Number"
F 5 "490-1312-1-ND" H 4300 3175 60  0001 C CNN "Digi-Key"
F 6 "81-GRM36X103K25" H 4300 3175 60  0001 C CNN "Mouser"
	1    4300 3175
	1    0    0    -1  
$EndComp
$Comp
L power:GND #PWR038
U 1 1 5A585CB2
P 4300 3450
F 0 "#PWR038" H 4300 3200 50  0001 C CNN
F 1 "GND" H 4300 3300 50  0000 C CNN
F 2 "" H 4300 3450 50  0000 C CNN
F 3 "" H 4300 3450 50  0000 C CNN
	1    4300 3450
	1    0    0    -1  
$EndComp
$Comp
L Device:R R6
U 1 1 5A585CBB
P 5175 3175
F 0 "R6" H 5100 3175 50  0000 R CNN
F 1 "1210" V 5175 3175 50  0000 C CNN
F 2 "SFUSat:R_0402" V 5105 3175 50  0001 C CNN
F 3 "" H 5175 3175 50  0000 C CNN
F 4 "RC0402FR-071K21L" H 5175 3175 60  0001 C CNN "Part Number"
F 5 "311-1.21KLRCT-ND" H 5175 3175 60  0001 C CNN "Digi-Key"
F 6 "603-RC0402FR-071K21L" H 5175 3175 60  0001 C CNN "Mouser"
	1    5175 3175
	1    0    0    -1  
$EndComp
Text HLabel 5300 2425 2    60   Input ~ 0
5V0
$Comp
L Device:C C3
U 1 1 5A585CD6
P 3700 3875
F 0 "C3" V 3575 3875 50  0000 C BNN
F 1 "100pF" V 3825 3875 50  0000 C TNN
F 2 "SFUSat:C_0402" H 3738 3725 50  0001 C CNN
F 3 "" H 3700 3875 50  0000 C CNN
F 4 "GRM1555C1H101JA01D" V 3700 3875 60  0001 C CNN "Part Number"
F 5 "490-5922-1-ND" V 3700 3875 60  0001 C CNN "Digi-Key"
F 6 "81-GRM1555C1H101JA1D" V 3700 3875 60  0001 C CNN "Mouser"
	1    3700 3875
	0    1    1    0   
$EndComp
$Comp
L SFUSat:MML09211H U5
U 1 1 5A585CE0
P 5175 4100
F 0 "U5" H 5575 4600 60  0000 R BNN
F 1 "MML09211H" H 5725 3600 60  0000 R TNN
F 2 "SFUSat:8-VFDFN" H 5075 4000 60  0001 C CNN
F 3 "" H 5075 4000 60  0001 C CNN
F 4 "MML09211HT1" H 5175 4100 60  0001 C CNN "Part Number"
F 5 "MML09211HT1CT-ND" H 5175 4100 60  0001 C CNN "Digi-Key"
F 6 "841-MML09211HT1" H 5175 4100 60  0001 C CNN "Mouser"
	1    5175 4100
	1    0    0    -1  
$EndComp
$Comp
L Device:C C6
U 1 1 5A585CEA
P 4350 4825
F 0 "C6" H 4375 4925 50  0000 L CNN
F 1 "10nF" H 4375 4725 50  0000 L CNN
F 2 "SFUSat:C_0402" H 4388 4675 50  0001 C CNN
F 3 "" H 4350 4825 50  0000 C CNN
F 4 "GRM155R71E103KA01D" H 4350 4825 60  0001 C CNN "Part Number"
F 5 "490-1312-1-ND" H 4350 4825 60  0001 C CNN "Digi-Key"
F 6 "81-GRM36X103K25" H 4350 4825 60  0001 C CNN "Mouser"
	1    4350 4825
	1    0    0    -1  
$EndComp
$Comp
L power:GND #PWR039
U 1 1 5A585CF1
P 4350 5100
F 0 "#PWR039" H 4350 4850 50  0001 C CNN
F 1 "GND" H 4350 4950 50  0000 C CNN
F 2 "" H 4350 5100 50  0000 C CNN
F 3 "" H 4350 5100 50  0000 C CNN
	1    4350 5100
	1    0    0    -1  
$EndComp
$Comp
L Device:C C4
U 1 1 5A585CFA
P 3975 4825
F 0 "C4" H 4000 4925 50  0000 L CNN
F 1 "390pF" H 4000 4725 50  0000 L CNN
F 2 "SFUSat:C_0402" H 4013 4675 50  0001 C CNN
F 3 "" H 3975 4825 50  0000 C CNN
F 4 "GRM1555C1H391JA01J" H 3975 4825 60  0001 C CNN "Part Number"
F 5 "490-6236-1-ND" H 3975 4825 60  0001 C CNN "Digi-Key"
F 6 "81-GRM1555C1H391JA1J" H 3975 4825 60  0001 C CNN "Mouser"
	1    3975 4825
	1    0    0    -1  
$EndComp
$Comp
L power:GND #PWR040
U 1 1 5A585D01
P 3975 5100
F 0 "#PWR040" H 3975 4850 50  0001 C CNN
F 1 "GND" H 3975 4950 50  0000 C CNN
F 2 "" H 3975 5100 50  0000 C CNN
F 3 "" H 3975 5100 50  0000 C CNN
	1    3975 5100
	1    0    0    -1  
$EndComp
$Comp
L Device:L L2
U 1 1 5A585D1A
P 4250 3875
F 0 "L2" V 4200 3875 50  0000 C CNN
F 1 "4.3nH" V 4325 3875 50  0000 C CNN
F 2 "SFUSat:L_0402" H 4250 3875 50  0001 C CNN
F 3 "" H 4250 3875 50  0000 C CNN
F 4 "0402CS-4N3XGLW" V 4250 3875 60  0001 C CNN "Part Number"
F 5 "N/A" V 4250 3875 60  0001 C CNN "Digi-Key"
F 6 "994-0402CS-4N3XGLW" V 4250 3875 60  0001 C CNN "Mouser"
	1    4250 3875
	0    1    1    0   
$EndComp
NoConn ~ 4525 4100
$Comp
L Device:R R5
U 1 1 5A585D25
P 5175 2650
F 0 "R5" V 5255 2650 50  0000 C CNN
F 1 "220R" V 5175 2650 50  0000 C CNN
F 2 "SFUSat:C_0603" V 5105 2650 50  0001 C CNN
F 3 "" H 5175 2650 50  0001 C CNN
F 4 "BLM18EG221SN1D" V 5175 2650 60  0001 C CNN "Part Number"
F 5 "490-3992-1-ND" V 5175 2650 60  0001 C CNN "Digi-Key"
F 6 "81-BLM18EG221SN1D" V 5175 2650 60  0001 C CNN "Mouser"
	1    5175 2650
	1    0    0    -1  
$EndComp
Text Notes 5325 2675 0    60   ~ 0
Ferrite bead, 220 Ohm @ 100MHz
$Comp
L Device:L L1
U 1 1 5A585D4B
P 3975 4200
F 0 "L1" H 4025 4275 50  0000 L BNN
F 1 "22nH" H 4025 4125 50  0000 L TNN
F 2 "SFUSat:L_0402" H 3975 4200 50  0001 C CNN
F 3 "" H 3975 4200 50  0000 C CNN
F 4 "0402CS-22NXGLW" H 3975 4200 60  0001 C CNN "Part Number"
F 5 "N/A" H 3975 4200 60  0001 C CNN "Digi-Key"
F 6 "994-0402CS-22NXGLW" H 3975 4200 60  0001 C CNN "Mouser"
	1    3975 4200
	1    0    0    -1  
$EndComp
$Comp
L Device:C C8
U 1 1 5A585D55
P 6100 4425
F 0 "C8" V 5975 4425 50  0000 C BNN
F 1 "56pF" V 6225 4425 50  0000 C TNN
F 2 "SFUSat:C_0402" H 6138 4275 50  0001 C CNN
F 3 "" H 6100 4425 50  0000 C CNN
F 4 "GRM1555C1H560JA01D" V 6100 4425 60  0001 C CNN "Part Number"
F 5 "490-1288-1-ND" V 6100 4425 60  0001 C CNN "Digi-Key"
F 6 "81-GRM1555C1H560JA1D" V 6100 4425 60  0001 C CNN "Mouser"
	1    6100 4425
	0    1    1    0   
$EndComp
Wire Wire Line
	5175 2800 5175 3025
Wire Wire Line
	5175 2425 5175 2500
Wire Wire Line
	5300 2425 5175 2425
Connection ~ 3975 3875
Wire Wire Line
	4400 3875 4525 3875
Wire Wire Line
	3850 3875 4100 3875
Connection ~ 3975 4550
Wire Wire Line
	3975 4050 3975 3875
Wire Wire Line
	3975 4350 3975 4675
Connection ~ 6325 2900
Connection ~ 5950 2900
Connection ~ 4675 2900
Connection ~ 5175 2900
Wire Wire Line
	4300 2900 6700 2900
Wire Wire Line
	3550 3875 3425 3875
Connection ~ 4350 4550
Wire Wire Line
	4525 4550 4525 4200
Wire Wire Line
	3975 4550 4525 4550
Wire Wire Line
	4350 4675 4350 4550
Wire Wire Line
	3975 5100 3975 4975
Wire Wire Line
	4350 5100 4350 4975
Wire Wire Line
	4525 3875 4525 4000
Wire Wire Line
	7675 4200 7925 4200
Wire Wire Line
	5950 2900 5950 3025
Connection ~ 5950 4100
Connection ~ 5950 4200
Wire Wire Line
	5950 3325 5950 4200
Wire Wire Line
	5175 3450 5175 3325
Wire Wire Line
	4300 3025 4300 2900
Wire Wire Line
	4300 3450 4300 3325
Wire Wire Line
	4675 2900 4675 3025
Wire Wire Line
	4675 3450 4675 3325
Wire Wire Line
	6325 2900 6325 3025
Wire Wire Line
	6325 3450 6325 3325
Wire Wire Line
	6700 2900 6700 3025
Wire Wire Line
	6700 3450 6700 3325
Wire Wire Line
	5175 4875 5175 4750
Connection ~ 6800 4200
Wire Wire Line
	5825 4100 5950 4100
Wire Wire Line
	5825 4200 7375 4200
Wire Wire Line
	6800 4425 6800 4200
Wire Wire Line
	6675 4425 6800 4425
Wire Wire Line
	6250 4425 6375 4425
Wire Wire Line
	5950 4300 5950 4425
Wire Wire Line
	5825 4300 5950 4300
Text HLabel 3425 3875 0    60   Input ~ 0
IN
Text HLabel 7925 4200 2    60   Input ~ 0
OUT
$Comp
L SFUSat:SMA J16
U 1 1 5AB879E9
P 7575 3350
F 0 "J16" H 7525 3150 60  0000 C CNN
F 1 "SMA" H 7575 3500 60  0000 C CNN
F 2 "SFUSat:UFL-R-SMT-1-Coaxial-Connector" H 7775 3400 60  0001 C CNN
F 3 "" H 7775 3400 60  0000 C CNN
F 4 "H9161-ND" H 7575 3350 60  0001 C CNN "Digikey"
	1    7575 3350
	0    -1   -1   0   
$EndComp
$Comp
L SFUSat:SINGLE_0402 U6
U 1 1 5AB879F0
P 7525 3900
F 0 "U6" V 7525 3825 60  0000 R CNN
F 1 "SINGLE_0402" H 7525 3800 60  0001 C TNN
F 2 "SFUSat:SINGLE_0402" H 7525 3900 60  0001 C CNN
F 3 "" H 7525 3900 60  0001 C CNN
	1    7525 3900
	0    1    1    0   
$EndComp
$Comp
L power:GND #PWR041
U 1 1 5AB879F7
P 7675 3650
F 0 "#PWR041" H 7675 3400 50  0001 C CNN
F 1 "GND" H 7675 3500 50  0000 C CNN
F 2 "" H 7675 3650 50  0000 C CNN
F 3 "" H 7675 3650 50  0000 C CNN
	1    7675 3650
	1    0    0    -1  
$EndComp
$EndSCHEMATC
