EESchema Schematic File Version 4
LIBS:encoder-pcb-cache
EELAYER 30 0
EELAYER END
$Descr USLetter 11000 8500
encoding utf-8
Sheet 1 1
Title "AEAT-8800-Q24 Breakout Board"
Date "2019-10-06"
Rev "A"
Comp "Olin Quadrupedal Robotics Deveopment"
Comment1 "Designer: Wesley Soo-Hoo"
Comment2 ""
Comment3 ""
Comment4 ""
$EndDescr
$Comp
L Device:C_Small C3
U 1 1 5D9A9634
P 7050 2450
F 0 "C3" H 7200 2500 50  0000 C CNN
F 1 "10uF" H 7250 2400 50  0000 C CNN
F 2 "digikey-footprints:0603" H 7050 2450 50  0001 C CNN
F 3 "~" H 7050 2450 50  0001 C CNN
	1    7050 2450
	1    0    0    -1  
$EndComp
$Comp
L power:+5V #PWR06
U 1 1 5D9AA606
P 8050 2150
F 0 "#PWR06" H 8050 2000 50  0001 C CNN
F 1 "+5V" H 8065 2323 50  0000 C CNN
F 2 "" H 8050 2150 50  0001 C CNN
F 3 "" H 8050 2150 50  0001 C CNN
	1    8050 2150
	1    0    0    -1  
$EndComp
$Comp
L Device:Ferrite_Bead_Small FB1
U 1 1 5D9AB604
P 7700 2300
F 0 "FB1" V 7600 2300 50  0000 C CNN
F 1 "742792651" V 7800 2300 50  0000 C CNN
F 2 "digikey-footprints:0603" V 7630 2300 50  0001 C CNN
F 3 "~" H 7700 2300 50  0001 C CNN
	1    7700 2300
	0    1    1    0   
$EndComp
$Comp
L power:GND #PWR03
U 1 1 5D9AEBE7
P 6100 3250
F 0 "#PWR03" H 6100 3000 50  0001 C CNN
F 1 "GND" H 6105 3077 50  0000 C CNN
F 2 "" H 6100 3250 50  0001 C CNN
F 3 "" H 6100 3250 50  0001 C CNN
	1    6100 3250
	1    0    0    -1  
$EndComp
Wire Wire Line
	6100 3250 6100 3050
Wire Wire Line
	6100 2850 5700 2850
Connection ~ 6100 2950
Wire Wire Line
	6100 2950 6100 2850
Wire Wire Line
	5700 2950 6100 2950
Connection ~ 6100 3050
Wire Wire Line
	6100 3050 6100 2950
$Comp
L Device:C_Small C1
U 1 1 5D9B3846
P 6650 2450
F 0 "C1" H 6800 2500 50  0000 C CNN
F 1 "0.1uF" H 6850 2400 50  0000 C CNN
F 2 "digikey-footprints:0603" H 6650 2450 50  0001 C CNN
F 3 "~" H 6650 2450 50  0001 C CNN
	1    6650 2450
	1    0    0    -1  
$EndComp
$Comp
L power:GND #PWR04
U 1 1 5D9B827B
P 7250 2600
F 0 "#PWR04" H 7250 2350 50  0001 C CNN
F 1 "GND" H 7255 2427 50  0000 C CNN
F 2 "" H 7250 2600 50  0001 C CNN
F 3 "" H 7250 2600 50  0001 C CNN
	1    7250 2600
	1    0    0    -1  
$EndComp
Wire Wire Line
	6650 2550 6650 2600
Wire Wire Line
	7050 2550 7050 2600
Connection ~ 7050 2600
Wire Wire Line
	7050 2600 6650 2600
Wire Wire Line
	6650 2350 6650 2300
Connection ~ 6650 2300
Wire Wire Line
	6650 2300 7050 2300
Wire Wire Line
	7050 2350 7050 2300
Connection ~ 7050 2300
Wire Wire Line
	7050 2300 7450 2300
Wire Wire Line
	8050 2300 8050 2150
Wire Wire Line
	7800 2300 8050 2300
$Comp
L Connector:Conn_01x07_Male J2
U 1 1 5D9D7F14
P 3100 3000
F 0 "J2" H 3200 3400 50  0000 C CNN
F 1 "SPI_UVW_CONN" H 3200 2650 50  0000 C CNN
F 2 "Connector_PinHeader_2.54mm:PinHeader_1x07_P2.54mm_Horizontal" H 3100 3000 50  0001 C CNN
F 3 "~" H 3100 3000 50  0001 C CNN
	1    3100 3000
	1    0    0    -1  
$EndComp
Wire Wire Line
	5700 3050 6100 3050
$Comp
L Connector:Conn_01x05_Male J1
U 1 1 5D9CA659
P 3100 2150
F 0 "J1" H 3200 2450 50  0000 C CNN
F 1 "PWR_QUAD_CONN" H 3200 1900 50  0000 C CNN
F 2 "Connector_PinHeader_2.54mm:PinHeader_1x05_P2.54mm_Horizontal" H 3100 2150 50  0001 C CNN
F 3 "~" H 3100 2150 50  0001 C CNN
	1    3100 2150
	1    0    0    -1  
$EndComp
$Comp
L oqrd-kicad:AEAT-8800-Q24 U1
U 1 1 5D9A51FC
P 5100 2750
F 0 "U1" H 4650 3450 50  0000 C CNN
F 1 "AEAT-8800-Q24" H 5400 2050 50  0000 C CNN
F 2 "Package_DFN_QFN:QFN-24-1EP_5x5mm_P0.65mm_EP3.2x3.2mm" H 5100 2400 50  0001 C CNN
F 3 "" H 5100 2400 50  0001 C CNN
	1    5100 2750
	1    0    0    -1  
$EndComp
$Comp
L power:+5V #PWR01
U 1 1 5D9FE704
P 3800 2250
F 0 "#PWR01" H 3800 2100 50  0001 C CNN
F 1 "+5V" V 3850 2300 50  0000 L CNN
F 2 "" H 3800 2250 50  0001 C CNN
F 3 "" H 3800 2250 50  0001 C CNN
	1    3800 2250
	0    1    1    0   
$EndComp
Wire Wire Line
	3800 2250 3300 2250
$Comp
L power:GND #PWR02
U 1 1 5D9FF25E
P 3800 2350
F 0 "#PWR02" H 3800 2100 50  0001 C CNN
F 1 "GND" H 3805 2177 50  0000 C CNN
F 2 "" H 3800 2350 50  0001 C CNN
F 3 "" H 3800 2350 50  0001 C CNN
	1    3800 2350
	1    0    0    -1  
$EndComp
Wire Wire Line
	3800 2350 3300 2350
Wire Wire Line
	4400 2050 4400 2300
Wire Wire Line
	4400 2300 4500 2300
Wire Wire Line
	3300 2050 4400 2050
Wire Wire Line
	4350 2150 4350 2400
Wire Wire Line
	4350 2400 4500 2400
Wire Wire Line
	3300 2150 4350 2150
Wire Wire Line
	3300 1950 4450 1950
Wire Wire Line
	4450 1950 4450 2200
Wire Wire Line
	4450 2200 4500 2200
Wire Wire Line
	3300 3300 4500 3300
Wire Wire Line
	3300 3200 4500 3200
Wire Wire Line
	3300 3100 4500 3100
Wire Wire Line
	3300 3000 4350 3000
Wire Wire Line
	4350 3000 4350 2900
Wire Wire Line
	4350 2900 4500 2900
Wire Wire Line
	3300 2900 4250 2900
Wire Wire Line
	4250 2900 4250 2800
Wire Wire Line
	4250 2800 4500 2800
Wire Wire Line
	3300 2800 4150 2800
Wire Wire Line
	4150 2800 4150 2700
Wire Wire Line
	4150 2700 4500 2700
Wire Wire Line
	3300 2700 4050 2700
Wire Wire Line
	4050 2700 4050 2600
Wire Wire Line
	4050 2600 4500 2600
Text Label 3350 2700 0    50   ~ 0
SPI_CLK
Text Label 3350 2800 0    50   ~ 0
SPI_DI
Text Label 3350 2900 0    50   ~ 0
SPI_DO
Text Label 3350 3000 0    50   ~ 0
SPI_SEL
Text Label 3350 3100 0    50   ~ 0
U
Text Label 3350 3200 0    50   ~ 0
V
Text Label 3350 3300 0    50   ~ 0
W_PWM
Text Label 3350 1950 0    50   ~ 0
INDEX
Text Label 3350 2050 0    50   ~ 0
INC_A
Text Label 3350 2150 0    50   ~ 0
INC_B
$Comp
L Device:LED D1
U 1 1 5DA127FF
P 8050 2950
F 0 "D1" V 8089 2833 50  0000 R CNN
F 1 "GRN" V 7998 2833 50  0000 R CNN
F 2 "digikey-footprints:LED_0603" H 8050 2950 50  0001 C CNN
F 3 "~" H 8050 2950 50  0001 C CNN
	1    8050 2950
	0    -1   -1   0   
$EndComp
Connection ~ 8050 2300
$Comp
L Device:R_Small R1
U 1 1 5DA1F00B
P 8050 2650
F 0 "R1" V 8125 2650 50  0000 C CNN
F 1 "680" V 8050 2650 50  0000 C CNN
F 2 "digikey-footprints:0603" H 8050 2650 50  0001 C CNN
F 3 "~" H 8050 2650 50  0001 C CNN
	1    8050 2650
	1    0    0    -1  
$EndComp
Wire Wire Line
	8050 2300 8050 2550
Wire Wire Line
	8050 2750 8050 2800
$Comp
L power:GND #PWR07
U 1 1 5DA24DC4
P 8050 3150
F 0 "#PWR07" H 8050 2900 50  0001 C CNN
F 1 "GND" H 8055 2977 50  0000 C CNN
F 2 "" H 8050 3150 50  0001 C CNN
F 3 "" H 8050 3150 50  0001 C CNN
	1    8050 3150
	1    0    0    -1  
$EndComp
Wire Wire Line
	8050 3100 8050 3150
Text Label 5950 2300 0    50   ~ 0
VDD
Wire Wire Line
	5700 2300 6650 2300
Connection ~ 7450 2300
Wire Wire Line
	7450 2300 7600 2300
Wire Wire Line
	7250 2600 7050 2600
$Comp
L Device:C_Small C4
U 1 1 5D9B3CD7
P 7050 3000
F 0 "C4" H 7200 3050 50  0000 C CNN
F 1 "1uF" H 7250 2950 50  0000 C CNN
F 2 "digikey-footprints:0603" H 7050 3000 50  0001 C CNN
F 3 "~" H 7050 3000 50  0001 C CNN
	1    7050 3000
	1    0    0    -1  
$EndComp
Wire Wire Line
	7050 2850 7050 2900
Wire Wire Line
	7450 2300 7450 2850
Wire Wire Line
	7450 2850 7050 2850
Wire Wire Line
	7050 2850 6650 2850
Wire Wire Line
	6650 2850 6650 2900
Connection ~ 7050 2850
Wire Wire Line
	6650 2850 6300 2850
Wire Wire Line
	6300 2850 6300 2400
Wire Wire Line
	6300 2400 5700 2400
Connection ~ 6650 2850
$Comp
L power:GND #PWR05
U 1 1 5DA7523F
P 7250 3150
F 0 "#PWR05" H 7250 2900 50  0001 C CNN
F 1 "GND" H 7255 2977 50  0000 C CNN
F 2 "" H 7250 3150 50  0001 C CNN
F 3 "" H 7250 3150 50  0001 C CNN
	1    7250 3150
	1    0    0    -1  
$EndComp
Wire Wire Line
	7250 3150 7050 3150
Wire Wire Line
	7050 3150 7050 3100
Wire Wire Line
	7050 3150 6650 3150
Wire Wire Line
	6650 3150 6650 3100
Connection ~ 7050 3150
$Comp
L Device:C_Small C2
U 1 1 5DA72477
P 6650 3000
F 0 "C2" H 6800 3050 50  0000 C CNN
F 1 "0.1uF" H 6850 2950 50  0000 C CNN
F 2 "digikey-footprints:0603" H 6650 3000 50  0001 C CNN
F 3 "~" H 6650 3000 50  0001 C CNN
	1    6650 3000
	1    0    0    -1  
$EndComp
$EndSCHEMATC
