(export (version D)
  (design
    (source /home/wsh32/oqrd/encoder-pcb/encoder-pcb/encoder-pcb.sch)
    (date "Sun 13 Oct 2019 12:40:38 PM EDT")
    (tool "Eeschema 5.1.4")
    (sheet (number 1) (name /) (tstamps /)
      (title_block
        (title "AEAT-8800-Q24 Breakout Board")
        (company "Olin Quadrupedal Robotics Deveopment")
        (rev A)
        (date 2019-10-06)
        (source encoder-pcb.sch)
        (comment (number 1) (value "Designer: Wesley Soo-Hoo"))
        (comment (number 2) (value ""))
        (comment (number 3) (value ""))
        (comment (number 4) (value "")))))
  (components
    (comp (ref C3)
      (value 10uF)
      (footprint digikey-footprints:0603)
      (datasheet ~)
      (libsource (lib Device) (part C_Small) (description "Unpolarized capacitor, small symbol"))
      (sheetpath (names /) (tstamps /))
      (tstamp 5D9A9634))
    (comp (ref FB1)
      (value 742792651)
      (footprint digikey-footprints:0603)
      (datasheet ~)
      (libsource (lib Device) (part Ferrite_Bead_Small) (description "Ferrite bead, small symbol"))
      (sheetpath (names /) (tstamps /))
      (tstamp 5D9AB604))
    (comp (ref C1)
      (value 0.1uF)
      (footprint digikey-footprints:0603)
      (datasheet ~)
      (libsource (lib Device) (part C_Small) (description "Unpolarized capacitor, small symbol"))
      (sheetpath (names /) (tstamps /))
      (tstamp 5D9B3846))
    (comp (ref J2)
      (value SPI_UVW_CONN)
      (footprint Connector_PinHeader_2.54mm:PinHeader_1x07_P2.54mm_Horizontal)
      (datasheet ~)
      (libsource (lib Connector) (part Conn_01x07_Male) (description "Generic connector, single row, 01x07, script generated (kicad-library-utils/schlib/autogen/connector/)"))
      (sheetpath (names /) (tstamps /))
      (tstamp 5D9D7F14))
    (comp (ref J1)
      (value PWR_QUAD_CONN)
      (footprint Connector_PinHeader_2.54mm:PinHeader_1x05_P2.54mm_Horizontal)
      (datasheet ~)
      (libsource (lib Connector) (part Conn_01x05_Male) (description "Generic connector, single row, 01x05, script generated (kicad-library-utils/schlib/autogen/connector/)"))
      (sheetpath (names /) (tstamps /))
      (tstamp 5D9CA659))
    (comp (ref U1)
      (value AEAT-8800-Q24)
      (footprint Package_DFN_QFN:QFN-24-1EP_5x5mm_P0.65mm_EP3.2x3.2mm)
      (libsource (lib oqrd-kicad) (part AEAT-8800-Q24) (description ""))
      (sheetpath (names /) (tstamps /))
      (tstamp 5D9A51FC))
    (comp (ref D1)
      (value GRN)
      (footprint digikey-footprints:LED_0603)
      (datasheet ~)
      (libsource (lib Device) (part LED) (description "Light emitting diode"))
      (sheetpath (names /) (tstamps /))
      (tstamp 5DA127FF))
    (comp (ref R1)
      (value 680)
      (footprint digikey-footprints:0603)
      (datasheet ~)
      (libsource (lib Device) (part R_Small) (description "Resistor, small symbol"))
      (sheetpath (names /) (tstamps /))
      (tstamp 5DA1F00B))
    (comp (ref C4)
      (value 1uF)
      (footprint digikey-footprints:0603)
      (datasheet ~)
      (libsource (lib Device) (part C_Small) (description "Unpolarized capacitor, small symbol"))
      (sheetpath (names /) (tstamps /))
      (tstamp 5D9B3CD7))
    (comp (ref C2)
      (value 0.1uF)
      (footprint digikey-footprints:0603)
      (datasheet ~)
      (libsource (lib Device) (part C_Small) (description "Unpolarized capacitor, small symbol"))
      (sheetpath (names /) (tstamps /))
      (tstamp 5DA72477)))
  (libparts
    (libpart (lib Connector) (part Conn_01x05_Male)
      (description "Generic connector, single row, 01x05, script generated (kicad-library-utils/schlib/autogen/connector/)")
      (docs ~)
      (footprints
        (fp Connector*:*_1x??_*))
      (fields
        (field (name Reference) J)
        (field (name Value) Conn_01x05_Male))
      (pins
        (pin (num 1) (name Pin_1) (type passive))
        (pin (num 2) (name Pin_2) (type passive))
        (pin (num 3) (name Pin_3) (type passive))
        (pin (num 4) (name Pin_4) (type passive))
        (pin (num 5) (name Pin_5) (type passive))))
    (libpart (lib Connector) (part Conn_01x07_Male)
      (description "Generic connector, single row, 01x07, script generated (kicad-library-utils/schlib/autogen/connector/)")
      (docs ~)
      (footprints
        (fp Connector*:*_1x??_*))
      (fields
        (field (name Reference) J)
        (field (name Value) Conn_01x07_Male))
      (pins
        (pin (num 1) (name Pin_1) (type passive))
        (pin (num 2) (name Pin_2) (type passive))
        (pin (num 3) (name Pin_3) (type passive))
        (pin (num 4) (name Pin_4) (type passive))
        (pin (num 5) (name Pin_5) (type passive))
        (pin (num 6) (name Pin_6) (type passive))
        (pin (num 7) (name Pin_7) (type passive))))
    (libpart (lib Device) (part C_Small)
      (description "Unpolarized capacitor, small symbol")
      (docs ~)
      (footprints
        (fp C_*))
      (fields
        (field (name Reference) C)
        (field (name Value) C_Small))
      (pins
        (pin (num 1) (name ~) (type passive))
        (pin (num 2) (name ~) (type passive))))
    (libpart (lib Device) (part Ferrite_Bead_Small)
      (description "Ferrite bead, small symbol")
      (docs ~)
      (footprints
        (fp Inductor_*)
        (fp L_*)
        (fp *Ferrite*))
      (fields
        (field (name Reference) FB)
        (field (name Value) Ferrite_Bead_Small))
      (pins
        (pin (num 1) (name ~) (type passive))
        (pin (num 2) (name ~) (type passive))))
    (libpart (lib Device) (part LED)
      (description "Light emitting diode")
      (docs ~)
      (footprints
        (fp LED*)
        (fp LED_SMD:*)
        (fp LED_THT:*))
      (fields
        (field (name Reference) D)
        (field (name Value) LED))
      (pins
        (pin (num 1) (name K) (type passive))
        (pin (num 2) (name A) (type passive))))
    (libpart (lib Device) (part R_Small)
      (description "Resistor, small symbol")
      (docs ~)
      (footprints
        (fp R_*))
      (fields
        (field (name Reference) R)
        (field (name Value) R_Small))
      (pins
        (pin (num 1) (name ~) (type passive))
        (pin (num 2) (name ~) (type passive))))
    (libpart (lib oqrd-kicad) (part AEAT-8800-Q24)
      (fields
        (field (name Reference) U)
        (field (name Value) AEAT-8800-Q24)
        (field (name Footprint) Package_DFN_QFN:QFN-24-1EP_5x5mm_P0.65mm_EP3.2x3.2mm))
      (pins
        (pin (num 7) (name INDEX) (type output))
        (pin (num 8) (name INC_B) (type output))
        (pin (num 9) (name INC_A) (type output))
        (pin (num 10) (name SPI_CLK) (type input))
        (pin (num 11) (name SPI_DI) (type output))
        (pin (num 12) (name SPI_DO) (type output))
        (pin (num 13) (name VSS) (type input))
        (pin (num 14) (name VDDA) (type input))
        (pin (num 19) (name VDDA) (type input))
        (pin (num 20) (name VSS) (type input))
        (pin (num 21) (name SPI_SEL) (type input))
        (pin (num 22) (name U) (type BiDi))
        (pin (num 23) (name V) (type BiDi))
        (pin (num 24) (name W_PWM) (type BiDi))
        (pin (num 25) (name VSS) (type input)))))
  (libraries
    (library (logical Connector)
      (uri /usr/share/kicad/library/Connector.lib))
    (library (logical Device)
      (uri /usr/share/kicad/library/Device.lib))
    (library (logical oqrd-kicad)
      (uri /home/wsh32/oqrd/oqrd-kicad-library/oqrd-kicad.lib)))
  (nets
    (net (code 1) (name /U)
      (node (ref J2) (pin 5))
      (node (ref U1) (pin 22)))
    (net (code 2) (name /SPI_DI)
      (node (ref U1) (pin 11))
      (node (ref J2) (pin 2)))
    (net (code 3) (name /SPI_CLK)
      (node (ref U1) (pin 10))
      (node (ref J2) (pin 1)))
    (net (code 4) (name /SPI_DO)
      (node (ref J2) (pin 3))
      (node (ref U1) (pin 12)))
    (net (code 5) (name /SPI_SEL)
      (node (ref J2) (pin 4))
      (node (ref U1) (pin 21)))
    (net (code 6) (name /V)
      (node (ref U1) (pin 23))
      (node (ref J2) (pin 6)))
    (net (code 7) (name /W_PWM)
      (node (ref J2) (pin 7))
      (node (ref U1) (pin 24)))
    (net (code 8) (name /INDEX)
      (node (ref J1) (pin 1))
      (node (ref U1) (pin 7)))
    (net (code 9) (name /INC_A)
      (node (ref U1) (pin 9))
      (node (ref J1) (pin 2)))
    (net (code 10) (name /INC_B)
      (node (ref U1) (pin 8))
      (node (ref J1) (pin 3)))
    (net (code 11) (name GND)
      (node (ref U1) (pin 25))
      (node (ref C3) (pin 2))
      (node (ref C1) (pin 2))
      (node (ref J1) (pin 5))
      (node (ref C2) (pin 2))
      (node (ref D1) (pin 1))
      (node (ref U1) (pin 13))
      (node (ref C4) (pin 2))
      (node (ref U1) (pin 20)))
    (net (code 12) (name +5V)
      (node (ref J1) (pin 4))
      (node (ref FB1) (pin 1))
      (node (ref R1) (pin 1)))
    (net (code 13) (name "Net-(D1-Pad2)")
      (node (ref D1) (pin 2))
      (node (ref R1) (pin 2)))
    (net (code 14) (name /VDD)
      (node (ref U1) (pin 14))
      (node (ref C2) (pin 1))
      (node (ref FB1) (pin 2))
      (node (ref U1) (pin 19))
      (node (ref C3) (pin 1))
      (node (ref C4) (pin 1))
      (node (ref C1) (pin 1)))))