{
	"type": "random",
	"responses": [
		"sup bitch",
		"hey girly x",
		"hey man x",
		"heyyy",
		"hiii",
		"fuck off",
		"wot",
		"yes?",
		"...",
		"",
		"hey bro",
		"hey sis",
		"who's emma?",
		"dont talk to me until ive had my coffee",
		"dont speak to me until ive had my bubble tea",
		"what is it",
		"NO",
		"go away"
	]
}
