{
	"type": "random",
	"responses": [
		"goodnight",
		"gn",
		"night night",
		"nighty night",
		"sleepy time already",
		"goodnight have sweet dreams okie",
		"i hope you dream about pain",
		"night",
		"goodnight x",
		"goodnight xx",
		"sweet dreams",
		"BRUH JUST GO TO SLEEP ALREADY",
		"finally, we can have some fun in this chat",
		"thank god",
		"i've been waiting for you to go to sleep",
		"fuck you",
		"",
		"",
		"",
		"",
		""
	]
}
