[gd_scene load_steps=4 format=3 uid="uid://dybjjiafd7ee"]

[ext_resource type="Script" path="res://Scenes/ChunkExplorer.gd" id="1_us6br"]
[ext_resource type="PackedScene" uid="uid://bpkeyy2e7sy64" path="res://Scenes/chunk.tscn" id="2_r3hjw"]

[sub_resource type="FastNoiseLite" id="FastNoiseLite_jt5lc"]
noise_type = 5
frequency = 0.001
offset = Vector3(8.92949e+06, 0, 0)
fractal_type = 2
fractal_octaves = 6

[node name="ChunkExplorer" type="Node3D"]
script = ExtResource("1_us6br")
chunk_size = 320
chunk_divides = 80
chunk_amplitude = 200.0
chunk_elevation = 0.03
chunk_easing = -3.14

[node name="Chunk" parent="." instance=ExtResource("2_r3hjw")]
unique_name_in_owner = true
transform = Transform3D(1, 0, 0, 0, 1, 0, 0, 0, 1, 0, -497.887, 0)
live = true
lod = -69
map_offset = Vector3(0, 0, -0.84)
height_map = SubResource("FastNoiseLite_jt5lc")
