[gd_scene load_steps=3 format=3 uid="uid://bpkeyy2e7sy64"]

[ext_resource type="Script" path="res://Scenes/chunk.gd" id="1_tg0k7"]

[sub_resource type="FastNoiseLite" id="FastNoiseLite_woakv"]
frequency = 0.002
offset = Vector3(-54.7, 0, -115.6)

[node name="Chunk" type="Node3D"]
script = ExtResource("1_tg0k7")
size = 320
divides = 320
lods = PackedInt32Array(1, 2, 4, 8, 16, 32)
lod = 0
elevation = 0.03
amplitude = 200.0
easing = -3.14
map_offset = Vector3(398.1, 0, -931.75)
height_map = SubResource("FastNoiseLite_woakv")
