[gd_scene load_steps=2 format=3 uid="uid://bvpxv08saxxvp"]

[ext_resource type="Script" path="res://Scenes/player.gd" id="1_73hr8"]

[node name="mainCamera" type="Camera2D"]
visible = false
script = ExtResource("1_73hr8")

[connection signal="positionChanged" from="." to="." method="_on_position_changed"]
