^A:\@-OC_2018\MOOC-DIVERS\CODER-EN-C++\TP-CALCULATRICE\MACALCULETTE\MACALCULETTE\STDAFX.CPP
/c /ZI /nologo /W3 /WX- /diagnostics:classic /sdl /Od /Oy- /D WIN32 /D _DEBUG /D _CONSOLE /D _UNICODE /D UNICODE /Gm- /EHsc /RTC1 /MDd /GS /fp:precise /permissive- /Zc:wchar_t /Zc:forScope /Zc:inline /Yc"stdafx.h" /Fp"DEBUG\MACALCULETTE.PCH" /Fo"DEBUG\\" /Fd"DEBUG\VC141.PDB" /Gd /TP /analyze- /FC A:\@-OC_2018\MOOC-DIVERS\CODER-EN-C++\TP-CALCULATRICE\MACALCULETTE\MACALCULETTE\STDAFX.CPP
^A:\@-OC_2018\MOOC-DIVERS\CODER-EN-C++\TP-CALCULATRICE\MACALCULETTE\MACALCULETTE\MACALCULETTE.CPP
/c /ZI /nologo /W3 /WX- /diagnostics:classic /sdl /Od /Oy- /D WIN32 /D _DEBUG /D _CONSOLE /D _UNICODE /D UNICODE /Gm- /EHsc /RTC1 /MDd /GS /fp:precise /permissive- /Zc:wchar_t /Zc:forScope /Zc:inline /Yu"stdafx.h" /Fp"DEBUG\MACALCULETTE.PCH" /Fo"DEBUG\\" /Fd"DEBUG\VC141.PDB" /Gd /TP /analyze- /FC A:\@-OC_2018\MOOC-DIVERS\CODER-EN-C++\TP-CALCULATRICE\MACALCULETTE\MACALCULETTE\MACALCULETTE.CPP
