Untransfected;41;44;37
sv40;18291;11846;9654
CMV;4100;3396;2223
elovl5b;955;952;127
SsalEle0180;8746;9829;4676
SsalEle0351;4662;1576;4133
SsalEle0401;5967;5511;1762
SsalEle0709;3751;2308;5403
