sample,fastq_1,fastq_2,replicate
A,A1_S1_R1_001.fastq.gz,A1_S1_R2_001.fastq.gz,1
A,A2_S2_R1_001.fastq.gz,A2_S2_R2_001.fastq.gz,2
B,B1_S3_R1_001.fastq.gz,B1_S3_R2_001.fastq.gz,1
B,B2_S4_R1_001.fastq.gz,B2_S4_R2_001.fastq.gz,2
C,C1_S5_R1_001.fastq.gz,C1_S5_R2_001.fastq.gz,1
C,C2_S6_R1_001.fastq.gz,C2_S6_R2_001.fastq.gz,2
D,D1_S7_R1_001.fastq.gz,D1_S7_R2_001.fastq.gz,1
D,D2_S8_R1_001.fastq.gz,D2_S8_R2_001.fastq.gz,2
JG,1-JGE1_S1_R1_001.fastq.gz,1-JGE1_S1_R2_001.fastq.gz,1