<svg width="24" height="24" viewBox="0 0 24 24" fill="none" xmlns="http://www.w3.org/2000/svg">
<rect y="11" width="24" height="2" rx="1" fill="#373737"/>
<rect x="11" y="24" width="24" height="2" rx="1" transform="rotate(-90 11 24)" fill="#373737"/>
</svg>
