{
    "inputs": [ "services/web-cluster/policy/main.cf" ],
    "classes": {
        "services_autorun": [ "any::" ],
        "cfengine_internal_masterfiles_update": [ "!any::" ],
        "mpf_augments_control_enabled": [ "any::" ]
    },
    "vars": {
        "acl": [ "0.0.0.0/0" ],
        "backend_webserver": {
            "user": "stwebserver",
            "port": "8080"
        },
        "load_balancer": {
            "frontend_main_port": "80",
            "stats_port": "8080"
        }
    }
}
