<svg xmlns="http://www.w3.org/2000/svg" width="42.144" height="47.789" viewBox="0 0 42.144 47.789">
  <g id="Group_2" data-name="Group 2" transform="translate(0 0.003)">
    <path id="Path_13" data-name="Path 13" d="M0,34.428V13.357a2.823,2.823,0,0,1,1.412-2.445L19.661.375a2.824,2.824,0,0,1,2.823,0L40.732,10.912a2.823,2.823,0,0,1,1.412,2.445V34.428a2.822,2.822,0,0,1-1.412,2.445L22.483,47.409a2.824,2.824,0,0,1-2.823,0L1.412,36.873A2.822,2.822,0,0,1,0,34.428" fill="#f26529"/>
    <path id="Path_14" data-name="Path 14" d="M181.87,98.773a1.042,1.042,0,0,1,1.138-1.113c.663,0,1.105.366,1.105.951v1.182h-.553V98.611a.491.491,0,0,0-.543-.526c-.4,0-.595.272-.595.68a.538.538,0,0,0,.518.6h.229v.425H182.8a.934.934,0,0,1-.934-1.02m.85,1.761v-.095h-.238v-.349h.688v.366c0,.118.068.179.2.179s.195-.059.195-.179v-.366h.467v.358c0,.357-.229.536-.671.536-.416,0-.637-.153-.637-.45m1.853-2.653c0-.45-.153-.663-.526-.7V96.8h1.708v.416h-.9c.213.1.272.3.272.663v1.487h.322v.425h-.875Zm1.062.909c0-.086.008-.162.008-.2H186.8v.374h-.62a.47.47,0,0,0,.536.442c.366,0,.587-.212.587-.654a.627.627,0,0,0-.7-.663,1.607,1.607,0,0,0-.858.263v-.459a1.88,1.88,0,0,1,.917-.229,1.419,1.419,0,0,1,.663.153.726.726,0,0,1,.578-.289h.1v.536H187.6a.934.934,0,0,1,.263.68,1.017,1.017,0,0,1-1.13,1.088.973.973,0,0,1-1.095-1.037m3.212.6v.4h-.536V97.7h.553v1.165a.469.469,0,0,0,.484.518.464.464,0,0,0,.476-.518V97.7h.553v1.266c0,.561-.263.858-.74.858a.872.872,0,0,1-.791-.433" transform="translate(-157.938 -84.064)" fill="#fff"/>
    <path id="Path_15" data-name="Path 15" d="M43.05,115.956h2.224v2.369h4.563v5.546H47.613v-3.64h-2.34v3.64H43.05Zm3.669-12.306h5.257c4.563,0,7.569,2.658,7.539,6.673-.029,3.928-3.033,6.557-7.539,6.557H46.719Zm5.257,10.37c2.455,0,4.073-1.474,4.073-3.7a3.737,3.737,0,0,0-4.073-3.784H50.1v7.482Zm-1.387,7.135a3.039,3.039,0,0,1,3.062-3.033,3.019,3.019,0,1,1-3.062,3.033m4.188,0a1.11,1.11,0,0,0-1.126-1.126,1.128,1.128,0,0,0,0,2.253,1.108,1.108,0,0,0,1.126-1.126m2.716-2.744h2.224v1.04c.549-1.011,1.011-1.271,1.849-1.271a1.5,1.5,0,0,1,1.588,1.155,2.195,2.195,0,0,1,1.994-1.155,1.563,1.563,0,0,1,1.646,1.791v3.9H64.6v-3.207a.665.665,0,1,0-1.329,0v3.207H61.017v-3.207a.61.61,0,0,0-.636-.693.645.645,0,0,0-.665.693v3.207H57.493v-5.46Zm3.178-10.774h9.851v9.244H60.671Zm6.615,2.83H63.876v3.553h3.409Zm.317,10.688a2.927,2.927,0,0,1,3.149-3.091,2.873,2.873,0,0,1,3.033,2.975,4.887,4.887,0,0,1-.029.636h-4.1c.2.491.838.982,2.08.982a5.175,5.175,0,0,0,1.733-.317v1.329a6.642,6.642,0,0,1-2.369.433c-2.109,0-3.5-1.154-3.5-2.946m4.188-.462a1.1,1.1,0,0,0-2.195,0Z" transform="translate(-37.385 -90.013)" fill="#fff"/>
  </g>
</svg>
