{
  "data": [
    {
      "id": 1,
      "name": "เชอร่า",
      "slug": "cherra"
    },
    {
      "id": 2,
      "name": "ไดกิน",
      "slug": "daikin"
    },
    {
      "id": 3,
      "name": "Hitashi",
      "slug": "Hitashi"
    },
    {
      "id": 4,
      "name": "Haier",
      "slug": "Haier"
    },
    {
      "id": 5,
      "name": "LG",
      "slug": "LG"
    },
    {
      "id": 6,
      "name": "Zinsano",
      "slug": "Zinsano"
    },
    {
      "id": 7,
      "name": "WellPro",
      "slug": "wellpro"
    },
    {
      "id": 8,
      "name": "Samsung",
      "slug": "Samsung"
    },
    {
      "id": 9,
      "name": "Nash",
      "slug": "nash"
    },
    {
      "id": 10,
      "name": "Mazuma",
      "slug": "mazuma"
    }
  ]
}
