{
	"__ver": "devops:2",
	"_id": "81c_RQOyQByvrzJjqHdKiw",
	"applies_to": "server",
	"business_object": {
		"_disp": "GitlabProject",
		"_id": "zhdLrhgiRFayf-X3uUdm4Q"
	},
	"is_static": false,
	"name": "getLabels",
	"use_injection": true
}