{
	"__ver": "devops:2",
	"_id": "CCGenVqySN2IHxv0GMOcjA",
	"doc": "Target for gitlab webhook on \"Issues events\" \nSyncs issue's milestone when MS_XXX labels change",
	"path": "/webhooks/gitlab/syncIssueMilestones",
	"rolespec": [
		"YzQ5MqmuSLmOaNZSh6o9pw"
	]
}