{
	"__ver": "devops:3",
	"_id": "tG9ntMz2Sd-gl5z9QvAE8A",
	"applies_to": "server",
	"business_object": {
		"_disp": "GitlabProject",
		"_id": "zhdLrhgiRFayf-X3uUdm4Q"
	},
	"doc": "@param iss issue object returned from api\n@param labels array of labels -",
	"is_static": false,
	"name": "setIssueLabels",
	"use_injection": true
}