{
	"__ver": "devops:3",
	"_id": "6koEjhFsTj2QZtL05gaQeA",
	"applies_to": "server",
	"business_object": {
		"_disp": "GitlabProject",
		"_id": "zhdLrhgiRFayf-X3uUdm4Q"
	},
	"doc": "@param ms milestone  (object returned from gitlab api)\n@param issueStatus status of issues; default \"opened\"",
	"is_static": false,
	"name": "getMilestoneIssues",
	"use_injection": true
}