{
	"__ver": "devops:3",
	"_id": "Pl_LC5vXTJO-BoK48DPM1A",
	"applies_to": "server",
	"business_object": {
		"_disp": "GitlabProject",
		"_id": "zhdLrhgiRFayf-X3uUdm4Q"
	},
	"is_static": false,
	"name": "getNextActiveMilestone",
	"use_injection": false
}