{
	"__ver": "devops:1",
	"_id": "nuGHN_jJQOuVW3vvU_opjg",
	"applies_to": "server",
	"business_object": {
		"_disp": "GitlabProject",
		"_id": "zhdLrhgiRFayf-X3uUdm4Q"
	},
	"doc": "@param ms keys: title, due_date, start_date",
	"is_static": false,
	"name": "createMilestone",
	"use_injection": true
}