{
    "type": "crafting_shapeless",
    "ingredients": [
        {
            "item": "mysticalagriculture:netherite_essence"
        },
        {
            "item": "mysticalagriculture:netherite_essence"
        }
    ],
    "result": {
        "item": "minecraft:netherite_scrap"
    }
}
