{
    "type": "immersiveengineering:cloche",
    "results": [
        {
            "item": "mysticalagriculture:mystical_essence",
            "count": 3
        },
        {
            "item": "mysticalagriculture:mystical_seeds",
            "count": 1
        }
    ],
    "input": {
        "item": "mysticalagriculture:mystical_seeds"
    },
    "soil": [
        {
            "item": "mysticalagriculture:prudentium_farmland"
        },
        {
            "item": "mysticalagriculture:tertium_farmland"
        },
        {
            "item": "mysticalagriculture:imperium_farmland"
        },
        {
            "item": "mysticalagriculture:supremium_farmland"
        },
        {
            "item": "mysticalagradditions:insanium_farmland"
        }
    ],
    "time": 1200,
    "render": {
        "type": "crop",
        "block": "mysticalagriculture:mystical_crop"
    }
}
