{
    "type": "minecraft:crafting_shapeless",
    "ingredients": [
        {
            "tag": "forge:tool_cuttingboard"
        },
        {
            "item": "pamhc2foodcore:basicfishsandwichitem"
        },
        {
            "tag": "forge:leafyvegetables"
        }
    ],
    "result": {
        "item": "pamhc2foodextended:leafyfishsandwichitem",
        "count": 1
    }
}
