{
    "type": "immersiveengineering:cloche",
    "results": [
        {
            "item": "mysticalagriculture:inferium_essence",
            "count": 1
        },
        {
            "item": "mysticalagriculture:inferium_seeds",
            "count": 1
        }
    ],
    "input": {
        "item": "mysticalagriculture:inferium_seeds"
    },
    "soil": {
        "item": "mysticalagriculture:inferium_farmland"
    },
    "time": 1200,
    "render": {
        "type": "crop",
        "block": "mysticalagriculture:inferium_crop"
    }
}
