module gitlab.com/Noob-Tech/codebase/grpc-examples/go/server

go 1.17

require (
	github.com/alfarih31/nb-go-env v1.0.3
	github.com/alfarih31/nb-go-parser v1.0.8
	google.golang.org/grpc v1.44.0
	google.golang.org/protobuf v1.27.1
)

require (
	github.com/golang/protobuf v1.5.0 // indirect
	github.com/joho/godotenv v1.4.0 // indirect
	golang.org/x/net v0.0.0-20200822124328-c89045814202 // indirect
	golang.org/x/sys v0.0.0-20200323222414-85ca7c5b95cd // indirect
	golang.org/x/text v0.3.0 // indirect
	google.golang.org/genproto v0.0.0-20200526211855-cb27e3aa2013 // indirect
)
