{
  "AppSyncApiName": "livechat",
  "DynamoDBBillingMode": "PAY_PER_REQUEST",
  "DynamoDBEnableServerSideEncryption": false,
  "AuthCognitoUserPoolId": {
    "Fn::GetAtt": [
      "authlivechat8de236dd",
      "Outputs.UserPoolId"
    ]
  }
}