Added Component: Designator=P?(HDR1X4)
Add component. Clean all parameters for all variants
Add component (AddParameter): Name = "LatestRevisionDate"; Value = "17-Jul-2002"; VariantName = "[No Variations]"
Add component (AddParameter): Name = "LatestRevisionNote"; Value = "Re-released for DXP Platform."; VariantName = "[No Variations]"
Add component (AddParameter): Name = "Publisher"; Value = "Altium Limited"; VariantName = "[No Variations]"
Added Pin To Net: NetName=Exp0 Pin=U1-10
Added Net: Name=Exp0
Added Pin To Net: NetName=Exp1 Pin=U1-11
Added Net: Name=Exp1
Added Member To Class: ClassName=Controller Member=Component P? Header 4
