M48
;Layer_Color=9474304
;FILE_FORMAT=2:5
INCH,LZ
;TYPE=PLATED
T1F00S00C0.01181
T2F00S00C0.03150
%
T01
X0136639Y0008752
X0145176Y0008682
X0137323Y0033937
X0131417Y0036103
X0153543Y0049882
X0155708Y0055788
X0153543Y007
X0155708Y0075906
X0153543Y0090118
X0155708Y0096024
X0115787Y0033937
X0109882Y0036103
X0094252Y0033937
X0088346Y0036103
X0072716Y0033937
X0066811Y0036103
X0051181Y0033937
X0045275Y0036103
X0029645Y0033937
X002374Y0036103
X0009173Y0037845
X0004921Y0049488
X0007087Y0055394
X0011337Y005319
X0004921Y0069606
X0007087Y0075512
X0004921Y0089724
X0007087Y009563
X0004921Y0109843
X0007087Y0115748
X0004921Y0129961
X0007087Y0135866
X0004921Y0150079
X0007087Y0155984
X0025152Y0164375
X002374Y0168898
X0029645Y0166733
X0037195Y0164278
X0045275Y0168898
X0051181Y0166733
X0066811Y0168898
X0072716Y0166733
X0088346Y0168898
X0094252Y0166733
X0109882Y0168898
X0115787Y0166733
X0004921Y0180394
X0007087Y0186299
X0004921Y0200512
X0007087Y0206417
X0004921Y022063
X0007087Y0226536
X0004921Y0240748
X0007087Y0246654
X0004921Y0260866
X0153543Y0261299
X0155708Y0247087
X0153543Y0241181
X0155708Y0226969
X0153543Y0221063
X0155708Y0206851
X0153543Y0200945
X0155708Y0186732
X0153543Y0180827
X0156752Y0173557
X0155708Y0156378
X0153543Y0150473
X0149264Y0152269
X0147019Y0163537
X0137323Y0166733
X0131417Y0168898
X0133444Y0173557
X0155708Y013626
X0153543Y0130354
X0155708Y0116142
X0153543Y0110236
X0155708Y0267205
X0153543Y0281417
X0155708Y0287323
X0136929Y030067
X0131023Y0302835
X0115393Y030067
X0109488Y0302835
X0093858Y030067
X0087953Y0302835
X0072323Y030067
X0066417Y0302835
X0050787Y030067
X0044882Y0302835
X0029252Y030067
X0023346Y0302835
X0007087Y028689
X0004921Y0280984
X0007087Y0266772
T02
X0140743Y0011657
X0021834Y0010317
M30
