G04*
G04 #@! TF.GenerationSoftware,Altium Limited,Altium Designer,19.0.10 (269)*
G04*
G04 Layer_Physical_Order=1*
G04 Layer_Color=255*
%FSLAX25Y25*%
%MOIN*%
G70*
G01*
G75*
%ADD11C,0.01000*%
%ADD16R,0.03347X0.02362*%
%ADD17R,0.02362X0.03347*%
%ADD18R,0.07087X0.10236*%
%ADD19R,0.02362X0.08661*%
%ADD20C,0.00500*%
%ADD21C,0.01968*%
%ADD22C,0.02953*%
%ADD23C,0.02362*%
%ADD24C,0.03937*%
G36*
X144457Y307704D02*
X145990Y307503D01*
X147499Y307168D01*
X148972Y306703D01*
X150400Y306112D01*
X151771Y305398D01*
X153075Y304567D01*
X154301Y303627D01*
X155440Y302582D01*
X156484Y301443D01*
X157425Y300217D01*
X158256Y298913D01*
X158969Y297543D01*
X159561Y296115D01*
X160026Y294641D01*
X160361Y293132D01*
X160562Y291600D01*
X160630Y290056D01*
Y-21838D01*
X-0D01*
Y290056D01*
X68Y291600D01*
X270Y293132D01*
X604Y294641D01*
X1069Y296115D01*
X1660Y297543D01*
X2374Y298913D01*
X3204Y300217D01*
X4146Y301443D01*
X5190Y302582D01*
X6329Y303627D01*
X7555Y304567D01*
X8859Y305398D01*
X10229Y306112D01*
X11657Y306703D01*
X13131Y307168D01*
X14640Y307503D01*
X16172Y307704D01*
X17717Y307772D01*
X142913D01*
X144457Y307704D01*
D02*
G37*
%LPC*%
G36*
X142508Y306681D02*
X138161D01*
Y303319D01*
X142508D01*
Y306681D01*
D02*
G37*
G36*
X142608Y302451D02*
X141084D01*
Y301419D01*
X142608D01*
Y302451D01*
D02*
G37*
G36*
X130185Y306681D02*
X125838D01*
Y303319D01*
X129012D01*
X129329Y302933D01*
X129309Y302835D01*
X129329Y302737D01*
X129012Y302351D01*
X125838D01*
Y299268D01*
X124026D01*
X123375Y299919D01*
Y301188D01*
X123375Y301188D01*
X123317Y301481D01*
X123151Y301729D01*
X120972Y303908D01*
Y306681D01*
X116626D01*
Y303319D01*
X119399D01*
X119805Y302912D01*
X119614Y302451D01*
X119549D01*
Y300670D01*
Y298888D01*
X121072D01*
Y300905D01*
X121527Y301102D01*
X121846Y300842D01*
Y299602D01*
X121904Y299309D01*
X122070Y299061D01*
X123169Y297963D01*
X123169Y297963D01*
X123417Y297797D01*
X123709Y297739D01*
X123709Y297739D01*
X125838D01*
Y297104D01*
X120972D01*
Y298020D01*
X116626D01*
Y297104D01*
X114804D01*
X112863Y299044D01*
X112615Y299210D01*
X112323Y299268D01*
X109538D01*
X109454Y299369D01*
X109422Y299949D01*
X110209Y300736D01*
X110430Y301067D01*
X110508Y301457D01*
Y301494D01*
X110700Y301623D01*
X111072Y302179D01*
X111202Y302835D01*
X111072Y303491D01*
X110700Y304047D01*
X110508Y304175D01*
Y304410D01*
X110430Y304800D01*
X110209Y305131D01*
X109618Y305721D01*
X109288Y305942D01*
X108897Y306020D01*
X108649D01*
Y306681D01*
X104303D01*
Y303319D01*
X107476D01*
X107793Y302933D01*
X107774Y302835D01*
X107793Y302737D01*
X107476Y302351D01*
X104303D01*
Y299268D01*
X102490D01*
X101840Y299919D01*
Y301188D01*
X101840Y301188D01*
X101782Y301481D01*
X101616Y301729D01*
X99437Y303908D01*
Y306681D01*
X95090D01*
Y303319D01*
X97863D01*
X98270Y302912D01*
X98078Y302451D01*
X98014D01*
Y300670D01*
Y298888D01*
X99537D01*
Y300905D01*
X99991Y301102D01*
X100311Y300842D01*
Y299602D01*
X100369Y299309D01*
X100534Y299061D01*
X101633Y297963D01*
X101633Y297963D01*
X101881Y297797D01*
X102174Y297739D01*
X102174Y297739D01*
X104303D01*
Y297104D01*
X99437D01*
Y298020D01*
X95090D01*
Y297104D01*
X93268D01*
X91328Y299044D01*
X91080Y299210D01*
X90787Y299268D01*
X88002D01*
X87919Y299369D01*
X87886Y299949D01*
X88674Y300736D01*
X88894Y301067D01*
X88972Y301457D01*
Y301494D01*
X89165Y301623D01*
X89536Y302179D01*
X89667Y302835D01*
X89536Y303491D01*
X89165Y304047D01*
X88972Y304175D01*
Y304410D01*
X88894Y304800D01*
X88674Y305131D01*
X88083Y305721D01*
X87752Y305942D01*
X87362Y306020D01*
X87114D01*
Y306681D01*
X82767D01*
Y303319D01*
X85941D01*
X86258Y302933D01*
X86238Y302835D01*
X86258Y302737D01*
X85941Y302351D01*
X82767D01*
Y299268D01*
X80955D01*
X80304Y299919D01*
Y301188D01*
X80304Y301188D01*
X80246Y301481D01*
X80080Y301729D01*
X77901Y303908D01*
Y306681D01*
X73555D01*
Y303319D01*
X76328D01*
X76734Y302912D01*
X76543Y302451D01*
X76478D01*
Y300670D01*
Y298888D01*
X78001D01*
Y300905D01*
X78456Y301102D01*
X78775Y300842D01*
Y299602D01*
X78833Y299309D01*
X78999Y299061D01*
X80098Y297963D01*
X80098Y297963D01*
X80346Y297797D01*
X80638Y297739D01*
X80638Y297739D01*
X82767D01*
Y297104D01*
X77901D01*
Y298020D01*
X73555D01*
Y297104D01*
X71733D01*
X69792Y299044D01*
X69544Y299210D01*
X69252Y299268D01*
X66467D01*
X66383Y299369D01*
X66351Y299949D01*
X67138Y300736D01*
X67359Y301067D01*
X67437Y301457D01*
Y301494D01*
X67629Y301623D01*
X68001Y302179D01*
X68131Y302835D01*
X68001Y303491D01*
X67629Y304047D01*
X67437Y304175D01*
Y304410D01*
X67359Y304800D01*
X67138Y305131D01*
X66548Y305721D01*
X66217Y305942D01*
X65826Y306020D01*
X65579D01*
Y306681D01*
X61232D01*
Y303319D01*
X64405D01*
X64723Y302933D01*
X64703Y302835D01*
X64723Y302737D01*
X64405Y302351D01*
X61232D01*
Y299268D01*
X59420D01*
X58769Y299919D01*
Y301188D01*
X58769Y301188D01*
X58711Y301481D01*
X58545Y301729D01*
X56366Y303908D01*
Y306681D01*
X52019D01*
Y303319D01*
X54792D01*
X55199Y302912D01*
X55008Y302451D01*
X54943D01*
Y300670D01*
Y298888D01*
X56466D01*
Y300905D01*
X56920Y301102D01*
X57240Y300842D01*
Y299602D01*
X57298Y299309D01*
X57464Y299061D01*
X58562Y297963D01*
X58562Y297963D01*
X58810Y297797D01*
X59103Y297739D01*
X59103Y297739D01*
X61232D01*
Y297104D01*
X56366D01*
Y298020D01*
X52019D01*
Y297104D01*
X50198D01*
X48257Y299044D01*
X48009Y299210D01*
X47716Y299268D01*
X44931D01*
X44848Y299369D01*
X44815Y299949D01*
X45603Y300736D01*
X45824Y301067D01*
X45901Y301457D01*
Y301494D01*
X46094Y301623D01*
X46465Y302179D01*
X46596Y302835D01*
X46465Y303491D01*
X46094Y304047D01*
X45901Y304175D01*
Y304410D01*
X45824Y304800D01*
X45603Y305131D01*
X45012Y305721D01*
X44681Y305942D01*
X44291Y306020D01*
X44043D01*
Y306681D01*
X39697D01*
Y303319D01*
X42870D01*
X43187Y302933D01*
X43168Y302835D01*
X43187Y302737D01*
X42870Y302351D01*
X39697D01*
Y299268D01*
X37884D01*
X37234Y299919D01*
Y301188D01*
X37234Y301188D01*
X37176Y301481D01*
X37010Y301729D01*
X34830Y303908D01*
Y306681D01*
X30484D01*
Y303319D01*
X33257D01*
X33664Y302912D01*
X33472Y302451D01*
X33407D01*
Y300670D01*
Y298888D01*
X34931D01*
Y300906D01*
X35385Y301102D01*
X35704Y300842D01*
Y299602D01*
X35763Y299309D01*
X35928Y299061D01*
X37027Y297963D01*
X37027Y297963D01*
X37275Y297797D01*
X37568Y297739D01*
X37568Y297739D01*
X39697D01*
Y297104D01*
X34830D01*
Y298020D01*
X30484D01*
Y297104D01*
X29563D01*
X27627Y299039D01*
X27379Y299205D01*
X27087Y299263D01*
X23361D01*
X23291Y299354D01*
X23280Y299949D01*
X24067Y300736D01*
X24288Y301067D01*
X24366Y301457D01*
Y301494D01*
X24558Y301623D01*
X24930Y302179D01*
X25060Y302835D01*
X24930Y303491D01*
X24558Y304047D01*
X24366Y304175D01*
Y304410D01*
X24288Y304800D01*
X24067Y305131D01*
X23477Y305721D01*
X23146Y305942D01*
X22756Y306020D01*
X22508D01*
Y306681D01*
X18161D01*
Y303319D01*
X21334D01*
X21652Y302933D01*
X21632Y302835D01*
X21652Y302737D01*
X21334Y302351D01*
X18161D01*
Y299263D01*
X8789D01*
X8789Y299263D01*
X8497Y299205D01*
X8249Y299039D01*
X2215Y293006D01*
X2049Y292758D01*
X1992Y292469D01*
X1075D01*
Y288122D01*
X4437D01*
Y292469D01*
X4437D01*
X4262Y292890D01*
X9106Y297734D01*
X18161D01*
Y297104D01*
X13791D01*
X13791Y297104D01*
X13498Y297045D01*
X13250Y296880D01*
X10877Y294506D01*
X10711Y294258D01*
X10653Y293965D01*
Y292469D01*
X9736D01*
Y288122D01*
X10422D01*
X10557Y287622D01*
X8712Y285777D01*
X8546Y285529D01*
X8488Y285237D01*
Y281034D01*
X8387Y280950D01*
X7808Y280918D01*
X7020Y281705D01*
X6689Y281926D01*
X6299Y282004D01*
X6262D01*
X6133Y282196D01*
X5577Y282568D01*
X4921Y282698D01*
X4265Y282568D01*
X3709Y282196D01*
X3581Y282004D01*
X3347D01*
X2956Y281926D01*
X2626Y281705D01*
X2035Y281115D01*
X1814Y280784D01*
X1736Y280394D01*
Y280146D01*
X1075D01*
Y275799D01*
X4437D01*
Y278973D01*
X4823Y279290D01*
X4921Y279270D01*
X5019Y279290D01*
X5406Y278973D01*
Y275799D01*
X8235D01*
X8383Y275299D01*
X7837Y274754D01*
X6568D01*
X6568Y274754D01*
X6275Y274696D01*
X6027Y274530D01*
X3848Y272351D01*
X1075D01*
Y268004D01*
X4437D01*
Y270777D01*
X4844Y271184D01*
X5305Y270992D01*
Y270927D01*
X7087D01*
X8868D01*
Y272451D01*
X6850D01*
X6654Y272905D01*
X6914Y273224D01*
X8154D01*
X8447Y273283D01*
X8695Y273448D01*
X9793Y274547D01*
X9793Y274547D01*
X9959Y274795D01*
X10018Y275088D01*
X10018Y275088D01*
Y275799D01*
X10653D01*
Y272351D01*
X9736D01*
Y268004D01*
X10422D01*
X10557Y267504D01*
X8712Y265659D01*
X8546Y265411D01*
X8488Y265118D01*
Y260916D01*
X8387Y260832D01*
X7808Y260800D01*
X7020Y261587D01*
X6689Y261808D01*
X6299Y261886D01*
X6262D01*
X6133Y262078D01*
X5577Y262450D01*
X4921Y262580D01*
X4265Y262450D01*
X3709Y262078D01*
X3581Y261886D01*
X3347D01*
X2956Y261808D01*
X2626Y261587D01*
X2035Y260997D01*
X1814Y260666D01*
X1736Y260276D01*
Y260028D01*
X1075D01*
Y255681D01*
X4437D01*
Y258855D01*
X4823Y259172D01*
X4921Y259152D01*
X5019Y259172D01*
X5406Y258855D01*
Y255681D01*
X8235D01*
X8383Y255181D01*
X7837Y254636D01*
X6568D01*
X6568Y254636D01*
X6275Y254577D01*
X6027Y254412D01*
X3848Y252233D01*
X1075D01*
Y247886D01*
X4437D01*
Y250659D01*
X4844Y251065D01*
X5305Y250874D01*
Y250809D01*
X7087D01*
X8868D01*
Y252332D01*
X6851D01*
X6654Y252787D01*
X6914Y253106D01*
X8154D01*
X8447Y253164D01*
X8695Y253330D01*
X9793Y254429D01*
X9793Y254429D01*
X9959Y254677D01*
X10018Y254970D01*
X10018Y254970D01*
Y255681D01*
X10653D01*
Y252233D01*
X9736D01*
Y247886D01*
X10422D01*
X10557Y247386D01*
X8712Y245541D01*
X8546Y245293D01*
X8488Y245000D01*
Y240798D01*
X8387Y240714D01*
X7808Y240682D01*
X7020Y241469D01*
X6689Y241690D01*
X6299Y241768D01*
X6262D01*
X6133Y241960D01*
X5577Y242332D01*
X4921Y242462D01*
X4265Y242332D01*
X3709Y241960D01*
X3581Y241768D01*
X3347D01*
X2956Y241690D01*
X2626Y241469D01*
X2035Y240879D01*
X1814Y240548D01*
X1736Y240158D01*
Y239910D01*
X1075D01*
Y235563D01*
X4437D01*
Y238736D01*
X4823Y239054D01*
X4921Y239034D01*
X5019Y239054D01*
X5406Y238736D01*
Y235563D01*
X8234D01*
X8383Y235063D01*
X7837Y234518D01*
X6568D01*
X6568Y234518D01*
X6275Y234459D01*
X6027Y234294D01*
X3848Y232114D01*
X1075D01*
Y227768D01*
X4437D01*
Y230541D01*
X4844Y230947D01*
X5305Y230756D01*
Y230691D01*
X7087D01*
X8868D01*
Y232214D01*
X6850D01*
X6654Y232669D01*
X6914Y232988D01*
X8154D01*
X8447Y233046D01*
X8695Y233212D01*
X9793Y234311D01*
X9793Y234311D01*
X9959Y234559D01*
X10018Y234852D01*
X10018Y234852D01*
Y235563D01*
X10653D01*
Y232114D01*
X9736D01*
Y227768D01*
X10422D01*
X10557Y227268D01*
X8712Y225423D01*
X8546Y225175D01*
X8488Y224882D01*
Y220680D01*
X8387Y220596D01*
X7808Y220564D01*
X7020Y221351D01*
X6689Y221572D01*
X6299Y221650D01*
X6262D01*
X6133Y221842D01*
X5577Y222214D01*
X4921Y222344D01*
X4265Y222214D01*
X3709Y221842D01*
X3581Y221650D01*
X3347D01*
X2956Y221572D01*
X2626Y221351D01*
X2035Y220760D01*
X1814Y220430D01*
X1736Y220040D01*
Y219792D01*
X1075D01*
Y215445D01*
X4437D01*
Y218618D01*
X4823Y218935D01*
X4921Y218916D01*
X5019Y218935D01*
X5406Y218618D01*
Y215445D01*
X8235D01*
X8383Y214945D01*
X7837Y214399D01*
X6568D01*
X6568Y214399D01*
X6275Y214341D01*
X6027Y214175D01*
X3848Y211996D01*
X1075D01*
Y207650D01*
X4437D01*
Y210423D01*
X4844Y210829D01*
X5305Y210638D01*
Y210573D01*
X7087D01*
X8868D01*
Y212096D01*
X6851D01*
X6654Y212551D01*
X6914Y212870D01*
X8154D01*
X8447Y212928D01*
X8695Y213094D01*
X9793Y214193D01*
X9793Y214193D01*
X9959Y214441D01*
X10018Y214733D01*
X10018Y214733D01*
Y215445D01*
X10653D01*
Y211996D01*
X9736D01*
Y207650D01*
X10422D01*
X10557Y207150D01*
X8712Y205305D01*
X8546Y205057D01*
X8488Y204764D01*
Y200561D01*
X8387Y200478D01*
X7808Y200446D01*
X7020Y201233D01*
X6689Y201454D01*
X6299Y201532D01*
X6262D01*
X6133Y201724D01*
X5577Y202096D01*
X4921Y202226D01*
X4265Y202096D01*
X3709Y201724D01*
X3581Y201532D01*
X3347D01*
X2956Y201454D01*
X2626Y201233D01*
X2035Y200642D01*
X1814Y200312D01*
X1736Y199921D01*
Y199673D01*
X1075D01*
Y195327D01*
X4437D01*
Y198500D01*
X4823Y198817D01*
X4921Y198798D01*
X5019Y198817D01*
X5406Y198500D01*
Y195327D01*
X8235D01*
X8383Y194827D01*
X7837Y194281D01*
X6568D01*
X6568Y194281D01*
X6275Y194223D01*
X6027Y194057D01*
X3848Y191878D01*
X1075D01*
Y187532D01*
X4437D01*
Y190305D01*
X4844Y190711D01*
X5305Y190520D01*
Y190455D01*
X7087D01*
X8868D01*
Y191978D01*
X6851D01*
X6654Y192433D01*
X6914Y192752D01*
X8154D01*
X8447Y192810D01*
X8695Y192976D01*
X9793Y194074D01*
X9793Y194074D01*
X9959Y194323D01*
X10018Y194615D01*
X10018Y194615D01*
Y195327D01*
X10653D01*
Y191878D01*
X9736D01*
Y187532D01*
X10653D01*
Y186172D01*
X8763Y184283D01*
X8598Y184035D01*
X8539Y183742D01*
Y179991D01*
X8039Y179942D01*
X8029Y179997D01*
X7808Y180327D01*
X7020Y181115D01*
X6689Y181336D01*
X6299Y181413D01*
X6262D01*
X6133Y181606D01*
X5577Y181977D01*
X4921Y182108D01*
X4265Y181977D01*
X3709Y181606D01*
X3581Y181413D01*
X3347D01*
X2956Y181336D01*
X2626Y181115D01*
X2035Y180524D01*
X1814Y180193D01*
X1736Y179803D01*
Y179555D01*
X1075D01*
Y175209D01*
X4437D01*
Y178382D01*
X4823Y178699D01*
X4921Y178680D01*
X5019Y178699D01*
X5406Y178382D01*
Y175209D01*
X8539D01*
Y172556D01*
X2215Y166232D01*
X2049Y165983D01*
X1991Y165691D01*
Y161563D01*
X1075D01*
Y157217D01*
X4437D01*
Y161563D01*
X3521D01*
Y165374D01*
X9845Y171698D01*
X10011Y171947D01*
X10069Y172239D01*
Y175209D01*
X10653D01*
Y161563D01*
X9736D01*
Y157217D01*
X10422D01*
X10557Y156717D01*
X8712Y154871D01*
X8546Y154623D01*
X8488Y154331D01*
Y150128D01*
X8387Y150045D01*
X7808Y150012D01*
X7020Y150800D01*
X6689Y151021D01*
X6299Y151098D01*
X6262D01*
X6133Y151291D01*
X5577Y151662D01*
X4921Y151793D01*
X4265Y151662D01*
X3709Y151291D01*
X3581Y151098D01*
X3347D01*
X2956Y151021D01*
X2626Y150800D01*
X2035Y150209D01*
X1814Y149878D01*
X1736Y149488D01*
Y149240D01*
X1075D01*
Y144894D01*
X4437D01*
Y148067D01*
X4823Y148384D01*
X4921Y148365D01*
X5019Y148384D01*
X5406Y148067D01*
Y144894D01*
X8235D01*
X8383Y144394D01*
X7837Y143848D01*
X6568D01*
X6568Y143848D01*
X6275Y143790D01*
X6027Y143624D01*
X3848Y141445D01*
X1075D01*
Y137098D01*
X4437D01*
Y139871D01*
X4844Y140278D01*
X5305Y140086D01*
Y140022D01*
X7087D01*
X8868D01*
Y141545D01*
X6851D01*
X6654Y141999D01*
X6914Y142319D01*
X8154D01*
X8447Y142377D01*
X8695Y142543D01*
X9793Y143641D01*
X9793Y143641D01*
X9959Y143889D01*
X10018Y144182D01*
X10018Y144182D01*
Y144894D01*
X10653D01*
Y141445D01*
X9736D01*
Y137098D01*
X10422D01*
X10557Y136598D01*
X8712Y134753D01*
X8546Y134505D01*
X8488Y134213D01*
Y130010D01*
X8387Y129927D01*
X7808Y129894D01*
X7020Y130682D01*
X6689Y130903D01*
X6299Y130980D01*
X6262D01*
X6133Y131173D01*
X5577Y131544D01*
X4921Y131675D01*
X4265Y131544D01*
X3709Y131173D01*
X3581Y130980D01*
X3347D01*
X2956Y130903D01*
X2626Y130682D01*
X2035Y130091D01*
X1814Y129760D01*
X1736Y129370D01*
Y129122D01*
X1075D01*
Y124776D01*
X4437D01*
Y127949D01*
X4823Y128266D01*
X4921Y128247D01*
X5019Y128266D01*
X5406Y127949D01*
Y124776D01*
X8235D01*
X8383Y124276D01*
X7837Y123730D01*
X6568D01*
X6568Y123730D01*
X6275Y123672D01*
X6027Y123506D01*
X3848Y121327D01*
X1075D01*
Y116980D01*
X4437D01*
Y119753D01*
X4844Y120160D01*
X5305Y119968D01*
Y119904D01*
X7087D01*
X8868D01*
Y121427D01*
X6850D01*
X6654Y121881D01*
X6914Y122201D01*
X8154D01*
X8447Y122259D01*
X8695Y122425D01*
X9793Y123523D01*
X9793Y123523D01*
X9959Y123771D01*
X10018Y124064D01*
X10018Y124064D01*
Y124776D01*
X10653D01*
Y121327D01*
X9736D01*
Y116980D01*
X10422D01*
X10557Y116480D01*
X8712Y114635D01*
X8546Y114387D01*
X8488Y114094D01*
Y109892D01*
X8387Y109808D01*
X7808Y109776D01*
X7020Y110564D01*
X6689Y110784D01*
X6299Y110862D01*
X6262D01*
X6133Y111055D01*
X5577Y111426D01*
X4921Y111556D01*
X4265Y111426D01*
X3709Y111055D01*
X3581Y110862D01*
X3347D01*
X2956Y110784D01*
X2626Y110564D01*
X2035Y109973D01*
X1814Y109642D01*
X1736Y109252D01*
Y109004D01*
X1075D01*
Y104657D01*
X4437D01*
Y107831D01*
X4823Y108148D01*
X4921Y108128D01*
X5019Y108148D01*
X5406Y107831D01*
Y104657D01*
X8235D01*
X8383Y104157D01*
X7837Y103612D01*
X6568D01*
X6568Y103612D01*
X6275Y103554D01*
X6027Y103388D01*
X3848Y101209D01*
X1075D01*
Y96862D01*
X4437D01*
Y99635D01*
X4844Y100042D01*
X5305Y99850D01*
Y99786D01*
X7087D01*
X8868D01*
Y101309D01*
X6851D01*
X6654Y101763D01*
X6914Y102082D01*
X8154D01*
X8447Y102141D01*
X8695Y102306D01*
X9793Y103405D01*
X9793Y103405D01*
X9959Y103653D01*
X10018Y103946D01*
X10018Y103946D01*
Y104657D01*
X10653D01*
Y101209D01*
X9736D01*
Y96862D01*
X10422D01*
X10557Y96362D01*
X8712Y94517D01*
X8546Y94269D01*
X8488Y93976D01*
Y89774D01*
X8387Y89690D01*
X7808Y89658D01*
X7020Y90445D01*
X6689Y90666D01*
X6299Y90744D01*
X6262D01*
X6133Y90936D01*
X5577Y91308D01*
X4921Y91438D01*
X4265Y91308D01*
X3709Y90936D01*
X3581Y90744D01*
X3347D01*
X2956Y90666D01*
X2626Y90445D01*
X2035Y89855D01*
X1814Y89524D01*
X1736Y89134D01*
Y88886D01*
X1075D01*
Y84539D01*
X4437D01*
Y87713D01*
X4823Y88030D01*
X4921Y88010D01*
X5019Y88030D01*
X5406Y87713D01*
Y84539D01*
X8234D01*
X8383Y84039D01*
X7837Y83494D01*
X6568D01*
X6568Y83494D01*
X6275Y83436D01*
X6027Y83270D01*
X3848Y81090D01*
X1075D01*
Y76744D01*
X4437D01*
Y79517D01*
X4844Y79924D01*
X5305Y79732D01*
Y79667D01*
X7087D01*
X8868D01*
Y81191D01*
X6850D01*
X6654Y81645D01*
X6914Y81964D01*
X8154D01*
X8447Y82023D01*
X8695Y82188D01*
X9793Y83287D01*
X9793Y83287D01*
X9959Y83535D01*
X10018Y83828D01*
X10018Y83828D01*
Y84539D01*
X10653D01*
Y81090D01*
X9736D01*
Y76744D01*
X10422D01*
X10557Y76244D01*
X8712Y74399D01*
X8546Y74151D01*
X8488Y73858D01*
Y69656D01*
X8387Y69572D01*
X7808Y69540D01*
X7020Y70327D01*
X6689Y70548D01*
X6299Y70626D01*
X6262D01*
X6133Y70818D01*
X5577Y71190D01*
X4921Y71320D01*
X4265Y71190D01*
X3709Y70818D01*
X3581Y70626D01*
X3347D01*
X2956Y70548D01*
X2626Y70327D01*
X2035Y69737D01*
X1814Y69406D01*
X1736Y69016D01*
Y68768D01*
X1075D01*
Y64421D01*
X4437D01*
Y67594D01*
X4823Y67912D01*
X4921Y67892D01*
X5019Y67912D01*
X5406Y67594D01*
Y64421D01*
X8235D01*
X8383Y63921D01*
X7837Y63376D01*
X6568D01*
X6568Y63376D01*
X6275Y63317D01*
X6027Y63152D01*
X3848Y60972D01*
X1075D01*
Y56626D01*
X4437D01*
Y59399D01*
X4844Y59805D01*
X5305Y59614D01*
Y59549D01*
X7087D01*
X8868D01*
Y61072D01*
X6851D01*
X6654Y61527D01*
X6914Y61846D01*
X8154D01*
X8447Y61904D01*
X8695Y62070D01*
X9793Y63169D01*
X9793Y63169D01*
X9959Y63417D01*
X10018Y63709D01*
X10018Y63710D01*
Y64421D01*
X10653D01*
Y60972D01*
X9736D01*
Y56626D01*
X10317D01*
Y54531D01*
X10125Y54402D01*
X9753Y53846D01*
X9623Y53190D01*
X9753Y52534D01*
X10125Y51978D01*
X10681Y51607D01*
X11337Y51476D01*
X11992Y51607D01*
X12549Y51978D01*
X12920Y52534D01*
X13050Y53190D01*
X12920Y53846D01*
X12549Y54402D01*
X12356Y54531D01*
Y56626D01*
X13098D01*
Y60972D01*
X12182D01*
Y64421D01*
X13098D01*
Y68768D01*
X10018D01*
Y73541D01*
X11958Y75482D01*
X11958Y75482D01*
X12124Y75730D01*
X12182Y76023D01*
X12182Y76023D01*
Y76744D01*
X13098D01*
Y81090D01*
X12182D01*
Y84539D01*
X13098D01*
Y88886D01*
X10018D01*
Y93660D01*
X11958Y95600D01*
X11958Y95600D01*
X12124Y95848D01*
X12182Y96141D01*
X12182Y96141D01*
Y96862D01*
X13098D01*
Y101209D01*
X12182D01*
Y104657D01*
X13098D01*
Y109004D01*
X10018D01*
Y113778D01*
X11958Y115718D01*
X11958Y115718D01*
X12124Y115966D01*
X12182Y116259D01*
X12182Y116259D01*
Y116980D01*
X13098D01*
Y121327D01*
X12182D01*
Y124776D01*
X13098D01*
Y129122D01*
X10018D01*
Y133896D01*
X11958Y135837D01*
X11958Y135837D01*
X12124Y136085D01*
X12182Y136377D01*
X12182Y136377D01*
Y137098D01*
X13098D01*
Y141445D01*
X12182D01*
Y144894D01*
X13098D01*
Y149240D01*
X10018D01*
Y154014D01*
X11958Y155955D01*
X11958Y155955D01*
X12124Y156203D01*
X12182Y156495D01*
X12182Y156495D01*
Y157217D01*
X13098D01*
Y161563D01*
X12182D01*
Y175209D01*
X13098D01*
Y179555D01*
X10069D01*
Y183425D01*
X11958Y185315D01*
X11958Y185315D01*
X12124Y185563D01*
X12182Y185855D01*
X12182Y185855D01*
Y187532D01*
X13098D01*
Y191878D01*
X12182D01*
Y195327D01*
X13098D01*
Y199673D01*
X10018D01*
Y204447D01*
X11958Y206388D01*
X11958Y206388D01*
X12124Y206636D01*
X12182Y206928D01*
X12182Y206928D01*
Y207650D01*
X13098D01*
Y211996D01*
X12182D01*
Y215445D01*
X13098D01*
Y219792D01*
X10018D01*
Y224565D01*
X11958Y226506D01*
X11958Y226506D01*
X12124Y226754D01*
X12182Y227047D01*
X12182Y227047D01*
Y227768D01*
X13098D01*
Y232114D01*
X12182D01*
Y235563D01*
X13098D01*
Y239910D01*
X10018D01*
Y244684D01*
X11958Y246624D01*
X11958Y246624D01*
X12124Y246872D01*
X12182Y247165D01*
X12182Y247165D01*
Y247886D01*
X13098D01*
Y252233D01*
X12182D01*
Y255681D01*
X13098D01*
Y260028D01*
X10018D01*
Y264802D01*
X11958Y266742D01*
X11958Y266742D01*
X12124Y266990D01*
X12182Y267283D01*
X12182Y267283D01*
Y268004D01*
X13098D01*
Y272351D01*
X12182D01*
Y275799D01*
X13098D01*
Y280146D01*
X10018D01*
Y284920D01*
X11958Y286860D01*
X11958Y286860D01*
X12124Y287108D01*
X12182Y287401D01*
X12182Y287401D01*
Y288122D01*
X13098D01*
Y292469D01*
X12182D01*
Y293649D01*
X14108Y295574D01*
X18161D01*
Y294658D01*
X22508D01*
Y297734D01*
X26770D01*
X28706Y295798D01*
X28954Y295632D01*
X29246Y295574D01*
X29246Y295574D01*
X30484D01*
Y294658D01*
X34830D01*
Y295574D01*
X39697D01*
Y294658D01*
X44043D01*
Y297739D01*
X47400D01*
X49340Y295798D01*
X49340Y295798D01*
X49588Y295632D01*
X49881Y295574D01*
X49881Y295574D01*
X52019D01*
Y294658D01*
X56366D01*
Y295574D01*
X61232D01*
Y294658D01*
X65579D01*
Y297739D01*
X68935D01*
X70876Y295798D01*
X70876Y295798D01*
X71124Y295632D01*
X71416Y295574D01*
X71416Y295574D01*
X73555D01*
Y294658D01*
X77901D01*
Y295574D01*
X82767D01*
Y294658D01*
X87114D01*
Y297739D01*
X90470D01*
X92411Y295798D01*
X92411Y295798D01*
X92659Y295632D01*
X92952Y295574D01*
X92952Y295574D01*
X95090D01*
Y294658D01*
X99437D01*
Y295574D01*
X104303D01*
Y294658D01*
X108649D01*
Y297739D01*
X112006D01*
X113946Y295798D01*
X113946Y295798D01*
X114195Y295632D01*
X114487Y295574D01*
X114487Y295574D01*
X116626D01*
Y294658D01*
X120972D01*
Y295574D01*
X125838D01*
Y294658D01*
X130185D01*
Y297739D01*
X133541D01*
X135482Y295798D01*
X135482Y295798D01*
X135730Y295632D01*
X136022Y295574D01*
X136023Y295574D01*
X138161D01*
Y294658D01*
X142508D01*
Y295574D01*
X145732D01*
X148298Y293008D01*
X148091Y292508D01*
X147531D01*
Y288162D01*
X150893D01*
Y292508D01*
X149977D01*
Y293175D01*
X149919Y293468D01*
X149753Y293716D01*
X146589Y296880D01*
X146341Y297045D01*
X146048Y297104D01*
X142508D01*
Y298020D01*
X138161D01*
Y297104D01*
X136339D01*
X134399Y299044D01*
X134151Y299210D01*
X133858Y299268D01*
X131073D01*
X130989Y299369D01*
X130957Y299949D01*
X131744Y300736D01*
X131965Y301067D01*
X132043Y301457D01*
Y301494D01*
X132235Y301623D01*
X132607Y302179D01*
X132737Y302835D01*
X132607Y303491D01*
X132235Y304047D01*
X132043Y304175D01*
Y304410D01*
X131965Y304800D01*
X131744Y305131D01*
X131154Y305721D01*
X130823Y305942D01*
X130433Y306020D01*
X130185D01*
Y306681D01*
D02*
G37*
G36*
X142608Y299920D02*
X141084D01*
Y298888D01*
X142608D01*
Y299920D01*
D02*
G37*
G36*
X139584Y302451D02*
X138061D01*
Y301689D01*
X136929D01*
X136539Y301611D01*
X136208Y301390D01*
X135987Y301060D01*
X135909Y300670D01*
X135987Y300279D01*
X136208Y299949D01*
X136539Y299728D01*
X136929Y299650D01*
X138061D01*
Y298888D01*
X139584D01*
Y300670D01*
Y302451D01*
D02*
G37*
G36*
X118049D02*
X116526D01*
Y301689D01*
X115393D01*
X115003Y301611D01*
X114673Y301390D01*
X114452Y301060D01*
X114374Y300670D01*
X114452Y300279D01*
X114673Y299949D01*
X115003Y299728D01*
X115393Y299650D01*
X116526D01*
Y298888D01*
X118049D01*
Y300670D01*
Y302451D01*
D02*
G37*
G36*
X96514D02*
X94990D01*
Y301689D01*
X93858D01*
X93468Y301611D01*
X93137Y301390D01*
X92916Y301060D01*
X92839Y300670D01*
X92916Y300279D01*
X93137Y299949D01*
X93468Y299728D01*
X93858Y299650D01*
X94990D01*
Y298888D01*
X96514D01*
Y300670D01*
Y302451D01*
D02*
G37*
G36*
X74978D02*
X73455D01*
Y301689D01*
X72323D01*
X71932Y301611D01*
X71602Y301390D01*
X71381Y301060D01*
X71303Y300670D01*
X71381Y300279D01*
X71602Y299949D01*
X71932Y299728D01*
X72323Y299650D01*
X73455D01*
Y298888D01*
X74978D01*
Y300670D01*
Y302451D01*
D02*
G37*
G36*
X53443D02*
X51919D01*
Y301689D01*
X50787D01*
X50397Y301611D01*
X50066Y301390D01*
X49845Y301060D01*
X49768Y300670D01*
X49845Y300279D01*
X50066Y299949D01*
X50397Y299728D01*
X50787Y299650D01*
X51919D01*
Y298888D01*
X53443D01*
Y300670D01*
Y302451D01*
D02*
G37*
G36*
X31907D02*
X30384D01*
Y301689D01*
X29252D01*
X28862Y301611D01*
X28531Y301390D01*
X28310Y301060D01*
X28232Y300670D01*
X28310Y300279D01*
X28531Y299949D01*
X28862Y299728D01*
X29252Y299650D01*
X30384D01*
Y298888D01*
X31907D01*
Y300670D01*
Y302451D01*
D02*
G37*
G36*
X142913Y294140D02*
X17717D01*
X17705Y294135D01*
X17693Y294140D01*
X17384Y294126D01*
X17361Y294115D01*
X17337Y294122D01*
X17031Y294081D01*
X17009Y294069D01*
X16984Y294073D01*
X16682Y294006D01*
X16662Y293992D01*
X16637Y293994D01*
X16342Y293901D01*
X16323Y293885D01*
X16298D01*
X16012Y293767D01*
X15994Y293749D01*
X15969Y293747D01*
X15695Y293604D01*
X15679Y293585D01*
X15654Y293580D01*
X15394Y293414D01*
X15379Y293394D01*
X15355Y293387D01*
X15110Y293199D01*
X15097Y293177D01*
X15073Y293169D01*
X14845Y292960D01*
X14835Y292937D01*
X14812Y292927D01*
X14603Y292699D01*
X14595Y292675D01*
X14573Y292663D01*
X14385Y292417D01*
X14378Y292393D01*
X14358Y292379D01*
X14192Y292118D01*
X14187Y292093D01*
X14168Y292077D01*
X14025Y291803D01*
X14023Y291778D01*
X14005Y291760D01*
X13887Y291475D01*
Y291449D01*
X13871Y291430D01*
X13778Y291135D01*
X13780Y291110D01*
X13766Y291090D01*
X13699Y290788D01*
X13703Y290763D01*
X13690Y290741D01*
X13650Y290435D01*
X13657Y290411D01*
X13646Y290388D01*
X13633Y290079D01*
X13637Y290067D01*
X13632Y290055D01*
Y180024D01*
X13637Y180012D01*
X13633Y180000D01*
X13646Y179691D01*
X13657Y179669D01*
X13650Y179644D01*
X13690Y179338D01*
X13703Y179316D01*
X13699Y179291D01*
X13766Y178990D01*
X13780Y178969D01*
X13778Y178944D01*
X13871Y178649D01*
X13887Y178630D01*
Y178605D01*
X14005Y178319D01*
X14023Y178302D01*
X14025Y178277D01*
X14168Y178002D01*
X14187Y177986D01*
X14192Y177961D01*
X14358Y177701D01*
X14378Y177686D01*
X14385Y177662D01*
X14573Y177417D01*
X14595Y177404D01*
X14603Y177381D01*
X14812Y177153D01*
X14835Y177142D01*
X14845Y177119D01*
X15073Y176911D01*
X15097Y176902D01*
X15110Y176880D01*
X15355Y176692D01*
X15379Y176686D01*
X15394Y176665D01*
X15654Y176499D01*
X15679Y176495D01*
X15695Y176475D01*
X15969Y176332D01*
X15994Y176330D01*
X16012Y176313D01*
X16298Y176194D01*
X16323D01*
X16342Y176178D01*
X16637Y176085D01*
X16662Y176087D01*
X16682Y176073D01*
X16984Y176006D01*
X17009Y176010D01*
X17031Y175998D01*
X17337Y175957D01*
X17361Y175964D01*
X17384Y175953D01*
X17693Y175940D01*
X17705Y175944D01*
X17717Y175939D01*
X142913D01*
X142925Y175944D01*
X142937Y175940D01*
X143246Y175953D01*
X143269Y175964D01*
X143293Y175957D01*
X143599Y175998D01*
X143621Y176010D01*
X143646Y176006D01*
X143948Y176073D01*
X143968Y176087D01*
X143993Y176085D01*
X144288Y176178D01*
X144307Y176194D01*
X144332D01*
X144618Y176313D01*
X144636Y176330D01*
X144661Y176332D01*
X144935Y176475D01*
X144951Y176495D01*
X144976Y176499D01*
X145236Y176665D01*
X145251Y176686D01*
X145275Y176692D01*
X145520Y176880D01*
X145533Y176902D01*
X145556Y176911D01*
X145784Y177119D01*
X145795Y177142D01*
X145818Y177153D01*
X146027Y177381D01*
X146035Y177404D01*
X146057Y177417D01*
X146245Y177662D01*
X146252Y177686D01*
X146272Y177701D01*
X146438Y177961D01*
X146443Y177986D01*
X146462Y178002D01*
X146605Y178277D01*
X146607Y178302D01*
X146625Y178319D01*
X146743Y178605D01*
Y178630D01*
X146759Y178649D01*
X146852Y178944D01*
X146850Y178969D01*
X146864Y178990D01*
X146931Y179291D01*
X146927Y179316D01*
X146939Y179338D01*
X146980Y179644D01*
X146973Y179669D01*
X146984Y179691D01*
X146997Y180000D01*
X146993Y180012D01*
X146998Y180024D01*
Y290055D01*
X146993Y290067D01*
X146997Y290079D01*
X146984Y290388D01*
X146973Y290411D01*
X146980Y290435D01*
X146939Y290741D01*
X146927Y290763D01*
X146931Y290788D01*
X146864Y291090D01*
X146850Y291110D01*
X146852Y291135D01*
X146759Y291430D01*
X146743Y291449D01*
Y291475D01*
X146625Y291760D01*
X146607Y291778D01*
X146605Y291803D01*
X146462Y292077D01*
X146443Y292093D01*
X146438Y292118D01*
X146272Y292379D01*
X146252Y292393D01*
X146245Y292417D01*
X146057Y292663D01*
X146035Y292675D01*
X146027Y292699D01*
X145818Y292927D01*
X145795Y292937D01*
X145784Y292960D01*
X145556Y293169D01*
X145533Y293177D01*
X145520Y293199D01*
X145275Y293387D01*
X145251Y293394D01*
X145236Y293414D01*
X144976Y293580D01*
X144951Y293585D01*
X144935Y293604D01*
X144661Y293747D01*
X144636Y293749D01*
X144618Y293767D01*
X144332Y293885D01*
X144307D01*
X144288Y293901D01*
X143993Y293994D01*
X143968Y293992D01*
X143948Y294006D01*
X143646Y294073D01*
X143621Y294069D01*
X143599Y294081D01*
X143293Y294122D01*
X143269Y294115D01*
X143246Y294126D01*
X142937Y294140D01*
X142925Y294135D01*
X142913Y294140D01*
D02*
G37*
G36*
X8868Y292569D02*
X7837D01*
Y291045D01*
X8868D01*
Y292569D01*
D02*
G37*
G36*
X6337D02*
X5305D01*
Y291045D01*
X6337D01*
Y292569D01*
D02*
G37*
G36*
X159555Y292508D02*
X156193D01*
Y289335D01*
X155806Y289018D01*
X155708Y289037D01*
X155611Y289018D01*
X155224Y289335D01*
Y292508D01*
X151862D01*
Y288162D01*
X152524D01*
Y288110D01*
X152601Y287720D01*
X152822Y287389D01*
X153610Y286602D01*
X153940Y286381D01*
X154331Y286303D01*
X154368D01*
X154496Y286111D01*
X155052Y285739D01*
X155708Y285609D01*
X156364Y285739D01*
X156920Y286111D01*
X157049Y286303D01*
X157283D01*
X157673Y286381D01*
X158004Y286602D01*
X158595Y287193D01*
X158816Y287523D01*
X158893Y287914D01*
Y288162D01*
X159555D01*
Y292508D01*
D02*
G37*
G36*
X8868Y289545D02*
X7087D01*
X5305D01*
Y288022D01*
X6067D01*
Y286890D01*
X6145Y286500D01*
X6366Y286169D01*
X6696Y285948D01*
X7087Y285870D01*
X7477Y285948D01*
X7808Y286169D01*
X8029Y286500D01*
X8106Y286890D01*
Y288022D01*
X8868D01*
Y289545D01*
D02*
G37*
G36*
X153543Y282437D02*
X153153Y282360D01*
X152822Y282138D01*
X152601Y281808D01*
X152524Y281417D01*
Y280285D01*
X151762D01*
Y278762D01*
X155324D01*
Y280285D01*
X154563D01*
Y281417D01*
X154485Y281808D01*
X154264Y282138D01*
X153933Y282360D01*
X153543Y282437D01*
D02*
G37*
G36*
X159555Y280185D02*
X156193D01*
Y277412D01*
X155786Y277006D01*
X155324Y277197D01*
Y277262D01*
X151762D01*
Y275739D01*
X153779D01*
X153976Y275284D01*
X153716Y274965D01*
X152476D01*
X152476Y274965D01*
X152183Y274907D01*
X151935Y274741D01*
X151935Y274741D01*
X150836Y273642D01*
X150671Y273394D01*
X150612Y273102D01*
Y272390D01*
X147531D01*
Y268043D01*
X150612D01*
Y263270D01*
X148672Y261329D01*
X148506Y261081D01*
X148448Y260788D01*
Y260067D01*
X147531D01*
Y255721D01*
X148448D01*
Y252272D01*
X147531D01*
Y247925D01*
X150612D01*
Y243151D01*
X148672Y241211D01*
X148506Y240963D01*
X148448Y240670D01*
Y239949D01*
X147531D01*
Y235602D01*
X148448D01*
Y232154D01*
X147531D01*
Y227807D01*
X150612D01*
Y223033D01*
X148672Y221093D01*
X148506Y220845D01*
X148448Y220552D01*
Y219831D01*
X147531D01*
Y215484D01*
X148448D01*
Y212036D01*
X147531D01*
Y207689D01*
X150612D01*
Y202915D01*
X148672Y200975D01*
X148506Y200727D01*
X148448Y200434D01*
Y199713D01*
X147531D01*
Y195366D01*
X148448D01*
Y191918D01*
X147531D01*
Y187571D01*
X150612D01*
Y182797D01*
X148672Y180857D01*
X148506Y180609D01*
X148448Y180316D01*
Y179595D01*
X147531D01*
Y175248D01*
X147607D01*
X147799Y174786D01*
X147005Y173993D01*
X142508D01*
Y174910D01*
X138161D01*
Y171547D01*
X142508D01*
Y172464D01*
X147322D01*
X147615Y172522D01*
X147863Y172688D01*
X149753Y174578D01*
X149753Y174578D01*
X149919Y174826D01*
X149977Y175119D01*
X150446Y175248D01*
X150893D01*
Y179595D01*
X150208D01*
X150073Y180095D01*
X151918Y181940D01*
X151918Y181940D01*
X152084Y182188D01*
X152142Y182481D01*
X152142Y182481D01*
Y186682D01*
X152243Y186766D01*
X152822Y186799D01*
X153610Y186012D01*
X153940Y185791D01*
X154331Y185713D01*
X154368D01*
X154496Y185521D01*
X155052Y185149D01*
X155708Y185018D01*
X156364Y185149D01*
X156920Y185521D01*
X157049Y185713D01*
X157283D01*
X157673Y185791D01*
X158004Y186012D01*
X158595Y186602D01*
X158816Y186933D01*
X158893Y187323D01*
Y187571D01*
X159555D01*
Y191918D01*
X156193D01*
Y188744D01*
X155806Y188427D01*
X155708Y188446D01*
X155611Y188427D01*
X155224Y188744D01*
Y191918D01*
X152395D01*
X152247Y192418D01*
X152792Y192963D01*
X154062D01*
X154355Y193021D01*
X154603Y193187D01*
X156782Y195366D01*
X159555D01*
Y199713D01*
X156193D01*
Y196940D01*
X155786Y196533D01*
X155324Y196725D01*
Y196790D01*
X151762D01*
Y195266D01*
X153779D01*
X153976Y194812D01*
X153716Y194493D01*
X152476D01*
X152476Y194493D01*
X152183Y194434D01*
X151935Y194269D01*
X151935Y194269D01*
X150836Y193170D01*
X150671Y192922D01*
X150612Y192629D01*
Y191918D01*
X149977D01*
Y195366D01*
X150893D01*
Y199713D01*
X150208D01*
X150073Y200213D01*
X151918Y202058D01*
X151918Y202058D01*
X152084Y202306D01*
X152142Y202599D01*
X152142Y202599D01*
Y206800D01*
X152243Y206884D01*
X152822Y206917D01*
X153610Y206130D01*
X153940Y205909D01*
X154331Y205831D01*
X154368D01*
X154496Y205639D01*
X155052Y205267D01*
X155708Y205136D01*
X156364Y205267D01*
X156920Y205639D01*
X157049Y205831D01*
X157283D01*
X157673Y205909D01*
X158004Y206130D01*
X158595Y206720D01*
X158816Y207051D01*
X158893Y207441D01*
Y207689D01*
X159555D01*
Y212036D01*
X156193D01*
Y208862D01*
X155806Y208545D01*
X155708Y208565D01*
X155611Y208545D01*
X155224Y208862D01*
Y212036D01*
X152395D01*
X152247Y212536D01*
X152792Y213081D01*
X154062D01*
X154355Y213139D01*
X154603Y213305D01*
X156782Y215484D01*
X159555D01*
Y219831D01*
X156193D01*
Y217058D01*
X155786Y216651D01*
X155324Y216843D01*
Y216908D01*
X151762D01*
Y215384D01*
X153779D01*
X153976Y214930D01*
X153716Y214611D01*
X152476D01*
X152476Y214611D01*
X152183Y214552D01*
X151935Y214387D01*
X151935Y214387D01*
X150836Y213288D01*
X150671Y213040D01*
X150612Y212747D01*
Y212036D01*
X149977D01*
Y215484D01*
X150893D01*
Y219831D01*
X150208D01*
X150073Y220331D01*
X151918Y222176D01*
X151918Y222176D01*
X152084Y222424D01*
X152142Y222717D01*
X152142Y222717D01*
Y226918D01*
X152243Y227002D01*
X152822Y227035D01*
X153610Y226248D01*
X153940Y226027D01*
X154331Y225949D01*
X154368D01*
X154496Y225757D01*
X155052Y225385D01*
X155708Y225255D01*
X156364Y225385D01*
X156920Y225757D01*
X157049Y225949D01*
X157283D01*
X157673Y226027D01*
X158004Y226248D01*
X158595Y226838D01*
X158816Y227169D01*
X158893Y227559D01*
Y227807D01*
X159555D01*
Y232154D01*
X156193D01*
Y228980D01*
X155806Y228663D01*
X155708Y228683D01*
X155611Y228663D01*
X155224Y228980D01*
Y232154D01*
X152395D01*
X152247Y232654D01*
X152792Y233199D01*
X154062D01*
X154355Y233258D01*
X154603Y233423D01*
X156782Y235602D01*
X159555D01*
Y239949D01*
X156193D01*
Y237176D01*
X155786Y236770D01*
X155324Y236961D01*
Y237026D01*
X151762D01*
Y235503D01*
X153779D01*
X153976Y235048D01*
X153716Y234729D01*
X152476D01*
X152476Y234729D01*
X152183Y234671D01*
X151935Y234505D01*
X151935Y234505D01*
X150836Y233406D01*
X150671Y233158D01*
X150612Y232866D01*
Y232154D01*
X149977D01*
Y235602D01*
X150893D01*
Y239949D01*
X150208D01*
X150073Y240449D01*
X151918Y242294D01*
X151918Y242294D01*
X152084Y242542D01*
X152142Y242835D01*
X152142Y242835D01*
Y247037D01*
X152243Y247120D01*
X152822Y247153D01*
X153610Y246366D01*
X153940Y246145D01*
X154331Y246067D01*
X154368D01*
X154496Y245875D01*
X155052Y245503D01*
X155708Y245373D01*
X156364Y245503D01*
X156920Y245875D01*
X157049Y246067D01*
X157283D01*
X157673Y246145D01*
X158004Y246366D01*
X158595Y246956D01*
X158816Y247287D01*
X158893Y247677D01*
Y247925D01*
X159555D01*
Y252272D01*
X156193D01*
Y249099D01*
X155806Y248781D01*
X155708Y248801D01*
X155611Y248781D01*
X155224Y249099D01*
Y252272D01*
X152395D01*
X152247Y252772D01*
X152792Y253317D01*
X154062D01*
X154355Y253376D01*
X154603Y253541D01*
X156782Y255721D01*
X159555D01*
Y260067D01*
X156193D01*
Y257294D01*
X155786Y256888D01*
X155324Y257079D01*
Y257144D01*
X151762D01*
Y255621D01*
X153779D01*
X153976Y255166D01*
X153716Y254847D01*
X152476D01*
X152476Y254847D01*
X152183Y254789D01*
X151935Y254623D01*
X151935Y254623D01*
X150836Y253524D01*
X150671Y253276D01*
X150612Y252983D01*
Y252272D01*
X149977D01*
Y255721D01*
X150893D01*
Y260067D01*
X150208D01*
X150073Y260567D01*
X151918Y262412D01*
X151918Y262412D01*
X152084Y262660D01*
X152142Y262953D01*
X152142Y262953D01*
Y267155D01*
X152243Y267239D01*
X152822Y267271D01*
X153610Y266484D01*
X153940Y266263D01*
X154331Y266185D01*
X154368D01*
X154496Y265993D01*
X155052Y265621D01*
X155708Y265491D01*
X156364Y265621D01*
X156920Y265993D01*
X157049Y266185D01*
X157283D01*
X157673Y266263D01*
X158004Y266484D01*
X158595Y267074D01*
X158816Y267405D01*
X158893Y267795D01*
Y268043D01*
X159555D01*
Y272390D01*
X156193D01*
Y269217D01*
X155806Y268899D01*
X155708Y268919D01*
X155611Y268899D01*
X155224Y269217D01*
Y272390D01*
X152395D01*
X152247Y272890D01*
X152792Y273436D01*
X154062D01*
X154355Y273494D01*
X154603Y273660D01*
X156782Y275839D01*
X159555D01*
Y280185D01*
D02*
G37*
G36*
X150893D02*
X147531D01*
Y275839D01*
X150893D01*
Y280185D01*
D02*
G37*
G36*
X8868Y269427D02*
X7087D01*
X5305D01*
Y267904D01*
X6067D01*
Y266772D01*
X6145Y266382D01*
X6366Y266051D01*
X6696Y265830D01*
X7087Y265752D01*
X7477Y265830D01*
X7808Y266051D01*
X8029Y266382D01*
X8106Y266772D01*
Y267904D01*
X8868D01*
Y269427D01*
D02*
G37*
G36*
X153543Y262319D02*
X153153Y262241D01*
X152822Y262020D01*
X152601Y261690D01*
X152524Y261299D01*
Y260167D01*
X151762D01*
Y258644D01*
X155324D01*
Y260167D01*
X154563D01*
Y261299D01*
X154485Y261690D01*
X154264Y262020D01*
X153933Y262241D01*
X153543Y262319D01*
D02*
G37*
G36*
X8868Y249309D02*
X7087D01*
X5305D01*
Y247786D01*
X6067D01*
Y246654D01*
X6145Y246264D01*
X6366Y245933D01*
X6696Y245712D01*
X7087Y245634D01*
X7477Y245712D01*
X7808Y245933D01*
X8029Y246264D01*
X8106Y246654D01*
Y247786D01*
X8868D01*
Y249309D01*
D02*
G37*
G36*
X153543Y242201D02*
X153153Y242123D01*
X152822Y241902D01*
X152601Y241571D01*
X152524Y241181D01*
Y240049D01*
X151762D01*
Y238526D01*
X155324D01*
Y240049D01*
X154563D01*
Y241181D01*
X154485Y241571D01*
X154264Y241902D01*
X153933Y242123D01*
X153543Y242201D01*
D02*
G37*
G36*
X8868Y229191D02*
X7087D01*
X5305D01*
Y227668D01*
X6067D01*
Y226536D01*
X6145Y226145D01*
X6366Y225815D01*
X6696Y225594D01*
X7087Y225516D01*
X7477Y225594D01*
X7808Y225815D01*
X8029Y226145D01*
X8106Y226536D01*
Y227668D01*
X8868D01*
Y229191D01*
D02*
G37*
G36*
X153543Y222083D02*
X153153Y222005D01*
X152822Y221784D01*
X152601Y221453D01*
X152524Y221063D01*
Y219931D01*
X151762D01*
Y218408D01*
X155324D01*
Y219931D01*
X154563D01*
Y221063D01*
X154485Y221453D01*
X154264Y221784D01*
X153933Y222005D01*
X153543Y222083D01*
D02*
G37*
G36*
X8868Y209073D02*
X7087D01*
X5305D01*
Y207550D01*
X6067D01*
Y206417D01*
X6145Y206027D01*
X6366Y205697D01*
X6696Y205475D01*
X7087Y205398D01*
X7477Y205475D01*
X7808Y205697D01*
X8029Y206027D01*
X8106Y206417D01*
Y207550D01*
X8868D01*
Y209073D01*
D02*
G37*
G36*
X153543Y201965D02*
X153153Y201887D01*
X152822Y201666D01*
X152601Y201335D01*
X152524Y200945D01*
Y199813D01*
X151762D01*
Y198290D01*
X155324D01*
Y199813D01*
X154563D01*
Y200945D01*
X154485Y201335D01*
X154264Y201666D01*
X153933Y201887D01*
X153543Y201965D01*
D02*
G37*
G36*
X8868Y188955D02*
X7087D01*
X5305D01*
Y187432D01*
X6067D01*
Y186299D01*
X6145Y185909D01*
X6366Y185578D01*
X6696Y185357D01*
X7087Y185280D01*
X7477Y185357D01*
X7808Y185578D01*
X8029Y185909D01*
X8106Y186299D01*
Y187432D01*
X8868D01*
Y188955D01*
D02*
G37*
G36*
X153543Y181846D02*
X153153Y181769D01*
X152822Y181548D01*
X152601Y181217D01*
X152524Y180827D01*
Y179695D01*
X151762D01*
Y178171D01*
X155324D01*
Y179695D01*
X154563D01*
Y180827D01*
X154485Y181217D01*
X154264Y181548D01*
X153933Y181769D01*
X153543Y181846D01*
D02*
G37*
G36*
X152793Y176671D02*
X151762D01*
Y175148D01*
X152793D01*
Y176671D01*
D02*
G37*
G36*
X159555Y179595D02*
X156193D01*
Y175331D01*
X155936Y175098D01*
X155700Y175011D01*
X155552Y175084D01*
X155332Y175378D01*
X155324Y175451D01*
Y175612D01*
X155324Y176671D01*
X154293D01*
Y175148D01*
X154847D01*
X155154Y175148D01*
X155271Y175106D01*
X155363Y174990D01*
X155492Y174758D01*
X155411Y174582D01*
X155398Y174557D01*
X155168Y174213D01*
X155038Y173557D01*
X155168Y172901D01*
X155540Y172345D01*
X156096Y171974D01*
X156752Y171843D01*
X157408Y171974D01*
X157964Y172345D01*
X158335Y172901D01*
X158466Y173557D01*
X158349Y174145D01*
X158414Y174211D01*
X158580Y174459D01*
X158639Y174752D01*
X158639Y174752D01*
Y175248D01*
X159555D01*
Y179595D01*
D02*
G37*
G36*
X133444Y175271D02*
X132789Y175141D01*
X132232Y174769D01*
X131861Y174213D01*
X131817Y173993D01*
X130185D01*
Y174910D01*
X125838D01*
Y173993D01*
X120972D01*
Y174910D01*
X116626D01*
Y171829D01*
X113269D01*
X111329Y173769D01*
X111081Y173935D01*
X110788Y173993D01*
X108649D01*
Y174910D01*
X104303D01*
Y173993D01*
X99437D01*
Y174910D01*
X95090D01*
Y171829D01*
X91734D01*
X89793Y173769D01*
X89545Y173935D01*
X89253Y173993D01*
X87114D01*
Y174910D01*
X82767D01*
Y173993D01*
X77901D01*
Y174910D01*
X73555D01*
Y171829D01*
X70198D01*
X68258Y173769D01*
X68010Y173935D01*
X67717Y173993D01*
X65579D01*
Y174910D01*
X61232D01*
Y173993D01*
X56366D01*
Y174910D01*
X52020D01*
Y171829D01*
X48663D01*
X46722Y173769D01*
X46474Y173935D01*
X46182Y173993D01*
X44043D01*
Y174910D01*
X39697D01*
Y173993D01*
X34830D01*
Y174910D01*
X30484D01*
Y171829D01*
X27128D01*
X25187Y173769D01*
X25187Y173769D01*
X24939Y173935D01*
X24646Y173993D01*
X24646Y173993D01*
X22508D01*
Y174910D01*
X18161D01*
Y171547D01*
X22508D01*
Y172464D01*
X24330D01*
X26270Y170523D01*
X26518Y170358D01*
X26811Y170299D01*
X29597D01*
X29680Y170199D01*
X29712Y169619D01*
X28925Y168831D01*
X28703Y168501D01*
X28626Y168110D01*
Y168073D01*
X28433Y167945D01*
X28062Y167388D01*
X27931Y166733D01*
X28062Y166077D01*
X28433Y165521D01*
X28626Y165392D01*
Y165158D01*
X28703Y164768D01*
X28925Y164437D01*
X29515Y163846D01*
X29846Y163625D01*
X30236Y163548D01*
X30484D01*
Y162886D01*
X34830D01*
Y166248D01*
X31657D01*
X31340Y166635D01*
X31359Y166733D01*
X31340Y166830D01*
X31657Y167217D01*
X34830D01*
Y170299D01*
X36643D01*
X37293Y169649D01*
Y168379D01*
X37352Y168086D01*
X37517Y167838D01*
X39476Y165879D01*
X39375Y165385D01*
X38937Y165153D01*
X38542Y165288D01*
X38407Y165490D01*
X37851Y165862D01*
X37195Y165992D01*
X36539Y165862D01*
X35983Y165490D01*
X35612Y164934D01*
X35481Y164278D01*
X35612Y163622D01*
X35983Y163066D01*
X36539Y162695D01*
X37195Y162564D01*
X37851Y162695D01*
X38407Y163066D01*
X38544Y163270D01*
X39078D01*
X39197Y163294D01*
X39616Y163040D01*
X39697Y162945D01*
Y162886D01*
X44043D01*
Y166248D01*
X41270D01*
X40864Y166655D01*
X41055Y167117D01*
X41120D01*
Y168898D01*
Y170679D01*
X39597D01*
Y168662D01*
X39142Y168465D01*
X38823Y168725D01*
Y169966D01*
X38765Y170258D01*
X38599Y170506D01*
X37500Y171605D01*
X37500Y171605D01*
X37252Y171771D01*
X36960Y171829D01*
X36960Y171829D01*
X34830D01*
Y172464D01*
X39697D01*
Y171547D01*
X44043D01*
Y172464D01*
X45865D01*
X47806Y170523D01*
X47806Y170523D01*
X48054Y170358D01*
X48346Y170299D01*
X48346Y170299D01*
X51132D01*
X51215Y170199D01*
X51247Y169619D01*
X50460Y168831D01*
X50239Y168501D01*
X50161Y168110D01*
Y168073D01*
X49969Y167945D01*
X49597Y167388D01*
X49467Y166733D01*
X49597Y166077D01*
X49969Y165521D01*
X50161Y165392D01*
Y165158D01*
X50239Y164768D01*
X50460Y164437D01*
X51051Y163846D01*
X51381Y163625D01*
X51771Y163548D01*
X52020D01*
Y162886D01*
X56366D01*
Y166248D01*
X53193D01*
X52876Y166635D01*
X52895Y166733D01*
X52876Y166830D01*
X53193Y167217D01*
X56366D01*
Y170299D01*
X58178D01*
X58829Y169649D01*
Y168379D01*
X58887Y168086D01*
X59053Y167838D01*
X61232Y165659D01*
Y162886D01*
X65579D01*
Y166248D01*
X62806D01*
X62399Y166655D01*
X62590Y167117D01*
X62655D01*
Y168898D01*
Y170679D01*
X61132D01*
Y168662D01*
X60678Y168465D01*
X60358Y168725D01*
Y169966D01*
X60358Y169966D01*
X60300Y170258D01*
X60134Y170506D01*
X60134Y170506D01*
X59036Y171605D01*
X58788Y171771D01*
X58495Y171829D01*
X56366D01*
Y172464D01*
X61232D01*
Y171547D01*
X65579D01*
Y172464D01*
X67400D01*
X69341Y170523D01*
X69341Y170523D01*
X69589Y170358D01*
X69882Y170299D01*
X69882Y170299D01*
X72668D01*
X72751Y170199D01*
X72783Y169619D01*
X71995Y168831D01*
X71774Y168501D01*
X71697Y168110D01*
Y168073D01*
X71504Y167945D01*
X71133Y167388D01*
X71002Y166733D01*
X71133Y166077D01*
X71504Y165521D01*
X71697Y165392D01*
Y165158D01*
X71774Y164768D01*
X71995Y164437D01*
X72586Y163846D01*
X72917Y163625D01*
X73307Y163548D01*
X73555D01*
Y162886D01*
X77901D01*
Y166248D01*
X74728D01*
X74411Y166635D01*
X74430Y166733D01*
X74411Y166830D01*
X74728Y167217D01*
X77901D01*
Y170299D01*
X79714D01*
X80364Y169649D01*
Y168379D01*
X80423Y168086D01*
X80588Y167838D01*
X82767Y165659D01*
Y162886D01*
X87114D01*
Y166248D01*
X84341D01*
X83935Y166655D01*
X84126Y167117D01*
X84191D01*
Y168898D01*
Y170679D01*
X82667D01*
Y168662D01*
X82213Y168465D01*
X81894Y168725D01*
Y169966D01*
X81894Y169966D01*
X81836Y170258D01*
X81670Y170506D01*
X81670Y170506D01*
X80571Y171605D01*
X80323Y171771D01*
X80030Y171829D01*
X77901D01*
Y172464D01*
X82767D01*
Y171547D01*
X87114D01*
Y172464D01*
X88936D01*
X90876Y170523D01*
X90876Y170523D01*
X91124Y170358D01*
X91417Y170299D01*
X91417Y170299D01*
X94203D01*
X94286Y170199D01*
X94318Y169619D01*
X93531Y168831D01*
X93310Y168501D01*
X93232Y168110D01*
Y168073D01*
X93040Y167945D01*
X92668Y167388D01*
X92538Y166733D01*
X92668Y166077D01*
X93040Y165521D01*
X93232Y165392D01*
Y165158D01*
X93310Y164768D01*
X93531Y164437D01*
X94121Y163846D01*
X94452Y163625D01*
X94842Y163548D01*
X95090D01*
Y162886D01*
X99437D01*
Y166248D01*
X96263D01*
X95946Y166635D01*
X95966Y166733D01*
X95946Y166830D01*
X96263Y167217D01*
X99437D01*
Y170299D01*
X101249D01*
X101900Y169649D01*
Y168379D01*
X101958Y168086D01*
X102124Y167838D01*
X104303Y165659D01*
Y162886D01*
X108649D01*
Y166248D01*
X105877D01*
X105470Y166655D01*
X105661Y167117D01*
X105726D01*
Y168898D01*
Y170679D01*
X104203D01*
Y168662D01*
X103749Y168465D01*
X103429Y168725D01*
Y169966D01*
X103429Y169966D01*
X103371Y170258D01*
X103205Y170506D01*
X103205Y170506D01*
X102106Y171605D01*
X101858Y171771D01*
X101566Y171829D01*
X99437D01*
Y172464D01*
X104303D01*
Y171547D01*
X108649D01*
Y172464D01*
X110471D01*
X112412Y170523D01*
X112412Y170523D01*
X112660Y170358D01*
X112953Y170299D01*
X112953Y170299D01*
X115738D01*
X115822Y170199D01*
X115854Y169619D01*
X115066Y168831D01*
X114845Y168501D01*
X114768Y168110D01*
Y168073D01*
X114575Y167945D01*
X114204Y167388D01*
X114073Y166733D01*
X114204Y166077D01*
X114575Y165521D01*
X114768Y165392D01*
Y165158D01*
X114845Y164768D01*
X115066Y164437D01*
X115657Y163846D01*
X115988Y163625D01*
X116378Y163548D01*
X116626D01*
Y162886D01*
X120972D01*
Y166248D01*
X117799D01*
X117482Y166635D01*
X117501Y166733D01*
X117482Y166830D01*
X117799Y167217D01*
X120972D01*
Y170299D01*
X122785D01*
X123435Y169649D01*
Y168379D01*
X123494Y168086D01*
X123659Y167838D01*
X125838Y165659D01*
Y162886D01*
X130185D01*
Y166248D01*
X127412D01*
X127006Y166655D01*
X127197Y167117D01*
X127262D01*
Y168898D01*
Y170679D01*
X125738D01*
Y168663D01*
X125284Y168466D01*
X124965Y168726D01*
Y169966D01*
X124965Y169966D01*
X124907Y170258D01*
X124741Y170506D01*
X124741Y170506D01*
X123642Y171605D01*
X123394Y171771D01*
X123101Y171829D01*
X120972D01*
Y172464D01*
X125838D01*
Y171547D01*
X130185D01*
Y172464D01*
X132153D01*
X132232Y172345D01*
X132789Y171974D01*
X133444Y171843D01*
X134100Y171974D01*
X134657Y172345D01*
X135028Y172901D01*
X135159Y173557D01*
X135028Y174213D01*
X134657Y174769D01*
X134100Y175141D01*
X133444Y175271D01*
D02*
G37*
G36*
X19584Y170679D02*
X18061D01*
Y169648D01*
X19584D01*
Y170679D01*
D02*
G37*
G36*
X130285D02*
X128762D01*
Y168898D01*
Y167117D01*
X130285D01*
Y167878D01*
X131417D01*
X131807Y167956D01*
X132138Y168177D01*
X132359Y168508D01*
X132437Y168898D01*
X132359Y169288D01*
X132138Y169619D01*
X131807Y169840D01*
X131417Y169917D01*
X130285D01*
Y170679D01*
D02*
G37*
G36*
X108749D02*
X107226D01*
Y168898D01*
Y167117D01*
X108749D01*
Y167878D01*
X109882D01*
X110272Y167956D01*
X110603Y168177D01*
X110824Y168508D01*
X110901Y168898D01*
X110824Y169288D01*
X110603Y169619D01*
X110272Y169840D01*
X109882Y169917D01*
X108749D01*
Y170679D01*
D02*
G37*
G36*
X87214D02*
X85691D01*
Y168898D01*
Y167117D01*
X87214D01*
Y167878D01*
X88346D01*
X88736Y167956D01*
X89067Y168177D01*
X89288Y168508D01*
X89366Y168898D01*
X89288Y169288D01*
X89067Y169619D01*
X88736Y169840D01*
X88346Y169917D01*
X87214D01*
Y170679D01*
D02*
G37*
G36*
X65679D02*
X64155D01*
Y168898D01*
Y167117D01*
X65679D01*
Y167878D01*
X66811D01*
X67201Y167956D01*
X67532Y168177D01*
X67753Y168508D01*
X67830Y168898D01*
X67753Y169288D01*
X67532Y169619D01*
X67201Y169840D01*
X66811Y169917D01*
X65679D01*
Y170679D01*
D02*
G37*
G36*
X44143D02*
X42620D01*
Y168898D01*
Y167117D01*
X44143D01*
Y167878D01*
X45275D01*
X45665Y167956D01*
X45996Y168177D01*
X46217Y168508D01*
X46295Y168898D01*
X46217Y169288D01*
X45996Y169619D01*
X45665Y169840D01*
X45275Y169917D01*
X44143D01*
Y170679D01*
D02*
G37*
G36*
X22608D02*
X21084D01*
Y168898D01*
Y167117D01*
X22608D01*
Y167878D01*
X23740D01*
X24130Y167956D01*
X24461Y168177D01*
X24682Y168508D01*
X24759Y168898D01*
X24682Y169288D01*
X24461Y169619D01*
X24130Y169840D01*
X23740Y169917D01*
X22608D01*
Y170679D01*
D02*
G37*
G36*
X19584Y168148D02*
X18061D01*
Y167117D01*
X19584D01*
Y168148D01*
D02*
G37*
G36*
X142508Y170579D02*
X138161D01*
Y169917D01*
X138110D01*
X137720Y169840D01*
X137389Y169619D01*
X136602Y168831D01*
X136381Y168501D01*
X136303Y168110D01*
Y168073D01*
X136111Y167945D01*
X135739Y167388D01*
X135609Y166733D01*
X135739Y166077D01*
X136111Y165521D01*
X136303Y165392D01*
Y165158D01*
X136381Y164768D01*
X136602Y164437D01*
X137192Y163846D01*
X137523Y163625D01*
X137913Y163548D01*
X138161D01*
Y162886D01*
X142508D01*
Y166248D01*
X139334D01*
X139017Y166635D01*
X139037Y166733D01*
X139017Y166830D01*
X139334Y167217D01*
X142508D01*
Y170579D01*
D02*
G37*
G36*
X22508Y166248D02*
X18161D01*
Y162886D01*
X22508D01*
Y163610D01*
X23641D01*
X23940Y163163D01*
X24496Y162791D01*
X25152Y162661D01*
X25808Y162791D01*
X26364Y163163D01*
X26736Y163719D01*
X26866Y164375D01*
X26736Y165031D01*
X26364Y165587D01*
X25808Y165958D01*
X25152Y166089D01*
X24496Y165958D01*
X23940Y165587D01*
X23641Y165139D01*
X22508D01*
Y166248D01*
D02*
G37*
G36*
X142913Y161857D02*
X17717D01*
X17705Y161852D01*
X17693Y161856D01*
X17384Y161843D01*
X17361Y161832D01*
X17337Y161838D01*
X17030Y161798D01*
X17009Y161785D01*
X16984Y161790D01*
X16682Y161723D01*
X16662Y161708D01*
X16637Y161711D01*
X16342Y161618D01*
X16323Y161602D01*
X16298D01*
X16012Y161483D01*
X15994Y161466D01*
X15969Y161463D01*
X15695Y161321D01*
X15679Y161301D01*
X15654Y161297D01*
X15394Y161131D01*
X15379Y161110D01*
X15355Y161104D01*
X15110Y160916D01*
X15097Y160894D01*
X15073Y160885D01*
X14845Y160677D01*
X14835Y160654D01*
X14812Y160643D01*
X14603Y160415D01*
X14595Y160392D01*
X14573Y160379D01*
X14385Y160134D01*
X14378Y160109D01*
X14358Y160095D01*
X14192Y159834D01*
X14187Y159810D01*
X14168Y159794D01*
X14025Y159519D01*
X14023Y159494D01*
X14005Y159477D01*
X13887Y159191D01*
Y159166D01*
X13871Y159147D01*
X13778Y158852D01*
X13780Y158827D01*
X13766Y158806D01*
X13699Y158504D01*
X13703Y158480D01*
X13690Y158458D01*
X13650Y158151D01*
X13657Y158127D01*
X13646Y158105D01*
X13633Y157796D01*
X13637Y157784D01*
X13632Y157772D01*
Y46748D01*
X13637Y46737D01*
X13633Y46725D01*
X13646Y46416D01*
X13657Y46393D01*
X13650Y46369D01*
X13690Y46062D01*
X13703Y46041D01*
X13699Y46016D01*
X13766Y45714D01*
X13780Y45694D01*
X13778Y45669D01*
X13871Y45374D01*
X13887Y45355D01*
Y45329D01*
X14005Y45044D01*
X14023Y45026D01*
X14025Y45001D01*
X14168Y44727D01*
X14187Y44711D01*
X14192Y44686D01*
X14358Y44425D01*
X14378Y44411D01*
X14385Y44387D01*
X14573Y44142D01*
X14595Y44129D01*
X14603Y44105D01*
X14812Y43877D01*
X14835Y43867D01*
X14845Y43844D01*
X15073Y43635D01*
X15097Y43627D01*
X15110Y43605D01*
X15355Y43417D01*
X15379Y43410D01*
X15394Y43390D01*
X15654Y43224D01*
X15679Y43219D01*
X15695Y43200D01*
X15969Y43057D01*
X15994Y43055D01*
X16012Y43037D01*
X16298Y42919D01*
X16323D01*
X16342Y42903D01*
X16637Y42810D01*
X16662Y42812D01*
X16682Y42798D01*
X16984Y42731D01*
X17009Y42735D01*
X17031Y42722D01*
X17337Y42682D01*
X17361Y42689D01*
X17384Y42678D01*
X17693Y42664D01*
X17705Y42669D01*
X17717Y42664D01*
X142913D01*
X142925Y42669D01*
X142937Y42664D01*
X143246Y42678D01*
X143269Y42689D01*
X143293Y42682D01*
X143599Y42722D01*
X143621Y42735D01*
X143646Y42731D01*
X143948Y42798D01*
X143968Y42812D01*
X143993Y42810D01*
X144288Y42903D01*
X144307Y42919D01*
X144332D01*
X144618Y43037D01*
X144636Y43055D01*
X144661Y43057D01*
X144935Y43200D01*
X144951Y43219D01*
X144976Y43224D01*
X145236Y43390D01*
X145251Y43410D01*
X145275Y43417D01*
X145520Y43605D01*
X145533Y43627D01*
X145556Y43635D01*
X145784Y43844D01*
X145795Y43867D01*
X145818Y43877D01*
X146027Y44105D01*
X146035Y44129D01*
X146057Y44142D01*
X146245Y44387D01*
X146252Y44411D01*
X146272Y44425D01*
X146438Y44686D01*
X146443Y44711D01*
X146462Y44727D01*
X146605Y45001D01*
X146607Y45026D01*
X146625Y45044D01*
X146743Y45329D01*
Y45355D01*
X146759Y45374D01*
X146852Y45669D01*
X146850Y45694D01*
X146864Y45714D01*
X146931Y46016D01*
X146927Y46041D01*
X146939Y46062D01*
X146980Y46369D01*
X146973Y46393D01*
X146984Y46416D01*
X146997Y46725D01*
X146993Y46737D01*
X146998Y46748D01*
Y157772D01*
X146993Y157784D01*
X146997Y157796D01*
X146984Y158105D01*
X146973Y158127D01*
X146980Y158151D01*
X146939Y158458D01*
X146927Y158480D01*
X146931Y158504D01*
X146864Y158806D01*
X146850Y158827D01*
X146852Y158852D01*
X146759Y159147D01*
X146743Y159166D01*
Y159191D01*
X146625Y159477D01*
X146607Y159494D01*
X146605Y159519D01*
X146462Y159794D01*
X146443Y159810D01*
X146438Y159834D01*
X146272Y160095D01*
X146252Y160109D01*
X146245Y160134D01*
X146057Y160379D01*
X146035Y160392D01*
X146027Y160415D01*
X145818Y160643D01*
X145795Y160654D01*
X145784Y160677D01*
X145556Y160885D01*
X145533Y160894D01*
X145520Y160916D01*
X145275Y161104D01*
X145251Y161110D01*
X145236Y161131D01*
X144976Y161297D01*
X144951Y161301D01*
X144935Y161321D01*
X144661Y161463D01*
X144636Y161466D01*
X144618Y161483D01*
X144332Y161602D01*
X144307D01*
X144288Y161618D01*
X143993Y161711D01*
X143968Y161708D01*
X143948Y161723D01*
X143646Y161790D01*
X143621Y161785D01*
X143599Y161798D01*
X143293Y161838D01*
X143269Y161832D01*
X143246Y161843D01*
X142937Y161856D01*
X142925Y161852D01*
X142913Y161857D01*
D02*
G37*
G36*
X8868Y161663D02*
X7837D01*
Y160140D01*
X8868D01*
Y161663D01*
D02*
G37*
G36*
X6337D02*
X5305D01*
Y160140D01*
X6337D01*
Y161663D01*
D02*
G37*
G36*
X159555Y161563D02*
X156193D01*
Y158390D01*
X155806Y158073D01*
X155708Y158092D01*
X155611Y158073D01*
X155224Y158390D01*
Y161563D01*
X151862D01*
Y157217D01*
X152524D01*
Y157166D01*
X152601Y156775D01*
X152822Y156445D01*
X153610Y155657D01*
X153940Y155436D01*
X154331Y155359D01*
X154368D01*
X154496Y155166D01*
X155052Y154795D01*
X155708Y154664D01*
X156364Y154795D01*
X156920Y155166D01*
X157049Y155359D01*
X157283D01*
X157673Y155436D01*
X158004Y155657D01*
X158595Y156248D01*
X158816Y156579D01*
X158893Y156969D01*
Y157217D01*
X159555D01*
Y161563D01*
D02*
G37*
G36*
X147019Y165251D02*
X146363Y165121D01*
X145807Y164749D01*
X145436Y164193D01*
X145305Y163537D01*
X145436Y162881D01*
X145807Y162325D01*
X146363Y161953D01*
X147019Y161823D01*
X147150Y161849D01*
X147531Y161415D01*
Y157217D01*
X150893D01*
Y161563D01*
X149792D01*
X149742Y161813D01*
X149576Y162061D01*
X148628Y163009D01*
X148733Y163537D01*
X148603Y164193D01*
X148231Y164749D01*
X147675Y165121D01*
X147019Y165251D01*
D02*
G37*
G36*
X8868Y158640D02*
X7087D01*
X5305D01*
Y157116D01*
X6067D01*
Y155984D01*
X6145Y155594D01*
X6366Y155263D01*
X6696Y155042D01*
X7087Y154965D01*
X7477Y155042D01*
X7808Y155263D01*
X8029Y155594D01*
X8106Y155984D01*
Y157116D01*
X8868D01*
Y158640D01*
D02*
G37*
G36*
X153543Y151492D02*
X153153Y151415D01*
X152822Y151194D01*
X152601Y150863D01*
X152524Y150473D01*
Y149340D01*
X151762D01*
Y147817D01*
X155324D01*
Y149340D01*
X154563D01*
Y150473D01*
X154485Y150863D01*
X154264Y151194D01*
X153933Y151415D01*
X153543Y151492D01*
D02*
G37*
G36*
X8868Y138522D02*
X7087D01*
X5305D01*
Y136998D01*
X6067D01*
Y135866D01*
X6145Y135476D01*
X6366Y135145D01*
X6696Y134924D01*
X7087Y134847D01*
X7477Y134924D01*
X7808Y135145D01*
X8029Y135476D01*
X8106Y135866D01*
Y136998D01*
X8868D01*
Y138522D01*
D02*
G37*
G36*
X149264Y153983D02*
X148609Y153852D01*
X148052Y153481D01*
X147681Y152925D01*
X147550Y152269D01*
X147681Y151613D01*
X148052Y151057D01*
X148500Y150758D01*
Y149240D01*
X147531D01*
Y144894D01*
X148448D01*
Y141445D01*
X147531D01*
Y137099D01*
X150612D01*
Y132325D01*
X148672Y130384D01*
X148506Y130136D01*
X148448Y129844D01*
Y129122D01*
X147531D01*
Y124776D01*
X148448D01*
Y121327D01*
X147531D01*
Y116981D01*
X150612D01*
Y112207D01*
X148672Y110266D01*
X148506Y110018D01*
X148448Y109725D01*
Y109004D01*
X147531D01*
Y104658D01*
X148448D01*
Y101209D01*
X147531D01*
Y96862D01*
X150612D01*
Y92088D01*
X148672Y90148D01*
X148506Y89900D01*
X148448Y89607D01*
Y88886D01*
X147531D01*
Y84540D01*
X148448D01*
Y81091D01*
X147531D01*
Y76744D01*
X150612D01*
Y71970D01*
X148672Y70030D01*
X148506Y69782D01*
X148448Y69489D01*
Y68768D01*
X147531D01*
Y64421D01*
X148448D01*
Y60973D01*
X147531D01*
Y56626D01*
X150612D01*
Y51852D01*
X148672Y49912D01*
X148506Y49664D01*
X148448Y49371D01*
Y48650D01*
X147531D01*
Y44303D01*
X147826D01*
X148033Y43803D01*
X145427Y41198D01*
X142508D01*
Y42114D01*
X138161D01*
Y39040D01*
X133613D01*
X131680Y40974D01*
X131432Y41140D01*
X131139Y41198D01*
X130185D01*
Y42114D01*
X125838D01*
Y41198D01*
X120972D01*
Y42114D01*
X116626D01*
Y39033D01*
X113269D01*
X111329Y40974D01*
X111081Y41140D01*
X110788Y41198D01*
X108649D01*
Y42114D01*
X104303D01*
Y41198D01*
X99437D01*
Y42114D01*
X95090D01*
Y39033D01*
X91734D01*
X89793Y40974D01*
X89545Y41140D01*
X89253Y41198D01*
X87114D01*
Y42114D01*
X82767D01*
Y41198D01*
X77901D01*
Y42114D01*
X73555D01*
Y39033D01*
X70198D01*
X68258Y40974D01*
X68010Y41140D01*
X67717Y41198D01*
X65579D01*
Y42114D01*
X61232D01*
Y41198D01*
X56366D01*
Y42114D01*
X52020D01*
Y39033D01*
X48663D01*
X46722Y40974D01*
X46474Y41140D01*
X46182Y41198D01*
X44043D01*
Y42114D01*
X39697D01*
Y41198D01*
X34830D01*
Y42114D01*
X30484D01*
Y39033D01*
X27128D01*
X25187Y40974D01*
X24939Y41140D01*
X24646Y41198D01*
X22508D01*
Y42114D01*
X18161D01*
Y41710D01*
X14295D01*
X13905Y41633D01*
X13574Y41412D01*
X11938Y39776D01*
X11717Y39445D01*
X11639Y39055D01*
Y24473D01*
X11717Y24083D01*
X11938Y23752D01*
X16894Y18796D01*
Y6091D01*
X16258D01*
X16232Y6091D01*
X15757Y6151D01*
Y6191D01*
X14726D01*
Y1260D01*
Y-3671D01*
X15757D01*
Y-3632D01*
X16232Y-3571D01*
X16258Y-3571D01*
X19594D01*
Y-366D01*
X20095Y-114D01*
X20169Y-169D01*
Y-3571D01*
X23531D01*
Y-169D01*
X23606Y-114D01*
X24106Y-366D01*
Y-3571D01*
X27468D01*
Y6091D01*
X26807D01*
Y23295D01*
X26729Y23685D01*
X26508Y24016D01*
X21354Y29170D01*
Y30091D01*
X22508D01*
Y33453D01*
X18161D01*
Y30091D01*
X19315D01*
Y28748D01*
X19392Y28357D01*
X19613Y28027D01*
X24768Y22872D01*
Y10784D01*
X24268Y10735D01*
X24159Y11280D01*
X23614Y12097D01*
X22797Y12642D01*
X21834Y12834D01*
X20871Y12642D01*
X20054Y12097D01*
X19509Y11280D01*
X19433Y10899D01*
X18933Y10949D01*
Y19219D01*
X18855Y19609D01*
X18634Y19940D01*
X13679Y24895D01*
Y38633D01*
X14717Y39671D01*
X18161D01*
Y38752D01*
X22508D01*
Y39669D01*
X24330D01*
X26270Y37728D01*
X26270Y37728D01*
X26518Y37562D01*
X26811Y37504D01*
X26811Y37504D01*
X29596D01*
X29680Y37403D01*
X29712Y36823D01*
X28925Y36036D01*
X28703Y35705D01*
X28626Y35315D01*
Y35278D01*
X28433Y35149D01*
X28062Y34593D01*
X27931Y33937D01*
X28062Y33281D01*
X28433Y32725D01*
X28626Y32597D01*
Y32362D01*
X28703Y31972D01*
X28925Y31641D01*
X29515Y31051D01*
X29846Y30830D01*
X30236Y30752D01*
X30484D01*
Y30091D01*
X34830D01*
Y33453D01*
X31657D01*
X31340Y33839D01*
X31359Y33937D01*
X31340Y34035D01*
X31657Y34421D01*
X34830D01*
Y37504D01*
X36643D01*
X37293Y36853D01*
Y35583D01*
X37352Y35291D01*
X37517Y35043D01*
X39697Y32864D01*
Y30091D01*
X44043D01*
Y33453D01*
X41270D01*
X40864Y33860D01*
X41055Y34321D01*
X41120D01*
Y36103D01*
Y37884D01*
X39597D01*
Y35867D01*
X39142Y35670D01*
X38823Y35930D01*
Y37170D01*
X38823Y37170D01*
X38765Y37463D01*
X38599Y37711D01*
X38599Y37711D01*
X37500Y38809D01*
X37252Y38975D01*
X36960Y39033D01*
X34830D01*
Y39669D01*
X39697D01*
Y38752D01*
X44043D01*
Y39669D01*
X45865D01*
X47806Y37728D01*
X47806Y37728D01*
X48054Y37562D01*
X48346Y37504D01*
X48346Y37504D01*
X51131D01*
X51215Y37403D01*
X51247Y36823D01*
X50460Y36036D01*
X50239Y35705D01*
X50161Y35315D01*
Y35278D01*
X49969Y35149D01*
X49597Y34593D01*
X49467Y33937D01*
X49597Y33281D01*
X49969Y32725D01*
X50161Y32597D01*
Y32362D01*
X50239Y31972D01*
X50460Y31641D01*
X51051Y31051D01*
X51381Y30830D01*
X51771Y30752D01*
X52020D01*
Y30091D01*
X56366D01*
Y33453D01*
X53193D01*
X52876Y33839D01*
X52895Y33937D01*
X52876Y34035D01*
X53193Y34421D01*
X56366D01*
Y37504D01*
X58178D01*
X58829Y36853D01*
Y35583D01*
X58887Y35291D01*
X59053Y35043D01*
X61232Y32864D01*
Y30091D01*
X65579D01*
Y33453D01*
X62806D01*
X62399Y33860D01*
X62590Y34321D01*
X62655D01*
Y36103D01*
Y37884D01*
X61132D01*
Y35867D01*
X60678Y35670D01*
X60358Y35930D01*
Y37170D01*
X60358Y37170D01*
X60300Y37463D01*
X60134Y37711D01*
X60134Y37711D01*
X59036Y38809D01*
X58788Y38975D01*
X58495Y39033D01*
X56366D01*
Y39669D01*
X61232D01*
Y38752D01*
X65579D01*
Y39669D01*
X67400D01*
X69341Y37728D01*
X69341Y37728D01*
X69589Y37562D01*
X69882Y37504D01*
X69882Y37504D01*
X72667D01*
X72750Y37403D01*
X72783Y36823D01*
X71995Y36036D01*
X71774Y35705D01*
X71697Y35315D01*
Y35278D01*
X71504Y35149D01*
X71133Y34593D01*
X71002Y33937D01*
X71133Y33281D01*
X71504Y32725D01*
X71697Y32597D01*
Y32362D01*
X71774Y31972D01*
X71995Y31641D01*
X72586Y31051D01*
X72917Y30830D01*
X73307Y30752D01*
X73555D01*
Y30091D01*
X77901D01*
Y33453D01*
X74728D01*
X74411Y33839D01*
X74430Y33937D01*
X74411Y34035D01*
X74728Y34421D01*
X77901D01*
Y37504D01*
X79714D01*
X80364Y36853D01*
Y35583D01*
X80423Y35291D01*
X80588Y35043D01*
X82767Y32864D01*
Y30091D01*
X87114D01*
Y33453D01*
X84341D01*
X83934Y33860D01*
X84126Y34321D01*
X84191D01*
Y36103D01*
Y37884D01*
X82667D01*
Y35866D01*
X82213Y35670D01*
X81894Y35930D01*
Y37170D01*
X81894Y37170D01*
X81836Y37463D01*
X81670Y37711D01*
X81670Y37711D01*
X80571Y38809D01*
X80323Y38975D01*
X80030Y39033D01*
X77901D01*
Y39669D01*
X82767D01*
Y38752D01*
X87114D01*
Y39669D01*
X88936D01*
X90876Y37728D01*
X90876Y37728D01*
X91124Y37562D01*
X91417Y37504D01*
X91417Y37504D01*
X94202D01*
X94286Y37403D01*
X94318Y36823D01*
X93531Y36036D01*
X93310Y35705D01*
X93232Y35315D01*
Y35278D01*
X93040Y35149D01*
X92668Y34593D01*
X92538Y33937D01*
X92668Y33281D01*
X93040Y32725D01*
X93232Y32597D01*
Y32362D01*
X93310Y31972D01*
X93531Y31641D01*
X94121Y31051D01*
X94452Y30830D01*
X94842Y30752D01*
X95090D01*
Y30091D01*
X99437D01*
Y33453D01*
X96263D01*
X95946Y33839D01*
X95966Y33937D01*
X95946Y34035D01*
X96263Y34421D01*
X99437D01*
Y37504D01*
X101249D01*
X101900Y36853D01*
Y35583D01*
X101958Y35291D01*
X102124Y35043D01*
X104303Y32864D01*
Y30091D01*
X108649D01*
Y33453D01*
X105876D01*
X105470Y33860D01*
X105661Y34321D01*
X105726D01*
Y36103D01*
Y37884D01*
X104203D01*
Y35866D01*
X103749Y35670D01*
X103429Y35930D01*
Y37170D01*
X103429Y37170D01*
X103371Y37463D01*
X103205Y37711D01*
X103205Y37711D01*
X102106Y38809D01*
X101858Y38975D01*
X101566Y39033D01*
X99437D01*
Y39669D01*
X104303D01*
Y38752D01*
X108649D01*
Y39669D01*
X110471D01*
X112412Y37728D01*
X112412Y37728D01*
X112660Y37562D01*
X112953Y37504D01*
X112953Y37504D01*
X115737D01*
X115821Y37403D01*
X115854Y36823D01*
X115066Y36036D01*
X114845Y35705D01*
X114768Y35315D01*
Y35278D01*
X114575Y35149D01*
X114204Y34593D01*
X114073Y33937D01*
X114204Y33281D01*
X114575Y32725D01*
X114768Y32597D01*
Y32362D01*
X114845Y31972D01*
X115066Y31641D01*
X115657Y31051D01*
X115988Y30830D01*
X116378Y30752D01*
X116626D01*
Y30091D01*
X120972D01*
Y33453D01*
X117799D01*
X117482Y33839D01*
X117501Y33937D01*
X117482Y34035D01*
X117799Y34421D01*
X120972D01*
Y37504D01*
X122785D01*
X123435Y36853D01*
Y35583D01*
X123494Y35291D01*
X123659Y35043D01*
X125838Y32864D01*
Y30091D01*
X130185D01*
Y33453D01*
X127412D01*
X127005Y33860D01*
X127197Y34321D01*
X127262D01*
Y36103D01*
Y37884D01*
X125738D01*
Y35867D01*
X125284Y35670D01*
X124965Y35930D01*
Y37170D01*
X124965Y37170D01*
X124907Y37463D01*
X124741Y37711D01*
X124741Y37711D01*
X123642Y38809D01*
X123394Y38975D01*
X123101Y39033D01*
X120972D01*
Y39669D01*
X125838D01*
Y38752D01*
X130185D01*
Y39669D01*
X130822D01*
X132756Y37735D01*
X132756Y37735D01*
X133004Y37569D01*
X133297Y37511D01*
X133297Y37511D01*
X137323D01*
X137388Y37424D01*
X137389Y36823D01*
X136602Y36036D01*
X136381Y35705D01*
X136303Y35315D01*
Y35278D01*
X136111Y35149D01*
X135739Y34593D01*
X135609Y33937D01*
X135739Y33281D01*
X136111Y32725D01*
X136303Y32597D01*
Y32362D01*
X136381Y31972D01*
X136602Y31641D01*
X137192Y31051D01*
X137523Y30830D01*
X137913Y30752D01*
X138161D01*
Y30091D01*
X142508D01*
Y33453D01*
X139334D01*
X139017Y33839D01*
X139037Y33937D01*
X139017Y34035D01*
X139334Y34421D01*
X142508D01*
Y37511D01*
X149673D01*
X149966Y37569D01*
X150214Y37735D01*
X156782Y44303D01*
X159555D01*
Y48650D01*
X156193D01*
Y45877D01*
X155786Y45470D01*
X155324Y45662D01*
Y45727D01*
X151762D01*
Y44203D01*
X153866D01*
X154057Y43741D01*
X149356Y39040D01*
X142508D01*
Y39669D01*
X145744D01*
X146037Y39727D01*
X146285Y39893D01*
X149753Y43361D01*
X149919Y43609D01*
X149977Y43902D01*
Y44303D01*
X150893D01*
Y48650D01*
X150208D01*
X150073Y49150D01*
X151918Y50995D01*
X151918Y50995D01*
X152084Y51243D01*
X152142Y51535D01*
X152142Y51536D01*
Y55737D01*
X152243Y55821D01*
X152822Y55854D01*
X153610Y55067D01*
X153940Y54846D01*
X154331Y54768D01*
X154368D01*
X154496Y54576D01*
X155052Y54204D01*
X155708Y54074D01*
X156364Y54204D01*
X156920Y54576D01*
X157049Y54768D01*
X157283D01*
X157673Y54846D01*
X158004Y55067D01*
X158595Y55657D01*
X158816Y55988D01*
X158893Y56378D01*
Y56626D01*
X159555D01*
Y60973D01*
X156193D01*
Y57799D01*
X155806Y57482D01*
X155708Y57502D01*
X155611Y57482D01*
X155224Y57799D01*
Y60973D01*
X152395D01*
X152247Y61473D01*
X152792Y62018D01*
X154062D01*
X154355Y62076D01*
X154603Y62242D01*
X156782Y64421D01*
X159555D01*
Y68768D01*
X156193D01*
Y65995D01*
X155786Y65588D01*
X155324Y65780D01*
Y65845D01*
X151762D01*
Y64321D01*
X153779D01*
X153976Y63867D01*
X153716Y63548D01*
X152476D01*
X152476Y63548D01*
X152183Y63489D01*
X151935Y63324D01*
X151935Y63324D01*
X150836Y62225D01*
X150671Y61977D01*
X150612Y61684D01*
Y60973D01*
X149977D01*
Y64421D01*
X150893D01*
Y68768D01*
X150208D01*
X150073Y69268D01*
X151918Y71113D01*
X151918Y71113D01*
X152084Y71361D01*
X152142Y71654D01*
X152142Y71654D01*
Y75855D01*
X152243Y75939D01*
X152822Y75972D01*
X153610Y75185D01*
X153940Y74964D01*
X154331Y74886D01*
X154368D01*
X154496Y74694D01*
X155052Y74322D01*
X155708Y74192D01*
X156364Y74322D01*
X156920Y74694D01*
X157049Y74886D01*
X157283D01*
X157673Y74964D01*
X158004Y75185D01*
X158595Y75775D01*
X158816Y76106D01*
X158893Y76496D01*
Y76744D01*
X159555D01*
Y81091D01*
X156193D01*
Y77917D01*
X155806Y77600D01*
X155708Y77620D01*
X155611Y77600D01*
X155224Y77917D01*
Y81091D01*
X152395D01*
X152247Y81591D01*
X152792Y82136D01*
X154062D01*
X154355Y82195D01*
X154603Y82360D01*
X156782Y84540D01*
X159555D01*
Y88886D01*
X156193D01*
Y86113D01*
X155786Y85707D01*
X155324Y85898D01*
Y85963D01*
X151762D01*
Y84439D01*
X153779D01*
X153976Y83985D01*
X153716Y83666D01*
X152476D01*
X152476Y83666D01*
X152183Y83608D01*
X151935Y83442D01*
X151935Y83442D01*
X150836Y82343D01*
X150671Y82095D01*
X150612Y81802D01*
Y81091D01*
X149977D01*
Y84540D01*
X150893D01*
Y88886D01*
X150208D01*
X150073Y89386D01*
X151918Y91231D01*
X151918Y91231D01*
X152084Y91479D01*
X152142Y91772D01*
X152142Y91772D01*
Y95974D01*
X152243Y96057D01*
X152822Y96090D01*
X153610Y95303D01*
X153940Y95082D01*
X154331Y95004D01*
X154368D01*
X154496Y94812D01*
X155052Y94440D01*
X155708Y94310D01*
X156364Y94440D01*
X156920Y94812D01*
X157049Y95004D01*
X157283D01*
X157673Y95082D01*
X158004Y95303D01*
X158595Y95893D01*
X158816Y96224D01*
X158893Y96614D01*
Y96862D01*
X159555D01*
Y101209D01*
X156193D01*
Y98036D01*
X155806Y97718D01*
X155708Y97738D01*
X155611Y97718D01*
X155224Y98036D01*
Y101209D01*
X152395D01*
X152247Y101709D01*
X152792Y102254D01*
X154062D01*
X154355Y102313D01*
X154603Y102478D01*
X156782Y104658D01*
X159555D01*
Y109004D01*
X156193D01*
Y106231D01*
X155786Y105824D01*
X155324Y106016D01*
Y106081D01*
X151762D01*
Y104558D01*
X153779D01*
X153976Y104103D01*
X153716Y103784D01*
X152476D01*
X152476Y103784D01*
X152183Y103726D01*
X151935Y103560D01*
X151935Y103560D01*
X150836Y102461D01*
X150671Y102213D01*
X150612Y101920D01*
Y101209D01*
X149977D01*
Y104658D01*
X150893D01*
Y109004D01*
X150208D01*
X150073Y109504D01*
X151918Y111349D01*
X151918Y111349D01*
X152084Y111597D01*
X152142Y111890D01*
X152142Y111890D01*
Y116092D01*
X152243Y116176D01*
X152822Y116208D01*
X153610Y115421D01*
X153940Y115200D01*
X154331Y115122D01*
X154368D01*
X154496Y114930D01*
X155052Y114558D01*
X155708Y114428D01*
X156364Y114558D01*
X156920Y114930D01*
X157049Y115122D01*
X157283D01*
X157673Y115200D01*
X158004Y115421D01*
X158595Y116012D01*
X158816Y116342D01*
X158893Y116733D01*
Y116981D01*
X159555D01*
Y121327D01*
X156193D01*
Y118154D01*
X155806Y117836D01*
X155708Y117856D01*
X155611Y117836D01*
X155224Y118154D01*
Y121327D01*
X152395D01*
X152247Y121827D01*
X152792Y122373D01*
X154062D01*
X154355Y122431D01*
X154603Y122597D01*
X156782Y124776D01*
X159555D01*
Y129122D01*
X156193D01*
Y126349D01*
X155786Y125943D01*
X155324Y126134D01*
Y126199D01*
X151762D01*
Y124676D01*
X153779D01*
X153976Y124221D01*
X153716Y123902D01*
X152476D01*
X152476Y123902D01*
X152183Y123844D01*
X151935Y123678D01*
X151935Y123678D01*
X150836Y122579D01*
X150671Y122331D01*
X150612Y122039D01*
Y121327D01*
X149977D01*
Y124776D01*
X150893D01*
Y129122D01*
X150207D01*
X150073Y129622D01*
X151918Y131467D01*
X151918Y131467D01*
X152084Y131716D01*
X152142Y132008D01*
X152142Y132008D01*
Y136210D01*
X152243Y136294D01*
X152822Y136327D01*
X153610Y135539D01*
X153940Y135318D01*
X154331Y135240D01*
X154368D01*
X154496Y135048D01*
X155052Y134677D01*
X155708Y134546D01*
X156364Y134677D01*
X156920Y135048D01*
X157049Y135240D01*
X157283D01*
X157673Y135318D01*
X158004Y135539D01*
X158595Y136130D01*
X158816Y136460D01*
X158893Y136851D01*
Y137099D01*
X159555D01*
Y141445D01*
X156193D01*
Y138272D01*
X155806Y137955D01*
X155708Y137974D01*
X155611Y137955D01*
X155224Y138272D01*
Y141445D01*
X152395D01*
X152247Y141945D01*
X152792Y142491D01*
X154062D01*
X154355Y142549D01*
X154603Y142715D01*
X156782Y144894D01*
X159555D01*
Y149240D01*
X156193D01*
Y146467D01*
X155786Y146061D01*
X155324Y146252D01*
Y146317D01*
X151762D01*
Y144794D01*
X153779D01*
X153975Y144339D01*
X153716Y144020D01*
X152476D01*
X152476Y144020D01*
X152183Y143962D01*
X151935Y143796D01*
X151935Y143796D01*
X150836Y142698D01*
X150671Y142449D01*
X150612Y142157D01*
Y141445D01*
X149977D01*
Y144894D01*
X150893D01*
Y149240D01*
X150029D01*
Y150758D01*
X150476Y151057D01*
X150848Y151613D01*
X150978Y152269D01*
X150848Y152925D01*
X150476Y153481D01*
X149920Y153852D01*
X149264Y153983D01*
D02*
G37*
G36*
X153543Y131374D02*
X153153Y131297D01*
X152822Y131076D01*
X152601Y130745D01*
X152524Y130354D01*
Y129222D01*
X151762D01*
Y127699D01*
X155324D01*
Y129222D01*
X154563D01*
Y130354D01*
X154485Y130745D01*
X154264Y131076D01*
X153933Y131297D01*
X153543Y131374D01*
D02*
G37*
G36*
X8868Y118403D02*
X7087D01*
X5305D01*
Y116880D01*
X6067D01*
Y115748D01*
X6145Y115358D01*
X6366Y115027D01*
X6696Y114806D01*
X7087Y114728D01*
X7477Y114806D01*
X7808Y115027D01*
X8029Y115358D01*
X8106Y115748D01*
Y116880D01*
X8868D01*
Y118403D01*
D02*
G37*
G36*
X153543Y111256D02*
X153153Y111178D01*
X152822Y110957D01*
X152601Y110627D01*
X152524Y110236D01*
Y109104D01*
X151762D01*
Y107581D01*
X155324D01*
Y109104D01*
X154563D01*
Y110236D01*
X154485Y110627D01*
X154264Y110957D01*
X153933Y111178D01*
X153543Y111256D01*
D02*
G37*
G36*
X8868Y98286D02*
X7087D01*
X5305D01*
Y96762D01*
X6067D01*
Y95630D01*
X6145Y95240D01*
X6366Y94909D01*
X6696Y94688D01*
X7087Y94610D01*
X7477Y94688D01*
X7808Y94909D01*
X8029Y95240D01*
X8106Y95630D01*
Y96762D01*
X8868D01*
Y98286D01*
D02*
G37*
G36*
X153543Y91138D02*
X153153Y91060D01*
X152822Y90839D01*
X152601Y90509D01*
X152524Y90118D01*
Y88986D01*
X151762D01*
Y87463D01*
X155324D01*
Y88986D01*
X154563D01*
Y90118D01*
X154485Y90509D01*
X154264Y90839D01*
X153933Y91060D01*
X153543Y91138D01*
D02*
G37*
G36*
X8868Y78167D02*
X7087D01*
X5305D01*
Y76644D01*
X6067D01*
Y75512D01*
X6145Y75122D01*
X6366Y74791D01*
X6696Y74570D01*
X7087Y74492D01*
X7477Y74570D01*
X7808Y74791D01*
X8029Y75122D01*
X8106Y75512D01*
Y76644D01*
X8868D01*
Y78167D01*
D02*
G37*
G36*
X153543Y71020D02*
X153153Y70942D01*
X152822Y70721D01*
X152601Y70390D01*
X152524Y70000D01*
Y68868D01*
X151762D01*
Y67345D01*
X155324D01*
Y68868D01*
X154563D01*
Y70000D01*
X154485Y70390D01*
X154264Y70721D01*
X153933Y70942D01*
X153543Y71020D01*
D02*
G37*
G36*
X8868Y58049D02*
X7087D01*
X5305D01*
Y56526D01*
X6067D01*
Y55394D01*
X6145Y55003D01*
X6366Y54673D01*
X6696Y54452D01*
X7087Y54374D01*
X7477Y54452D01*
X7808Y54673D01*
X8029Y55003D01*
X8106Y55394D01*
Y56526D01*
X8868D01*
Y58049D01*
D02*
G37*
G36*
X153543Y50902D02*
X153153Y50824D01*
X152822Y50603D01*
X152601Y50272D01*
X152524Y49882D01*
Y48750D01*
X151762D01*
Y47227D01*
X155324D01*
Y48750D01*
X154563D01*
Y49882D01*
X154485Y50272D01*
X154264Y50603D01*
X153933Y50824D01*
X153543Y50902D01*
D02*
G37*
G36*
X4921Y51202D02*
X4265Y51072D01*
X3709Y50700D01*
X3581Y50508D01*
X3347D01*
X2956Y50430D01*
X2626Y50209D01*
X2035Y49619D01*
X1814Y49288D01*
X1736Y48898D01*
Y48650D01*
X1075D01*
Y44303D01*
X4437D01*
Y47476D01*
X4823Y47794D01*
X4921Y47774D01*
X5019Y47794D01*
X5406Y47476D01*
Y44303D01*
X8768D01*
Y48650D01*
X8106D01*
Y48701D01*
X8029Y49091D01*
X7808Y49422D01*
X7020Y50209D01*
X6689Y50430D01*
X6299Y50508D01*
X6262D01*
X6133Y50700D01*
X5577Y51072D01*
X4921Y51202D01*
D02*
G37*
G36*
X19584Y37884D02*
X18061D01*
Y36852D01*
X19584D01*
Y37884D01*
D02*
G37*
G36*
X13098Y48650D02*
X9736D01*
Y44303D01*
X10398D01*
Y42290D01*
X8459Y40351D01*
X8237Y40020D01*
X8160Y39630D01*
Y39190D01*
X7961Y39057D01*
X7589Y38501D01*
X7459Y37845D01*
X7589Y37189D01*
X7961Y36633D01*
X8517Y36261D01*
X9173Y36131D01*
X9829Y36261D01*
X10385Y36633D01*
X10756Y37189D01*
X10887Y37845D01*
X10756Y38501D01*
X10385Y39057D01*
X10544Y39552D01*
X12138Y41146D01*
X12359Y41477D01*
X12437Y41867D01*
Y44303D01*
X13098D01*
Y48650D01*
D02*
G37*
G36*
X130285Y37884D02*
X128762D01*
Y36103D01*
Y34321D01*
X130285D01*
Y35083D01*
X131417D01*
X131807Y35161D01*
X132138Y35382D01*
X132359Y35712D01*
X132437Y36103D01*
X132359Y36493D01*
X132138Y36823D01*
X131807Y37045D01*
X131417Y37122D01*
X130285D01*
Y37884D01*
D02*
G37*
G36*
X108749D02*
X107226D01*
Y36103D01*
Y34321D01*
X108749D01*
Y35083D01*
X109882D01*
X110272Y35161D01*
X110603Y35382D01*
X110824Y35712D01*
X110901Y36103D01*
X110824Y36493D01*
X110603Y36823D01*
X110272Y37045D01*
X109882Y37122D01*
X108749D01*
Y37884D01*
D02*
G37*
G36*
X87214D02*
X85691D01*
Y36103D01*
Y34321D01*
X87214D01*
Y35083D01*
X88346D01*
X88736Y35161D01*
X89067Y35382D01*
X89288Y35712D01*
X89366Y36103D01*
X89288Y36493D01*
X89067Y36823D01*
X88736Y37045D01*
X88346Y37122D01*
X87214D01*
Y37884D01*
D02*
G37*
G36*
X65679D02*
X64155D01*
Y36103D01*
Y34321D01*
X65679D01*
Y35083D01*
X66811D01*
X67201Y35161D01*
X67532Y35382D01*
X67753Y35712D01*
X67830Y36103D01*
X67753Y36493D01*
X67532Y36823D01*
X67201Y37045D01*
X66811Y37122D01*
X65679D01*
Y37884D01*
D02*
G37*
G36*
X44143D02*
X42620D01*
Y36103D01*
Y34321D01*
X44143D01*
Y35083D01*
X45275D01*
X45665Y35161D01*
X45996Y35382D01*
X46217Y35712D01*
X46295Y36103D01*
X46217Y36493D01*
X45996Y36823D01*
X45665Y37045D01*
X45275Y37122D01*
X44143D01*
Y37884D01*
D02*
G37*
G36*
X22608D02*
X21084D01*
Y36103D01*
Y34321D01*
X22608D01*
Y35083D01*
X23740D01*
X24130Y35161D01*
X24461Y35382D01*
X24682Y35712D01*
X24759Y36103D01*
X24682Y36493D01*
X24461Y36823D01*
X24130Y37045D01*
X23740Y37122D01*
X22608D01*
Y37884D01*
D02*
G37*
G36*
X19584Y35353D02*
X18061D01*
Y34321D01*
X19584D01*
Y35353D01*
D02*
G37*
G36*
X140743Y14174D02*
X139780Y13982D01*
X138964Y13437D01*
X138418Y12620D01*
X138226Y11657D01*
X138418Y10694D01*
X138964Y9877D01*
X139230Y9699D01*
Y8310D01*
X139147Y8239D01*
X138760Y8073D01*
X138308Y8525D01*
X138353Y8752D01*
X138223Y9408D01*
X137851Y9964D01*
X137295Y10336D01*
X136639Y10466D01*
X135983Y10336D01*
X135427Y9964D01*
X135055Y9408D01*
X134925Y8752D01*
X135055Y8096D01*
X135427Y7540D01*
X135983Y7169D01*
X136639Y7038D01*
X136866Y7083D01*
X137563Y6386D01*
Y5697D01*
X136927D01*
X136902Y5697D01*
X136427Y5758D01*
Y5797D01*
X135396D01*
Y866D01*
Y-4065D01*
X136427D01*
Y-4025D01*
X136902Y-3965D01*
X136927Y-3965D01*
X140264D01*
Y5697D01*
X139602D01*
Y6568D01*
X140102Y6775D01*
X140727Y6151D01*
X140839Y5697D01*
X140839D01*
Y-3965D01*
X144201D01*
Y5697D01*
X144033D01*
Y6498D01*
X144033Y6498D01*
X143958Y6872D01*
X144172Y7077D01*
X144409Y7173D01*
X144520Y7098D01*
X145176Y6968D01*
X145437Y6510D01*
Y5697D01*
X144776D01*
Y-3965D01*
X148138D01*
Y5697D01*
X147476D01*
Y7401D01*
X147399Y7791D01*
X147178Y8122D01*
X146845Y8455D01*
X146890Y8682D01*
X146759Y9338D01*
X146388Y9894D01*
X145832Y10266D01*
X145176Y10396D01*
X144520Y10266D01*
X143964Y9894D01*
X143592Y9338D01*
X143462Y8682D01*
X143531Y8334D01*
X143070Y8087D01*
X142257Y8901D01*
Y9699D01*
X142523Y9877D01*
X143069Y10694D01*
X143260Y11657D01*
X143069Y12620D01*
X142523Y13437D01*
X141707Y13982D01*
X140743Y14174D01*
D02*
G37*
G36*
X13226Y6191D02*
X12195D01*
Y2010D01*
X13226D01*
Y6191D01*
D02*
G37*
G36*
X133896Y5797D02*
X132865D01*
Y1616D01*
X133896D01*
Y5797D01*
D02*
G37*
G36*
X13226Y510D02*
X12195D01*
Y-3671D01*
X13226D01*
Y510D01*
D02*
G37*
G36*
X133896Y116D02*
X132865D01*
Y-4065D01*
X133896D01*
Y116D01*
D02*
G37*
G36*
X38886Y-2571D02*
X30799D01*
Y-13807D01*
X38886D01*
Y-2571D01*
D02*
G37*
G36*
X8965D02*
X878D01*
Y-13807D01*
X8965D01*
Y-2571D01*
D02*
G37*
G36*
X159555Y-2965D02*
X151469D01*
Y-14201D01*
X159555D01*
Y-2965D01*
D02*
G37*
G36*
X129634D02*
X121547D01*
Y-14201D01*
X129634D01*
Y-2965D01*
D02*
G37*
%LPD*%
D11*
X20334Y36103D02*
X23740D01*
X29645Y32362D02*
Y35315D01*
Y32362D02*
X30236Y31772D01*
X32657D01*
X29645Y35315D02*
X30433Y36103D01*
X32657D01*
X51968D02*
X54193D01*
X51181Y35315D02*
X51968Y36103D01*
X51771Y31772D02*
X54193D01*
X51181Y32362D02*
X51771Y31772D01*
X51181Y32362D02*
Y35315D01*
X41870Y36103D02*
X45275D01*
X63405D02*
X66811D01*
X72716Y32362D02*
Y35315D01*
Y32362D02*
X73307Y31772D01*
X75728D01*
X72716Y35315D02*
X73504Y36103D01*
X75728D01*
X95039D02*
X97264D01*
X94252Y35315D02*
X95039Y36103D01*
X94842Y31772D02*
X97264D01*
X94252Y32362D02*
X94842Y31772D01*
X94252Y32362D02*
Y35315D01*
X84941Y36103D02*
X88346D01*
X106476D02*
X109882D01*
X115787Y32362D02*
Y35315D01*
Y32362D02*
X116378Y31772D01*
X118799D01*
X115787Y35315D02*
X116575Y36103D01*
X118799D01*
X138110D02*
X140334D01*
X137323Y35315D02*
X138110Y36103D01*
X137913Y31772D02*
X140334D01*
X137323Y32362D02*
X137913Y31772D01*
X137323Y32362D02*
Y35315D01*
X128012Y36103D02*
X131417D01*
X153543Y46477D02*
Y49882D01*
X154331Y55788D02*
X157283D01*
X157874Y56378D01*
Y58799D01*
X153543Y56575D02*
X154331Y55788D01*
X153543Y56575D02*
Y58799D01*
Y76693D02*
Y78917D01*
Y76693D02*
X154331Y75906D01*
X157874Y76496D02*
Y78917D01*
X157283Y75906D02*
X157874Y76496D01*
X154331Y75906D02*
X157283D01*
X153543Y66595D02*
Y70000D01*
Y86713D02*
Y90118D01*
X154331Y96024D02*
X157283D01*
X157874Y96614D01*
Y99036D01*
X153543Y96811D02*
X154331Y96024D01*
X153543Y96811D02*
Y99036D01*
Y116929D02*
Y119154D01*
Y116929D02*
X154331Y116142D01*
X157874Y116733D02*
Y119154D01*
X157283Y116142D02*
X157874Y116733D01*
X154331Y116142D02*
X157283D01*
X153543Y106831D02*
Y110236D01*
Y126949D02*
Y130354D01*
X154331Y136260D02*
X157283D01*
X157874Y136851D01*
Y139272D01*
X153543Y137047D02*
X154331Y136260D01*
X153543Y137047D02*
Y139272D01*
Y157166D02*
Y159390D01*
Y157166D02*
X154331Y156378D01*
X157874Y156969D02*
Y159390D01*
X157283Y156378D02*
X157874Y156969D01*
X154331Y156378D02*
X157283D01*
X153543Y147067D02*
Y150473D01*
X20334Y168898D02*
X23740D01*
X29645Y165158D02*
Y168110D01*
Y165158D02*
X30236Y164567D01*
X32657D01*
X29645Y168110D02*
X30433Y168898D01*
X32657D01*
X51968D02*
X54193D01*
X51181Y168110D02*
X51968Y168898D01*
X51771Y164567D02*
X54193D01*
X51181Y165158D02*
X51771Y164567D01*
X51181Y165158D02*
Y168110D01*
X41870Y168898D02*
X45275D01*
X63405D02*
X66811D01*
X72716Y165158D02*
Y168110D01*
Y165158D02*
X73307Y164567D01*
X75728D01*
X72716Y168110D02*
X73504Y168898D01*
X75728D01*
X95039D02*
X97264D01*
X94252Y168110D02*
X95039Y168898D01*
X94842Y164567D02*
X97264D01*
X94252Y165158D02*
X94842Y164567D01*
X94252Y165158D02*
Y168110D01*
X84941Y168898D02*
X88346D01*
X106476D02*
X109882D01*
X115787Y165158D02*
Y168110D01*
Y165158D02*
X116378Y164567D01*
X118799D01*
X115787Y168110D02*
X116575Y168898D01*
X118799D01*
X138110D02*
X140334D01*
X137323Y168110D02*
X138110Y168898D01*
X137913Y164567D02*
X140334D01*
X137323Y165158D02*
X137913Y164567D01*
X137323Y165158D02*
Y168110D01*
X128012Y168898D02*
X131417D01*
X153543Y177421D02*
Y180827D01*
X154331Y186732D02*
X157283D01*
X157874Y187323D01*
Y189744D01*
X153543Y187520D02*
X154331Y186732D01*
X153543Y187520D02*
Y189744D01*
Y207638D02*
Y209862D01*
Y207638D02*
X154331Y206851D01*
X157874Y207441D02*
Y209862D01*
X157283Y206851D02*
X157874Y207441D01*
X154331Y206851D02*
X157283D01*
X153543Y197540D02*
Y200945D01*
Y217658D02*
Y221063D01*
X154331Y226969D02*
X157283D01*
X157874Y227559D01*
Y229980D01*
X153543Y227756D02*
X154331Y226969D01*
X153543Y227756D02*
Y229980D01*
Y247874D02*
Y250099D01*
Y247874D02*
X154331Y247087D01*
X157874Y247677D02*
Y250099D01*
X157283Y247087D02*
X157874Y247677D01*
X154331Y247087D02*
X157283D01*
X153543Y237776D02*
Y241181D01*
Y257894D02*
Y261299D01*
X154331Y267205D02*
X157283D01*
X157874Y267795D01*
Y270217D01*
X153543Y267992D02*
X154331Y267205D01*
X153543Y267992D02*
Y270217D01*
Y288110D02*
Y290335D01*
Y288110D02*
X154331Y287323D01*
X157874Y287914D02*
Y290335D01*
X157283Y287323D02*
X157874Y287914D01*
X154331Y287323D02*
X157283D01*
X153543Y278012D02*
Y281417D01*
X136929Y300670D02*
X140334D01*
X131023Y301457D02*
Y304410D01*
X130433Y305000D02*
X131023Y304410D01*
X128012Y305000D02*
X130433D01*
X130236Y300670D02*
X131023Y301457D01*
X128012Y300670D02*
X130236D01*
X106476D02*
X108701D01*
X109488Y301457D01*
X106476Y305000D02*
X108897D01*
X109488Y304410D01*
Y301457D02*
Y304410D01*
X115393Y300670D02*
X118799D01*
X93858D02*
X97263D01*
X87953Y301457D02*
Y304410D01*
X87362Y305000D02*
X87953Y304410D01*
X84941Y305000D02*
X87362D01*
X87165Y300670D02*
X87953Y301457D01*
X84941Y300670D02*
X87165D01*
X63405D02*
X65630D01*
X66417Y301457D01*
X63405Y305000D02*
X65826D01*
X66417Y304410D01*
Y301457D02*
Y304410D01*
X72323Y300670D02*
X75728D01*
X50787D02*
X54193D01*
X44882Y301457D02*
Y304410D01*
X44291Y305000D02*
X44882Y304410D01*
X41870Y305000D02*
X44291D01*
X44094Y300670D02*
X44882Y301457D01*
X41870Y300670D02*
X44094D01*
X20334D02*
X22559D01*
X23346Y301457D01*
X20334Y305000D02*
X22756D01*
X23346Y304410D01*
Y301457D02*
Y304410D01*
X29252Y300670D02*
X32657D01*
X7087Y286890D02*
Y290295D01*
X3347Y280984D02*
X6299D01*
X2756Y280394D02*
X3347Y280984D01*
X2756Y277973D02*
Y280394D01*
X6299Y280984D02*
X7087Y280197D01*
Y277973D02*
Y280197D01*
Y257855D02*
Y260079D01*
X6299Y260866D02*
X7087Y260079D01*
X2756Y257855D02*
Y260276D01*
X3347Y260866D01*
X6299D01*
X7087Y266772D02*
Y270177D01*
Y246654D02*
Y250059D01*
X3347Y240748D02*
X6299D01*
X2756Y240158D02*
X3347Y240748D01*
X2756Y237736D02*
Y240158D01*
X6299Y240748D02*
X7087Y239961D01*
Y237736D02*
Y239961D01*
Y217618D02*
Y219843D01*
X6299Y220630D02*
X7087Y219843D01*
X2756Y217618D02*
Y220040D01*
X3347Y220630D01*
X6299D01*
X7087Y226536D02*
Y229941D01*
Y206417D02*
Y209823D01*
X3347Y200512D02*
X6299D01*
X2756Y199921D02*
X3347Y200512D01*
X2756Y197500D02*
Y199921D01*
X6299Y200512D02*
X7087Y199725D01*
Y197500D02*
Y199725D01*
Y177382D02*
Y179606D01*
X6299Y180394D02*
X7087Y179606D01*
X2756Y177382D02*
Y179803D01*
X3347Y180394D01*
X6299D01*
X7087Y186299D02*
Y189705D01*
Y155984D02*
Y159390D01*
X3347Y150079D02*
X6299D01*
X2756Y149488D02*
X3347Y150079D01*
X2756Y147067D02*
Y149488D01*
X6299Y150079D02*
X7087Y149291D01*
Y147067D02*
Y149291D01*
Y126949D02*
Y129173D01*
X6299Y129961D02*
X7087Y129173D01*
X2756Y126949D02*
Y129370D01*
X3347Y129961D01*
X6299D01*
X7087Y135866D02*
Y139272D01*
Y115748D02*
Y119153D01*
X3347Y109843D02*
X6299D01*
X2756Y109252D02*
X3347Y109843D01*
X2756Y106831D02*
Y109252D01*
X6299Y109843D02*
X7087Y109055D01*
Y106831D02*
Y109055D01*
Y86713D02*
Y88937D01*
X6299Y89724D02*
X7087Y88937D01*
X2756Y86713D02*
Y89134D01*
X3347Y89724D01*
X6299D01*
X7087Y95630D02*
Y99035D01*
Y75512D02*
Y78917D01*
X3347Y69606D02*
X6299D01*
X2756Y69016D02*
X3347Y69606D01*
X2756Y66594D02*
Y69016D01*
X6299Y69606D02*
X7087Y68819D01*
Y66594D02*
Y68819D01*
Y46476D02*
Y48701D01*
X6299Y49488D02*
X7087Y48701D01*
X2756Y46476D02*
Y48898D01*
X3347Y49488D01*
X6299D01*
X7087Y55394D02*
Y58799D01*
X11337Y58226D02*
X11663Y58553D01*
X11337Y53190D02*
Y58226D01*
X11417Y58799D02*
X11663Y58553D01*
X145176Y8682D02*
X146457Y7401D01*
Y866D02*
Y7401D01*
X11417Y41867D02*
Y46476D01*
X9179Y39630D02*
X11417Y41867D01*
X9179Y37851D02*
Y39630D01*
X9173Y37845D02*
X9179Y37851D01*
X136639Y8752D02*
X138583Y6809D01*
Y866D02*
Y6809D01*
X20334Y28748D02*
Y31772D01*
Y28748D02*
X25787Y23295D01*
Y1260D02*
Y23295D01*
X14295Y40691D02*
X20077D01*
X20334Y40433D01*
X12659Y39055D02*
X14295Y40691D01*
X12659Y24473D02*
Y39055D01*
Y24473D02*
X17913Y19219D01*
Y1260D02*
Y19219D01*
D16*
X32657Y31772D02*
D03*
Y36103D02*
D03*
Y40433D02*
D03*
X20334Y31772D02*
D03*
Y36103D02*
D03*
Y40433D02*
D03*
X41870D02*
D03*
Y36103D02*
D03*
Y31772D02*
D03*
X54193Y40433D02*
D03*
Y36103D02*
D03*
Y31772D02*
D03*
X75728D02*
D03*
Y36103D02*
D03*
Y40433D02*
D03*
X63405Y31772D02*
D03*
Y36103D02*
D03*
Y40433D02*
D03*
X84941D02*
D03*
Y36103D02*
D03*
Y31772D02*
D03*
X97264Y40433D02*
D03*
Y36103D02*
D03*
Y31772D02*
D03*
X118799D02*
D03*
Y36103D02*
D03*
Y40433D02*
D03*
X106476Y31772D02*
D03*
Y36103D02*
D03*
Y40433D02*
D03*
X128012D02*
D03*
Y36103D02*
D03*
Y31772D02*
D03*
X140334Y40433D02*
D03*
Y36103D02*
D03*
Y31772D02*
D03*
X32657Y164567D02*
D03*
Y168898D02*
D03*
Y173229D02*
D03*
X20334Y164567D02*
D03*
Y168898D02*
D03*
Y173229D02*
D03*
X41870D02*
D03*
Y168898D02*
D03*
Y164567D02*
D03*
X54193Y173229D02*
D03*
Y168898D02*
D03*
Y164567D02*
D03*
X75728D02*
D03*
Y168898D02*
D03*
Y173229D02*
D03*
X63405Y164567D02*
D03*
Y168898D02*
D03*
Y173229D02*
D03*
X84941D02*
D03*
Y168898D02*
D03*
Y164567D02*
D03*
X97264Y173229D02*
D03*
Y168898D02*
D03*
Y164567D02*
D03*
X118799D02*
D03*
Y168898D02*
D03*
Y173229D02*
D03*
X106476Y164567D02*
D03*
Y168898D02*
D03*
Y173229D02*
D03*
X128012D02*
D03*
Y168898D02*
D03*
Y164567D02*
D03*
X140334Y173229D02*
D03*
Y168898D02*
D03*
Y164567D02*
D03*
X128012Y305000D02*
D03*
Y300670D02*
D03*
Y296339D02*
D03*
X140334Y305000D02*
D03*
Y300670D02*
D03*
Y296339D02*
D03*
X118799D02*
D03*
Y300670D02*
D03*
Y305000D02*
D03*
X106476Y296339D02*
D03*
Y300670D02*
D03*
Y305000D02*
D03*
X84941D02*
D03*
Y300670D02*
D03*
Y296339D02*
D03*
X97263Y305000D02*
D03*
Y300670D02*
D03*
Y296339D02*
D03*
X75728D02*
D03*
Y300670D02*
D03*
Y305000D02*
D03*
X63405Y296339D02*
D03*
Y300670D02*
D03*
Y305000D02*
D03*
X41870D02*
D03*
Y300670D02*
D03*
Y296339D02*
D03*
X54193Y305000D02*
D03*
Y300670D02*
D03*
Y296339D02*
D03*
X32657D02*
D03*
Y300670D02*
D03*
Y305000D02*
D03*
X20334Y296339D02*
D03*
Y300670D02*
D03*
Y305000D02*
D03*
D17*
X157874Y58799D02*
D03*
X153543D02*
D03*
X149212D02*
D03*
X157874Y46477D02*
D03*
X153543D02*
D03*
X149212D02*
D03*
Y66595D02*
D03*
X153543D02*
D03*
X157874D02*
D03*
X149212Y78917D02*
D03*
X153543D02*
D03*
X157874D02*
D03*
Y99036D02*
D03*
X153543D02*
D03*
X149212D02*
D03*
X157874Y86713D02*
D03*
X153543D02*
D03*
X149212D02*
D03*
Y106831D02*
D03*
X153543D02*
D03*
X157874D02*
D03*
X149212Y119154D02*
D03*
X153543D02*
D03*
X157874D02*
D03*
Y139272D02*
D03*
X153543D02*
D03*
X149212D02*
D03*
X157874Y126949D02*
D03*
X153543D02*
D03*
X149212D02*
D03*
Y147067D02*
D03*
X153543D02*
D03*
X157874D02*
D03*
X149212Y159390D02*
D03*
X153543D02*
D03*
X157874D02*
D03*
Y189744D02*
D03*
X153543D02*
D03*
X149212D02*
D03*
X157874Y177421D02*
D03*
X153543D02*
D03*
X149212D02*
D03*
Y197540D02*
D03*
X153543D02*
D03*
X157874D02*
D03*
X149212Y209862D02*
D03*
X153543D02*
D03*
X157874D02*
D03*
Y229980D02*
D03*
X153543D02*
D03*
X149212D02*
D03*
X157874Y217658D02*
D03*
X153543D02*
D03*
X149212D02*
D03*
Y237776D02*
D03*
X153543D02*
D03*
X157874D02*
D03*
X149212Y250099D02*
D03*
X153543D02*
D03*
X157874D02*
D03*
Y270217D02*
D03*
X153543D02*
D03*
X149212D02*
D03*
X157874Y257894D02*
D03*
X153543D02*
D03*
X149212D02*
D03*
Y278012D02*
D03*
X153543D02*
D03*
X157874D02*
D03*
X149212Y290335D02*
D03*
X153543D02*
D03*
X157874D02*
D03*
X2756Y277973D02*
D03*
X7087D02*
D03*
X11417D02*
D03*
X2756Y290295D02*
D03*
X7087D02*
D03*
X11417D02*
D03*
Y270177D02*
D03*
X7087D02*
D03*
X2756D02*
D03*
X11417Y257855D02*
D03*
X7087D02*
D03*
X2756D02*
D03*
Y237736D02*
D03*
X7087D02*
D03*
X11417D02*
D03*
X2756Y250059D02*
D03*
X7087D02*
D03*
X11417D02*
D03*
Y229941D02*
D03*
X7087D02*
D03*
X2756D02*
D03*
X11417Y217618D02*
D03*
X7087D02*
D03*
X2756D02*
D03*
Y197500D02*
D03*
X7087D02*
D03*
X11417D02*
D03*
X2756Y209823D02*
D03*
X7087D02*
D03*
X11417D02*
D03*
Y189705D02*
D03*
X7087D02*
D03*
X2756D02*
D03*
X11417Y177382D02*
D03*
X7087D02*
D03*
X2756D02*
D03*
Y147067D02*
D03*
X7087D02*
D03*
X11417D02*
D03*
X2756Y159390D02*
D03*
X7087D02*
D03*
X11417D02*
D03*
Y139272D02*
D03*
X7087D02*
D03*
X2756D02*
D03*
X11417Y126949D02*
D03*
X7087D02*
D03*
X2756D02*
D03*
Y106831D02*
D03*
X7087D02*
D03*
X11417D02*
D03*
X2756Y119153D02*
D03*
X7087D02*
D03*
X11417D02*
D03*
Y99035D02*
D03*
X7087D02*
D03*
X2756D02*
D03*
X11417Y86713D02*
D03*
X7087D02*
D03*
X2756D02*
D03*
Y66594D02*
D03*
X7087D02*
D03*
X11417D02*
D03*
X2756Y78917D02*
D03*
X7087D02*
D03*
X11417D02*
D03*
Y58799D02*
D03*
X7087D02*
D03*
X2756D02*
D03*
X11417Y46476D02*
D03*
X7087D02*
D03*
X2756D02*
D03*
D18*
X34843Y-8189D02*
D03*
X4921D02*
D03*
X155512Y-8583D02*
D03*
X125591D02*
D03*
D19*
X13976Y1260D02*
D03*
X17913D02*
D03*
X21850D02*
D03*
X25787D02*
D03*
X134646Y866D02*
D03*
X138583D02*
D03*
X142520D02*
D03*
X146457D02*
D03*
D20*
X37438Y164035D02*
X39078D01*
X37195Y164278D02*
X37438Y164035D01*
X39078D02*
X39610Y164567D01*
X41870D01*
X147019Y163537D02*
X149036Y161520D01*
Y159566D02*
Y161520D01*
Y159566D02*
X149212Y159390D01*
X20527Y164375D02*
X25152D01*
X20334Y164567D02*
X20527Y164375D01*
X118799Y173229D02*
X128012D01*
X133116D01*
X133444Y173557D01*
X156752D02*
Y173630D01*
X157874Y174752D01*
Y177421D01*
X149212Y139272D02*
Y147067D01*
X149264Y147119D01*
Y152269D01*
X9253Y63709D02*
Y73858D01*
X8154Y62611D02*
X9253Y63709D01*
Y73858D02*
X11417Y76023D01*
X128012Y40433D02*
X131139D01*
X118799D02*
X128012D01*
X131139D02*
X133297Y38276D01*
X149673D01*
X157874Y46477D01*
X11417Y189705D02*
Y197500D01*
Y185855D02*
Y189705D01*
X9304Y183742D02*
X11417Y185855D01*
X9304Y172239D02*
Y183742D01*
X2756Y165691D02*
X9304Y172239D01*
X2756Y159390D02*
Y165691D01*
X11417Y159390D02*
Y177382D01*
X32657Y296339D02*
X41870D01*
X29246D02*
X32657D01*
X27087Y298499D02*
X29246Y296339D01*
X8789Y298499D02*
X27087D01*
X2756Y292465D02*
X8789Y298499D01*
X2756Y290295D02*
Y292465D01*
X54193Y296339D02*
X63405D01*
X49881D02*
X54193D01*
X75728D02*
X84941D01*
X71416D02*
X75728D01*
X97263D02*
X106476D01*
X92952D02*
X97263D01*
X118799D02*
X128012D01*
X114487D02*
X118799D01*
X149212Y290335D02*
Y293175D01*
X146048Y296339D02*
X149212Y293175D01*
X140334Y296339D02*
X146048D01*
X118799Y305000D02*
X122611Y301188D01*
Y299602D02*
Y301188D01*
Y299602D02*
X123709Y298503D01*
X136022Y296339D02*
X140334D01*
X123709Y298503D02*
X133858D01*
X136022Y296339D01*
X97263Y305000D02*
X101075Y301188D01*
Y299602D02*
Y301188D01*
Y299602D02*
X102174Y298503D01*
X112323D01*
X114487Y296339D01*
X75728Y305000D02*
X79540Y301188D01*
Y299602D02*
Y301188D01*
Y299602D02*
X80638Y298503D01*
X90787D01*
X92952Y296339D01*
X54193Y305000D02*
X58004Y301188D01*
Y299602D02*
Y301188D01*
Y299602D02*
X59103Y298503D01*
X69252D01*
X71416Y296339D01*
X32657Y305000D02*
X36469Y301188D01*
Y299602D02*
Y301188D01*
Y299602D02*
X37568Y298503D01*
X47716D01*
X49881Y296339D01*
X11417Y290295D02*
Y293965D01*
Y287401D02*
Y290295D01*
X13791Y296339D02*
X20335D01*
X11417Y293965D02*
X13791Y296339D01*
X149213Y175119D02*
Y180316D01*
X140334Y173229D02*
X147322D01*
X149213Y175119D01*
X106476Y173229D02*
X110788D01*
X97263D02*
X106476D01*
X84941D02*
X89253D01*
X75728D02*
X84941D01*
X63405D02*
X67717D01*
X54193D02*
X63405D01*
X41870D02*
X46182D01*
X32657D02*
X41870D01*
X38058Y168379D02*
X41870Y164567D01*
X38058Y168379D02*
Y169966D01*
X36960Y171064D02*
X38058Y169966D01*
X20335Y173229D02*
X24646D01*
X26811Y171064D02*
X36960D01*
X24646Y173229D02*
X26811Y171064D01*
X59594Y168379D02*
X63405Y164567D01*
X59594Y168379D02*
Y169966D01*
X58495Y171064D02*
X59594Y169966D01*
X48346Y171064D02*
X58495D01*
X46182Y173229D02*
X48346Y171064D01*
X81129Y168379D02*
X84941Y164567D01*
X81129Y168379D02*
Y169966D01*
X80030Y171064D02*
X81129Y169966D01*
X69882Y171064D02*
X80030D01*
X67717Y173229D02*
X69882Y171064D01*
X102664Y168379D02*
X106476Y164567D01*
X102664Y168379D02*
Y169966D01*
X101566Y171064D02*
X102664Y169966D01*
X91417Y171064D02*
X101566D01*
X89253Y173229D02*
X91417Y171064D01*
X124200Y168379D02*
X128012Y164567D01*
X124200Y168379D02*
Y169966D01*
X123101Y171064D02*
X124200Y169966D01*
X112953Y171064D02*
X123101D01*
X110788Y173229D02*
X112953Y171064D01*
X149213Y43902D02*
Y49371D01*
X140334Y40433D02*
X145744D01*
X149213Y43902D01*
X106476Y40433D02*
X110788D01*
X97263D02*
X106476D01*
X84941D02*
X89253D01*
X75728D02*
X84941D01*
X63405D02*
X67717D01*
X54193D02*
X63405D01*
X41870D02*
X46182D01*
X32657D02*
X41870D01*
X38058Y35583D02*
X41870Y31772D01*
X38058Y35583D02*
Y37170D01*
X36960Y38269D02*
X38058Y37170D01*
X20335Y40433D02*
X24646D01*
X26811Y38269D02*
X36960D01*
X24646Y40433D02*
X26811Y38269D01*
X59594Y35583D02*
X63405Y31772D01*
X59594Y35583D02*
Y37170D01*
X58495Y38269D02*
X59594Y37170D01*
X48346Y38269D02*
X58495D01*
X46182Y40433D02*
X48346Y38269D01*
X81129Y35583D02*
X84941Y31772D01*
X81129Y35583D02*
Y37170D01*
X80030Y38269D02*
X81129Y37170D01*
X69882Y38269D02*
X80030D01*
X67717Y40433D02*
X69882Y38269D01*
X102664Y35583D02*
X106476Y31772D01*
X102664Y35583D02*
Y37170D01*
X101566Y38269D02*
X102664Y37170D01*
X91417Y38269D02*
X101566D01*
X89253Y40433D02*
X91417Y38269D01*
X124200Y35583D02*
X128012Y31772D01*
X124200Y35583D02*
Y37170D01*
X123101Y38269D02*
X124200Y37170D01*
X112953Y38269D02*
X123101D01*
X110788Y40433D02*
X112953Y38269D01*
X154062Y62783D02*
X157874Y66595D01*
X152476Y62783D02*
X154062D01*
X151377Y61684D02*
X152476Y62783D01*
X151377Y51535D02*
Y61684D01*
X149213Y49371D02*
X151377Y51535D01*
X154062Y82901D02*
X157874Y86713D01*
X152476Y82901D02*
X154062D01*
X151377Y81802D02*
X152476Y82901D01*
X149213Y58799D02*
Y66595D01*
Y69489D01*
X151377Y71654D02*
Y81802D01*
X149213Y69489D02*
X151377Y71654D01*
X154062Y103019D02*
X157874Y106831D01*
X152476Y103019D02*
X154062D01*
X151377Y101920D02*
X152476Y103019D01*
X149213Y78917D02*
Y86713D01*
Y89607D01*
X151377Y91772D02*
Y101920D01*
X149213Y89607D02*
X151377Y91772D01*
X154062Y123137D02*
X157874Y126949D01*
X152476Y123137D02*
X154062D01*
X151377Y122039D02*
X152476Y123137D01*
X149213Y99036D02*
Y106831D01*
Y109725D01*
X151377Y111890D02*
Y122039D01*
X149213Y109725D02*
X151377Y111890D01*
X154062Y143255D02*
X157874Y147067D01*
X152476Y143255D02*
X154062D01*
X151377Y142157D02*
X152476Y143255D01*
X149213Y119154D02*
Y126949D01*
Y129844D01*
X151377Y132008D02*
Y142157D01*
X149213Y129844D02*
X151377Y132008D01*
X154062Y193728D02*
X157874Y197540D01*
X152476Y193728D02*
X154062D01*
X151377Y192629D02*
X152476Y193728D01*
X151377Y182481D02*
Y192629D01*
X149213Y180316D02*
X151377Y182481D01*
X154062Y213846D02*
X157874Y217658D01*
X152476Y213846D02*
X154062D01*
X151377Y212747D02*
X152476Y213846D01*
X149213Y189744D02*
Y197539D01*
Y200434D01*
X151377Y202599D02*
Y212747D01*
X149213Y200434D02*
X151377Y202599D01*
X154062Y233964D02*
X157874Y237776D01*
X152476Y233964D02*
X154062D01*
X151377Y232866D02*
X152476Y233964D01*
X149213Y209862D02*
Y217658D01*
Y220552D01*
X151377Y222717D02*
Y232866D01*
X149213Y220552D02*
X151377Y222717D01*
X154062Y254082D02*
X157874Y257894D01*
X152476Y254082D02*
X154062D01*
X151377Y252983D02*
X152476Y254082D01*
X149213Y229980D02*
Y237776D01*
Y240670D01*
X151377Y242835D02*
Y252983D01*
X149213Y240670D02*
X151377Y242835D01*
X154062Y274200D02*
X157874Y278012D01*
X152476Y274200D02*
X154062D01*
X151377Y273102D02*
X152476Y274200D01*
X149213Y250099D02*
Y257894D01*
Y260788D01*
X151377Y262953D02*
Y273102D01*
X149213Y260788D02*
X151377Y262953D01*
X2756Y270177D02*
X6568Y273989D01*
X8154D01*
X9253Y275088D01*
Y285237D01*
X11417Y287401D01*
X2756Y250059D02*
X6568Y253871D01*
X8154D01*
X9253Y254970D01*
X11417Y270177D02*
Y277973D01*
Y267283D02*
Y270177D01*
X9253Y254970D02*
Y265118D01*
X11417Y267283D01*
X2756Y229941D02*
X6568Y233753D01*
X8154D01*
X9253Y234852D01*
X11417Y250059D02*
Y257855D01*
Y247165D02*
Y250059D01*
X9253Y234852D02*
Y245000D01*
X11417Y247165D01*
X2756Y209823D02*
X6568Y213635D01*
X8154D01*
X9253Y214733D01*
X11417Y229941D02*
Y237736D01*
Y227047D02*
Y229941D01*
X9253Y214733D02*
Y224882D01*
X11417Y227047D01*
X2756Y189705D02*
X6568Y193517D01*
X8154D01*
X9253Y194615D01*
X11417Y209823D02*
Y217618D01*
Y206928D02*
Y209823D01*
X9253Y194615D02*
Y204764D01*
X11417Y206928D01*
X2756Y139272D02*
X6568Y143083D01*
X8154D01*
X9253Y144182D01*
X11417Y156495D02*
Y159390D01*
X9253Y144182D02*
Y154331D01*
X11417Y156495D01*
X2756Y119154D02*
X6568Y122965D01*
X8154D01*
X9253Y124064D01*
X11417Y139272D02*
Y147067D01*
Y136377D02*
Y139272D01*
X9253Y124064D02*
Y134213D01*
X11417Y136377D01*
X2756Y99035D02*
X6568Y102847D01*
X8154D01*
X9253Y103946D01*
X11417Y119154D02*
Y126949D01*
Y116259D02*
Y119154D01*
X9253Y103946D02*
Y114094D01*
X11417Y116259D01*
X2756Y78917D02*
X6568Y82729D01*
X8154D01*
X9253Y83828D01*
X11417Y99036D02*
Y106831D01*
Y96141D02*
Y99036D01*
X9253Y83828D02*
Y93976D01*
X11417Y96141D01*
Y76023D02*
Y78917D01*
Y58799D02*
Y66594D01*
Y78917D02*
Y86713D01*
X6568Y62611D02*
X8154D01*
X2756Y58799D02*
X6568Y62611D01*
D21*
X142520Y866D02*
Y6498D01*
X140743Y8274D02*
X142520Y6498D01*
X140743Y8274D02*
Y11657D01*
D22*
X21834Y10317D02*
X21850Y10301D01*
Y1260D02*
Y10301D01*
D23*
X37195Y164278D02*
D03*
X23740Y36103D02*
D03*
X29645Y33937D02*
D03*
X51181D02*
D03*
X45275Y36103D02*
D03*
X66811D02*
D03*
X72716Y33937D02*
D03*
X94252D02*
D03*
X88346Y36103D02*
D03*
X109882D02*
D03*
X115787Y33937D02*
D03*
X137323D02*
D03*
X131417Y36103D02*
D03*
X153543Y49882D02*
D03*
X155708Y55788D02*
D03*
Y75906D02*
D03*
X153543Y70000D02*
D03*
Y90118D02*
D03*
X155708Y96024D02*
D03*
Y116142D02*
D03*
X153543Y110236D02*
D03*
Y130354D02*
D03*
X155708Y136260D02*
D03*
Y156378D02*
D03*
X153543Y150473D02*
D03*
X23740Y168898D02*
D03*
X29645Y166733D02*
D03*
X51181D02*
D03*
X45275Y168898D02*
D03*
X66811D02*
D03*
X72716Y166733D02*
D03*
X94252D02*
D03*
X88346Y168898D02*
D03*
X109882D02*
D03*
X115787Y166733D02*
D03*
X137323D02*
D03*
X131417Y168898D02*
D03*
X153543Y180827D02*
D03*
X155708Y186732D02*
D03*
Y206851D02*
D03*
X153543Y200945D02*
D03*
Y221063D02*
D03*
X155708Y226969D02*
D03*
Y247087D02*
D03*
X153543Y241181D02*
D03*
Y261299D02*
D03*
X155708Y267205D02*
D03*
Y287323D02*
D03*
X153543Y281417D02*
D03*
X136929Y300670D02*
D03*
X131023Y302835D02*
D03*
X109488D02*
D03*
X115393Y300670D02*
D03*
X93858D02*
D03*
X87953Y302835D02*
D03*
X66417D02*
D03*
X72323Y300670D02*
D03*
X50787D02*
D03*
X44882Y302835D02*
D03*
X23346D02*
D03*
X29252Y300670D02*
D03*
X7087Y286890D02*
D03*
X4921Y280984D02*
D03*
Y260866D02*
D03*
X7087Y266772D02*
D03*
Y246654D02*
D03*
X4921Y240748D02*
D03*
Y220630D02*
D03*
X7087Y226536D02*
D03*
Y206417D02*
D03*
X4921Y200512D02*
D03*
Y180394D02*
D03*
X7087Y186299D02*
D03*
Y155984D02*
D03*
X4921Y150079D02*
D03*
Y129961D02*
D03*
X7087Y135866D02*
D03*
Y115748D02*
D03*
X4921Y109843D02*
D03*
Y89724D02*
D03*
X7087Y95630D02*
D03*
Y75512D02*
D03*
X4921Y69606D02*
D03*
Y49488D02*
D03*
X7087Y55394D02*
D03*
X147019Y163537D02*
D03*
X25152Y164375D02*
D03*
X133444Y173557D02*
D03*
X156752D02*
D03*
X11337Y53190D02*
D03*
X145176Y8682D02*
D03*
X9173Y37845D02*
D03*
X136639Y8752D02*
D03*
X149264Y152269D02*
D03*
D24*
X140743Y11657D02*
D03*
X21834Y10317D02*
D03*
M02*
