Change Pin Designator/Name:  Old Designator=U1B-18 Old Name=PB0 New Designator =PB11 New Name=22
Change Pin Designator/Name:  Old Designator=U1B-19 Old Name=PB1 New Designator =PB12 New Name=25
Change Pin Designator/Name:  Old Designator=U1B-20 Old Name=PB2 New Designator =PB13 New Name=26
Change Pin Designator/Name:  Old Designator=U1B-22 Old Name=PB11 New Designator =PB0 New Name=18
Change Pin Designator/Name:  Old Designator=U1B-25 Old Name=PB12 New Designator =PB1 New Name=19
Change Pin Designator/Name:  Old Designator=U1B-26 Old Name=PB13 New Designator =PB2 New Name=20
Change Pin Designator/Name:  Old Designator=U2-7 Old Name=D/C New Designator =RESET New Name=11
Change Pin Designator/Name:  Old Designator=U2-11 Old Name=RESET New Designator =D/C New Name=7
