Added Component: Designator=U2(LCD)
Add component. Clean all parameters for all variants
Add component (AddParameter): Name = "ComponentLink1Description"; Value = "Ali"; VariantName = "[No Variations]"
Add component (AddParameter): Name = "ComponentLink1URL"; Value = "http://www.aliexpress.com/item/New-IPS-1-3-inch-3-3V-12PIN-SPI-HD-Full-Color-TFT-Display-Screen-ST7789/32859772356.html"; VariantName = "[No Variations]"
Added Member To Class: ClassName=Controller Member=Component U2 IPS_LCD
