Removed Pin From Net: NetName=LedCLK Pin=P1-1
Added Component: Designator=U5(SOT363-6L)
Add component. Clean all parameters for all variants
Added Pin To Net: NetName=+3.3 Pin=U5-1
Added Pin To Net: NetName=GND Pin=U5-2
Added Pin To Net: NetName=LedCLK Pin=U5-3
Added Pin To Net: NetName=+3.3 Pin=U5-5
Added Pin To Net: NetName=+5 Pin=U5-6
Added Pin To Net: NetName=NetP1_1 Pin=P1-1
Added Pin To Net: NetName=NetP1_1 Pin=U5-4
Added Net: Name=NetP1_1
Added Member To Class: ClassName=Controller Member=Component U5 NTS0101
