Added Component: Designator=U1(SOT363-6L)
Add component. Clean all parameters for all variants
Added Pin To Net: NetName=GND Pin=U1-2
Added Pin To Net: NetName=+3.3 Pin=U1-1
Added Pin To Net: NetName=+3.3 Pin=U1-1
Added Pin To Net: NetName=+3.3 Pin=U1-5
Added Pin To Net: NetName=+3.3 Pin=U1-9
Added Pin To Net: NetName=+3.3 Pin=U1-11
Added Pin To Net: NetName=+3.3 Pin=U1-13
Added Pin To Net: NetName=+3.3 Pin=U1-16
Added Net: Name=+3.3
Added Pin To Net: NetName=+5 Pin=P1-2
Added Pin To Net: NetName=+5 Pin=U1-6
Added Net: Name=+5
Added Pin To Net: NetName=NetP1_3 Pin=P1-3
Added Pin To Net: NetName=NetP1_3 Pin=U1-4
Added Net: Name=NetP1_3
Added Member To Class: ClassName=Controller Member=Component U1 STM32F070CBT6TR
