Change Pin Designator/Name:  Old Designator=U1A-12 Old Name=PA2 New Designator =PB8 New Name=45
Change Pin Designator/Name:  Old Designator=U1A-13 Old Name=PA3 New Designator =PA2 New Name=12
Change Pin Designator/Name:  Old Designator=U1B-39 Old Name=PB3 New Designator =PA3 New Name=13
Change Pin Designator/Name:  Old Designator=U1A-40 Old Name=PB4 New Designator =PB3 New Name=39
Change Pin Designator/Name:  Old Designator=U1A-42 Old Name=PB6 New Designator =PB4 New Name=40
Change Pin Designator/Name:  Old Designator=U1A-45 Old Name=PB8 New Designator =PB6 New Name=42
