Change Component Footprint: Designator=P? Old Footprint=PCBComponent_1 New Footprint=FFC-4pin_05mm
Change Component Comment : Designator=P? Old Comment=Header 4 New Comment=Led connector
Change Component Designator: OldDesignator=P? NewDesignator=P1
Added Component: Designator=P2(USB connector)
Add component. Clean all parameters for all variants
Add component (AddParameter): Name = "LatestRevisionDate"; Value = "17-Jul-2002"; VariantName = "[No Variations]"
Add component (AddParameter): Name = "LatestRevisionNote"; Value = "Re-released for DXP Platform."; VariantName = "[No Variations]"
Add component (AddParameter): Name = "Publisher"; Value = "Altium Limited"; VariantName = "[No Variations]"
Added Member To Class: ClassName=Controller Member=Component P2 USB
