Added Pin To Net: NetName=Down Pin=S5-2
Added Pin To Net: NetName=Down Pin=S5-2
Added Pin To Net: NetName=Down Pin=U1-14
Added Net: Name=Down
Added Pin To Net: NetName=Left Pin=S4-2
Added Pin To Net: NetName=Left Pin=S4-2
Added Pin To Net: NetName=Left Pin=U1-13
Added Net: Name=Left
Added Pin To Net: NetName=Lower Pin=S7-2
Added Pin To Net: NetName=Lower Pin=S7-2
Added Pin To Net: NetName=Lower Pin=U1-29
Added Net: Name=Lower
Added Pin To Net: NetName=Middle Pin=S2-2
Added Pin To Net: NetName=Middle Pin=S2-2
Added Pin To Net: NetName=Middle Pin=U1-11
Added Net: Name=Middle
Added Pin To Net: NetName=Right Pin=S1-2
Added Pin To Net: NetName=Right Pin=S1-2
Added Pin To Net: NetName=Right Pin=U1-10
Added Net: Name=Right
Added Pin To Net: NetName=Upper Pin=S6-2
Added Pin To Net: NetName=Upper Pin=S6-2
Added Pin To Net: NetName=Upper Pin=U1-16
Added Net: Name=Upper
Added Pin To Net: NetName=Up Pin=S3-2
Added Pin To Net: NetName=Up Pin=S3-2
Added Pin To Net: NetName=Up Pin=U1-12
Added Net: Name=Up
