Change Component Comment : Designator=P? Old Comment=Header 4 New Comment=Expantion port
Change Component Designator: OldDesignator=P? NewDesignator=P4
Added Pin To Net: NetName=+3.3 Pin=P4-1
Added Pin To Net: NetName=Exp0 Pin=P4-2
Added Pin To Net: NetName=Exp1 Pin=P4-3
Added Pin To Net: NetName=GND Pin=P4-4
