<svg width="76" height="76" viewBox="0 0 76 76" fill="none" xmlns="http://www.w3.org/2000/svg">
<path d="M6.04545 1.72727C5.45835 1.72727 4.90069 1.84396 4.39274 2.0546L3.7311 0.459071C4.4451 0.162986 5.22733 0 6.04545 0H7.82071V1.72727H6.04545Z" fill="#D1D0D0"/>
<path d="M14.9217 1.72727H11.3712V0H14.9217V1.72727Z" fill="#D1D0D0"/>
<path d="M22.0227 1.72727H18.4722V0H22.0227V1.72727Z" fill="#D1D0D0"/>
<path d="M29.1237 1.72727H25.5732V0H29.1237V1.72727Z" fill="#D1D0D0"/>
<path d="M36.2248 1.72727H32.6742V0H36.2248V1.72727Z" fill="#D1D0D0"/>
<path d="M43.3258 1.72727H39.7752V0H43.3258V1.72727Z" fill="#D1D0D0"/>
<path d="M50.4268 1.72727H46.8763V0H50.4268V1.72727Z" fill="#D1D0D0"/>
<path d="M57.5278 1.72727H53.9773V0H57.5278V1.72727Z" fill="#D1D0D0"/>
<path d="M64.6288 1.72727H61.0783V0H64.6288V1.72727Z" fill="#D1D0D0"/>
<path d="M69.9545 1.72727H68.1793V0H69.9545C70.7727 0 71.5549 0.162987 72.2689 0.459072L71.6073 2.0546C71.0993 1.84396 70.5416 1.72727 69.9545 1.72727Z" fill="#D1D0D0"/>
<path d="M2.0546 4.39274C1.84396 4.90068 1.72727 5.45835 1.72727 6.04545V7.82071H0V6.04545C0 5.22733 0.162987 4.4451 0.459072 3.7311L2.0546 4.39274Z" fill="#D1D0D0"/>
<path d="M74.2727 6.04545C74.2727 5.45835 74.156 4.90069 73.9454 4.39274L75.5409 3.7311C75.837 4.4451 76 5.22733 76 6.04545V7.82071H74.2727V6.04545Z" fill="#D1D0D0"/>
<path d="M74.2727 14.9217V11.3712H76V14.9217H74.2727Z" fill="#D1D0D0"/>
<path d="M1.72727 11.3712V14.9217H0V11.3712H1.72727Z" fill="#D1D0D0"/>
<path d="M1.72727 18.4722V22.0227H0V18.4722H1.72727Z" fill="#D1D0D0"/>
<path d="M74.2727 22.0227V18.4722H76V22.0227H74.2727Z" fill="#D1D0D0"/>
<path d="M1.72727 25.5732V29.1237H0V25.5732H1.72727Z" fill="#D1D0D0"/>
<path d="M74.2727 29.1237V25.5732H76V29.1237H74.2727Z" fill="#D1D0D0"/>
<path d="M1.72727 32.6742V36.2248H0V32.6742H1.72727Z" fill="#D1D0D0"/>
<path d="M74.2727 36.2248V32.6742H76V36.2248H74.2727Z" fill="#D1D0D0"/>
<path d="M1.72727 39.7752V43.3258H0V39.7752H1.72727Z" fill="#D1D0D0"/>
<path d="M74.2727 43.3258V39.7752H76V43.3258H74.2727Z" fill="#D1D0D0"/>
<path d="M74.2727 50.4268V46.8763H76V50.4268H74.2727Z" fill="#D1D0D0"/>
<path d="M1.72727 46.8763V50.4268H0V46.8763H1.72727Z" fill="#D1D0D0"/>
<path d="M74.2727 57.5278V53.9773H76V57.5278H74.2727Z" fill="#D1D0D0"/>
<path d="M1.72727 53.9773V57.5278H0V53.9773H1.72727Z" fill="#D1D0D0"/>
<path d="M1.72727 61.0783V64.6288H0V61.0783H1.72727Z" fill="#D1D0D0"/>
<path d="M74.2727 64.6288V61.0783H76V64.6288H74.2727Z" fill="#D1D0D0"/>
<path d="M1.72727 68.1793V69.9545C1.72727 70.5416 1.84396 71.0993 2.0546 71.6073L0.459071 72.2689C0.162986 71.5549 0 70.7727 0 69.9545V68.1793H1.72727Z" fill="#D1D0D0"/>
<path d="M74.2727 69.9545V68.1793H76V69.9545C76 70.7727 75.837 71.5549 75.5409 72.2689L73.9454 71.6073C74.156 71.0993 74.2727 70.5416 74.2727 69.9545Z" fill="#D1D0D0"/>
<path d="M4.39274 73.9454C4.90068 74.156 5.45835 74.2727 6.04545 74.2727H7.82071V76H6.04545C5.22733 76 4.4451 75.837 3.7311 75.5409L4.39274 73.9454Z" fill="#D1D0D0"/>
<path d="M69.9545 74.2727C70.5416 74.2727 71.0993 74.156 71.6073 73.9454L72.2689 75.5409C71.5549 75.837 70.7727 76 69.9545 76H68.1793V74.2727H69.9545Z" fill="#D1D0D0"/>
<path d="M11.3712 74.2727H14.9217V76H11.3712V74.2727Z" fill="#D1D0D0"/>
<path d="M18.4722 74.2727H22.0227V76H18.4722V74.2727Z" fill="#D1D0D0"/>
<path d="M25.5732 74.2727H29.1237V76H25.5732V74.2727Z" fill="#D1D0D0"/>
<path d="M32.6742 74.2727H36.2248V76H32.6742V74.2727Z" fill="#D1D0D0"/>
<path d="M39.7752 74.2727H43.3258V76H39.7752V74.2727Z" fill="#D1D0D0"/>
<path d="M46.8763 74.2727H50.4268V76H46.8763V74.2727Z" fill="#D1D0D0"/>
<path d="M53.9773 74.2727H57.5278V76H53.9773V74.2727Z" fill="#D1D0D0"/>
<path d="M61.0783 74.2727H64.6288V76H61.0783V74.2727Z" fill="#D1D0D0"/>
<path fill-rule="evenodd" clip-rule="evenodd" d="M23.7823 51.2401C23.46 51.2401 23.1956 51.1368 22.9888 50.93C22.7821 50.7233 22.6787 50.4588 22.6787 50.1366V25.8588C22.6787 25.5366 22.7821 25.2721 22.9888 25.0654C23.1956 24.8587 23.46 24.7553 23.7823 24.7553H52.4742C52.7964 24.7553 53.0609 24.8587 53.2676 25.0654C53.4744 25.2721 53.5777 25.5366 53.5777 25.8588V41.8977C52.3774 40.815 50.906 40.2507 49.1635 40.2049C48.2486 40.229 47.4085 40.3959 46.643 40.7058L43.4042 36.8247C43.174 36.5488 42.8867 36.4108 42.5424 36.4108C42.1981 36.4108 41.9108 36.5488 41.6805 36.8247L36.3008 43.2737C36.094 43.5268 35.8296 43.6589 35.5073 43.6699C35.1851 43.6809 34.9092 43.5831 34.6797 43.3764V43.3775L32.3005 40.9982C32.0702 40.768 31.8057 40.6528 31.507 40.6528C31.2083 40.6528 30.9438 40.768 30.7136 40.9982L24.8858 46.826H42.5423C42.588 48.5684 43.1522 50.0398 44.2349 51.2401H23.7823ZM29.2999 33.5836C29.2999 34.1817 29.4493 34.7335 29.748 35.2389C30.0467 35.7443 30.4546 36.1467 30.9718 36.4461C31.489 36.7456 32.0349 36.8949 32.6094 36.8942C33.184 36.8934 33.7358 36.7441 34.2647 36.4461C34.7937 36.1482 35.2017 35.7458 35.4886 35.2389C35.7755 34.732 35.9193 34.1802 35.9201 33.5836C35.8972 32.6412 35.5754 31.8595 34.9545 31.2386C34.3335 30.6176 33.5519 30.3072 32.6094 30.3072C31.667 30.3072 30.8854 30.6176 30.2644 31.2386C29.6435 31.8595 29.3216 32.6412 29.2988 33.5836H29.2999Z" fill="#D1D0D0"/>
<path fill-rule="evenodd" clip-rule="evenodd" d="M53.2567 42.7327C52.1662 41.6421 50.8018 41.0753 49.1636 41.0323C47.5254 41.0753 46.161 41.6421 45.0704 42.7327C43.9799 43.8232 43.4131 45.1876 43.37 46.8258C43.4131 48.464 43.9799 49.8284 45.0704 50.919C46.161 52.0095 47.5254 52.5763 49.1636 52.6194C50.8018 52.5763 52.1662 52.0095 53.2567 50.919C54.3473 49.8284 54.9141 48.464 54.9571 46.8258C54.9141 45.1876 54.3473 43.8232 53.2567 42.7327ZM46.7584 46.3346H48.6724V44.4207C48.6724 44.2827 48.7198 44.1663 48.8147 44.0714C48.9096 43.9765 49.0261 43.929 49.164 43.929C49.3019 43.929 49.4184 43.9765 49.5133 44.0714C49.6082 44.1663 49.6556 44.2827 49.6556 44.4207V46.3346H51.5696C51.7075 46.3346 51.8239 46.3821 51.9188 46.477C52.0137 46.5719 52.0612 46.6883 52.0612 46.8262C52.0612 46.9642 52.0137 47.0806 51.9188 47.1755C51.8239 47.2704 51.7075 47.3179 51.5696 47.3179H49.6556V49.2318C49.6556 49.3697 49.6082 49.4862 49.5133 49.5811C49.4184 49.676 49.3019 49.7234 49.164 49.7234C49.0261 49.7234 48.9096 49.676 48.8147 49.5811C48.7198 49.4862 48.6724 49.3697 48.6724 49.2318V47.3179H46.7584C46.6205 47.3179 46.5041 47.2704 46.4092 47.1755C46.3143 47.0806 46.2668 46.9642 46.2668 46.8262C46.2668 46.6883 46.3143 46.5719 46.4092 46.477C46.5041 46.3821 46.6205 46.3346 46.7584 46.3346Z" fill="#D1D0D0"/>
</svg>
