valor,peso
384,476
55,104
871,814
480,551
935,928
410,462
845,897
909,816
387,289
197,118
818,752
564,487
440,360
324,400
247,153
858,801
275,193
412,444
697,669
754,826
1,25
446,436
140,168
118,107
376,369
482,460
376,342
116,68
614,610
184,99
314,334
40,24
53,136
91,41
672,656
770,781
1,24
173,193
119,88
145,67
537,443
831,750
211,194
153,170
562,523
948,895
466,414
304,238
277,195
316,348
