0
0
0
0
0
0
0
0
0
0
0
0
0
0
0
0
0
0
0
0
0
0
0
0
0
0
0
0
0
0
3
2
1
1
0
3
8
4
5
9
1
7
14
11
9
10
14
19
17
23
25
20
24
19
27
22
22
27
12
20
19
17
21
9
21
13
19
16
19
13
14
18
11
19
9
14
13
9
19
14
14
10
22
8
16
13
19
11
16
7
19
17
17
16
8
16
17
17
14
20
25
14
20
20
21
17
14
24
29
12
20
24
16
10
8
19
17
12
22
7
17
8
17
11
14
9
23
14
10
11
9
13
13
10
18
15
16
13
14
15
10
15
9
20
12
11
16
18
9
11
18
14
13
17
19
17
15
17
20
17
17
15
24
19
23
22
20
17
26
21
31
23
16
33
24
25
26
28
19
32
17
32
38
21
36
29
38
24
26
36
23
32
32
25
27
29
33
32
27
35
42
30
27
33
32
38
31
36
38
33
52
37
39
39
51
37
46
51
36
41
51
39
32
41
43
51
42
42
31
48
56
51
43
63
62
60
80
74
86
82
79
76
88
91
87
95
94
79
94
95
98
112
133
186
249
