\babel@toc {french}{}
\babel@toc {french}{}
\contentsline {chapter}{\numberline {1}Navigation}{2}%
\contentsline {chapter}{\numberline {2}Reconnaissance d'objet}{3}%
\contentsline {section}{\numberline {2.1} YOLO }{3}%
\contentsline {subsection}{\numberline {2.1.1}Avant-propos}{3}%
\contentsline {paragraph}{You only look once (YOLO)}{3}%
\contentsline {subsection}{\numberline {2.1.2}Le vecteur des prédictions }{3}%
\contentsline {paragraph}{Pour notre implémentation,}{3}%
\contentsline {paragraph}{Pour chaque cellule de la grille,}{3}%
\contentsline {paragraph}{Chaque}{4}%
\contentsline {subsection}{\numberline {2.1.3}Le réseau }{4}%
\contentsline {paragraph}{}{4}%
\contentsline {paragraph}{Notez que}{4}%
\contentsline {paragraph}{}{4}%
\contentsline {paragraph}{}{4}%
\contentsline {subsection}{\numberline {2.1.4}Fonction de perte}{4}%
\contentsline {paragraph}{YOLO}{4}%
\contentsline {paragraph}{}{4}%
\contentsline {paragraph}{}{5}%
\contentsline {subsection}{\numberline {2.1.5}Apprentissage}{5}%
\contentsline {paragraph}{Tout d'abord,}{5}%
\contentsline {paragraph}{}{5}%
\contentsline {paragraph}{}{5}%
\contentsline {paragraph}{}{5}%
\contentsline {paragraph}{}{5}%
\contentsline {subsection}{\numberline {2.1.6}Résultats}{6}%
\contentsline {paragraph}{Après}{6}%
\contentsline {paragraph}{En premier lieu,}{6}%
\contentsline {paragraph}{Ensuite,}{6}%
\contentsline {paragraph}{}{6}%
\contentsline {paragraph}{}{6}%
\contentsline {paragraph}{}{6}%
