\relax 
\@nameuse{bbl@beforestart}
\catcode `:\active 
\catcode `;\active 
\catcode `!\active 
\catcode `?\active 
\babel@aux{french}{}
\babel@aux{french}{}
\@writefile{toc}{\contentsline {chapter}{\numberline {1}Navigation}{2}\protected@file@percent }
\@writefile{lof}{\addvspace {10\p@ }}
\@writefile{lot}{\addvspace {10\p@ }}
\@writefile{toc}{\contentsline {chapter}{\numberline {2}Reconnaissance d'objet}{3}\protected@file@percent }
\@writefile{lof}{\addvspace {10\p@ }}
\@writefile{lot}{\addvspace {10\p@ }}
\@writefile{toc}{\contentsline {section}{\numberline {2.1} YOLO }{3}\protected@file@percent }
\@writefile{toc}{\contentsline {subsection}{\numberline {2.1.1}Avant-propos}{3}\protected@file@percent }
\@writefile{toc}{\contentsline {paragraph}{You only look once (YOLO)}{3}\protected@file@percent }
\@writefile{toc}{\contentsline {subsection}{\numberline {2.1.2}Le vecteur des prédictions }{3}\protected@file@percent }
\@writefile{toc}{\contentsline {paragraph}{Pour notre implémentation,}{3}\protected@file@percent }
\@writefile{lof}{\contentsline {figure}{\numberline {2.1}{\ignorespaces  Image d'entrée divisée en imagettes}}{3}\protected@file@percent }
\newlabel{fig:yoloImagette1}{{2.1}{3}}
\@writefile{toc}{\contentsline {paragraph}{Pour chaque cellule de la grille,}{3}\protected@file@percent }
\@writefile{toc}{\contentsline {paragraph}{Chaque}{4}\protected@file@percent }
\@writefile{toc}{\contentsline {subsection}{\numberline {2.1.3}Le réseau }{4}\protected@file@percent }
\@writefile{toc}{\contentsline {paragraph}{}{4}\protected@file@percent }
\@writefile{lof}{\contentsline {figure}{\numberline {2.2}{\ignorespaces  Réseau neuronal convolutif de YOLO}}{4}\protected@file@percent }
\newlabel{fig:yoloReseau}{{2.2}{4}}
\@writefile{toc}{\contentsline {paragraph}{Notez que}{4}\protected@file@percent }
\@writefile{toc}{\contentsline {paragraph}{}{4}\protected@file@percent }
\@writefile{toc}{\contentsline {paragraph}{}{4}\protected@file@percent }
\@writefile{toc}{\contentsline {subsection}{\numberline {2.1.4}Fonction de perte}{4}\protected@file@percent }
\@writefile{toc}{\contentsline {paragraph}{YOLO}{4}\protected@file@percent }
\@writefile{toc}{\contentsline {paragraph}{}{4}\protected@file@percent }
\@writefile{lof}{\contentsline {figure}{\numberline {2.3}{\ignorespaces  Fonction de perte de YOLO}}{5}\protected@file@percent }
\newlabel{fig:yoloLoss}{{2.3}{5}}
\@writefile{toc}{\contentsline {paragraph}{}{5}\protected@file@percent }
\@writefile{toc}{\contentsline {subsection}{\numberline {2.1.5}Apprentissage}{5}\protected@file@percent }
\@writefile{toc}{\contentsline {paragraph}{Tout d'abord,}{5}\protected@file@percent }
\@writefile{toc}{\contentsline {paragraph}{}{5}\protected@file@percent }
\@writefile{toc}{\contentsline {paragraph}{}{5}\protected@file@percent }
\@writefile{toc}{\contentsline {paragraph}{}{5}\protected@file@percent }
\@writefile{toc}{\contentsline {paragraph}{}{5}\protected@file@percent }
\@writefile{lof}{\contentsline {figure}{\numberline {2.4}{\ignorespaces  Exemple d'image utilisée pour l'apprentissage}}{5}\protected@file@percent }
\newlabel{fig:yoloExample}{{2.4}{5}}
\@writefile{toc}{\contentsline {subsection}{\numberline {2.1.6}Résultats}{6}\protected@file@percent }
\@writefile{toc}{\contentsline {paragraph}{Après}{6}\protected@file@percent }
\@writefile{toc}{\contentsline {paragraph}{En premier lieu,}{6}\protected@file@percent }
\@writefile{lof}{\contentsline {figure}{\numberline {2.5}{\ignorespaces  Exemple de résultat sur une image contenant un mégot}}{6}\protected@file@percent }
\newlabel{fig:megotyolo}{{2.5}{6}}
\@writefile{toc}{\contentsline {paragraph}{Ensuite,}{6}\protected@file@percent }
\@writefile{toc}{\contentsline {paragraph}{}{6}\protected@file@percent }
\@writefile{toc}{\contentsline {paragraph}{}{6}\protected@file@percent }
\@writefile{toc}{\contentsline {paragraph}{}{6}\protected@file@percent }
\@writefile{lof}{\contentsline {figure}{\numberline {2.6}{\ignorespaces  Détection du mégot sur le flux de la webcam}}{7}\protected@file@percent }
\newlabel{fig:yolovideo}{{2.6}{7}}
