136
55
77
70
69
73
51
67
44
42
47
36
30
31
29
31
14
27
30
21
22
23
18
28
17
18
18
22
23
13
16
17
15
17
13
21
9
12
20
12
17
18
18
18
18
14
21
17
17
20
19
21
16
20
22
32
19
19
26
30
26
18
23
22
28
31
31
30
26
30
25
30
32
31
21
30
31
26
36
23
19
33
24
29
28
26
26
26
24
31
24
28
26
33
29
32
48
40
52
45
47
30
50
49
45
40
36
38
49
40
56
65
64
71
83
92
88
94
116
140
156
147
122
98
86
67
72
55
59
65
55
63
51
32
40
41
37
35
31
21
25
28
24
18
11
5
6
6
4
6
6
2
6
4
3
2
0
4
3
0
1
1
0
0
1
0
1
2
2
2
1
4
3
5
1
4
3
1
6
2
0
3
2
1
1
3
1
0
0
0
1
0
1
0
1
3
1
1
1
2
2
3
1
3
6
5
8
1
2
3
6
4
4
3
5
2
2
0
5
5
6
3
4
3
5
5
2
7
3
1
9
9
6
5
5
8
10
8
1
4
5
5
6
10
3
8
9
31
18
43
31
58
57
101
138
