"0","ggplot(data=city_selection, aes(y=Turbidity, color=area, fill=area)) +"
"0","  geom_boxplot() + "
"0","  labs(title = ""Boxplot Turbidity"","
"0","       xlab = ""Area"")"
"2","Warning:"
"2"," Removed 2 rows containing non-finite values (stat_boxplot).
"
