"0","ggplot(data=city_selection, aes(y=Organic_carbon, color=area, fill=area)) +"
"0","  geom_boxplot() + "
"0","  labs(title = ""Boxplot Organic Carbon"","
"0","       xlab = ""Area"")"
"2","Warning:"
"2"," Removed 3 rows containing non-finite values (stat_boxplot).
"
