%YAML 1.1
%TAG !u! tag:unity3d.com,2011:
--- !u!1045 &1
EditorBuildSettings:
  m_ObjectHideFlags: 0
  serializedVersion: 2
  m_Scenes:
  - enabled: 0
    path: Assets/Scenes/Map1_base.unity
    guid: f83783f251ed809428e9b90ef5f4c9fc
  - enabled: 1
    path: Assets/Scenes/Map2_base.unity
    guid: 00e5b1879cd171e44aae64a96e6649c8
  m_configObjects: {}
