%YAML 1.1
%TAG !u! tag:unity3d.com,2011:
--- !u!114 &11400000
MonoBehaviour:
  m_ObjectHideFlags: 0
  m_CorrespondingSourceObject: {fileID: 0}
  m_PrefabInstance: {fileID: 0}
  m_PrefabAsset: {fileID: 0}
  m_GameObject: {fileID: 0}
  m_Enabled: 1
  m_EditorHideFlags: 0
  m_Script: {fileID: 11500000, guid: ff5592a28c2fea845a7e2404fa1549ec, type: 3}
  m_Name: New Unit Card
  m_EditorClassIdentifier: 
  unitName: 
  attackDamage: 0
  moveSpeed: 0
  health: 0
  fireDefense: 0
  waterDefense: 0
  electricDefense: 0
  windDefense: 0
  earthDefense: 0
  picture: {fileID: 0}
