%YAML 1.1
%TAG !u! tag:unity3d.com,2011:
--- !u!1001 &2004800769078791082
PrefabInstance:
  m_ObjectHideFlags: 0
  serializedVersion: 2
  m_Modification:
    m_TransformParent: {fileID: 0}
    m_Modifications:
    - target: {fileID: 659665580081223293, guid: 570da8ee0b5c7b840b142f1929bd9787,
        type: 3}
      propertyPath: m_Color.r
      value: 1
      objectReference: {fileID: 0}
    - target: {fileID: 659665580081223293, guid: 570da8ee0b5c7b840b142f1929bd9787,
        type: 3}
      propertyPath: m_Color.g
      value: 0.16509432
      objectReference: {fileID: 0}
    - target: {fileID: 659665580081223293, guid: 570da8ee0b5c7b840b142f1929bd9787,
        type: 3}
      propertyPath: m_Color.b
      value: 0.16509432
      objectReference: {fileID: 0}
    - target: {fileID: 659665580081223293, guid: 570da8ee0b5c7b840b142f1929bd9787,
        type: 3}
      propertyPath: m_SortingLayerID
      value: 1935451493
      objectReference: {fileID: 0}
    - target: {fileID: 659665580081223293, guid: 570da8ee0b5c7b840b142f1929bd9787,
        type: 3}
      propertyPath: m_SortingLayer
      value: 2
      objectReference: {fileID: 0}
    - target: {fileID: 1450688899482100271, guid: 570da8ee0b5c7b840b142f1929bd9787,
        type: 3}
      propertyPath: m_Name
      value: EnemyBasePH
      objectReference: {fileID: 0}
    - target: {fileID: 1450688899482100271, guid: 570da8ee0b5c7b840b142f1929bd9787,
        type: 3}
      propertyPath: m_Layer
      value: 11
      objectReference: {fileID: 0}
    - target: {fileID: 2897843667861385627, guid: 570da8ee0b5c7b840b142f1929bd9787,
        type: 3}
      propertyPath: m_Color.r
      value: 1
      objectReference: {fileID: 0}
    - target: {fileID: 2897843667861385627, guid: 570da8ee0b5c7b840b142f1929bd9787,
        type: 3}
      propertyPath: m_Color.g
      value: 0.16509432
      objectReference: {fileID: 0}
    - target: {fileID: 2897843667861385627, guid: 570da8ee0b5c7b840b142f1929bd9787,
        type: 3}
      propertyPath: m_Color.b
      value: 0.16509432
      objectReference: {fileID: 0}
    - target: {fileID: 2897843667861385627, guid: 570da8ee0b5c7b840b142f1929bd9787,
        type: 3}
      propertyPath: m_SortingLayerID
      value: 1935451493
      objectReference: {fileID: 0}
    - target: {fileID: 2897843667861385627, guid: 570da8ee0b5c7b840b142f1929bd9787,
        type: 3}
      propertyPath: m_SortingLayer
      value: 2
      objectReference: {fileID: 0}
    - target: {fileID: 3929753020308949037, guid: 570da8ee0b5c7b840b142f1929bd9787,
        type: 3}
      propertyPath: m_Color.r
      value: 1
      objectReference: {fileID: 0}
    - target: {fileID: 3929753020308949037, guid: 570da8ee0b5c7b840b142f1929bd9787,
        type: 3}
      propertyPath: m_Color.g
      value: 0.16509432
      objectReference: {fileID: 0}
    - target: {fileID: 3929753020308949037, guid: 570da8ee0b5c7b840b142f1929bd9787,
        type: 3}
      propertyPath: m_Color.b
      value: 0.16509432
      objectReference: {fileID: 0}
    - target: {fileID: 3929753020308949037, guid: 570da8ee0b5c7b840b142f1929bd9787,
        type: 3}
      propertyPath: m_SortingLayerID
      value: 1935451493
      objectReference: {fileID: 0}
    - target: {fileID: 3929753020308949037, guid: 570da8ee0b5c7b840b142f1929bd9787,
        type: 3}
      propertyPath: m_SortingLayer
      value: 2
      objectReference: {fileID: 0}
    - target: {fileID: 5046280907787941632, guid: 570da8ee0b5c7b840b142f1929bd9787,
        type: 3}
      propertyPath: m_Color.r
      value: 1
      objectReference: {fileID: 0}
    - target: {fileID: 5046280907787941632, guid: 570da8ee0b5c7b840b142f1929bd9787,
        type: 3}
      propertyPath: m_Color.g
      value: 0.16509432
      objectReference: {fileID: 0}
    - target: {fileID: 5046280907787941632, guid: 570da8ee0b5c7b840b142f1929bd9787,
        type: 3}
      propertyPath: m_Color.b
      value: 0.16509432
      objectReference: {fileID: 0}
    - target: {fileID: 5046280907787941632, guid: 570da8ee0b5c7b840b142f1929bd9787,
        type: 3}
      propertyPath: m_SortingLayerID
      value: 1935451493
      objectReference: {fileID: 0}
    - target: {fileID: 5046280907787941632, guid: 570da8ee0b5c7b840b142f1929bd9787,
        type: 3}
      propertyPath: m_SortingLayer
      value: 2
      objectReference: {fileID: 0}
    - target: {fileID: 5819130909031639895, guid: 570da8ee0b5c7b840b142f1929bd9787,
        type: 3}
      propertyPath: m_LocalPosition.x
      value: 0
      objectReference: {fileID: 0}
    - target: {fileID: 5819130909031639895, guid: 570da8ee0b5c7b840b142f1929bd9787,
        type: 3}
      propertyPath: m_LocalPosition.y
      value: 0
      objectReference: {fileID: 0}
    - target: {fileID: 5819130909031639895, guid: 570da8ee0b5c7b840b142f1929bd9787,
        type: 3}
      propertyPath: m_LocalPosition.z
      value: 0
      objectReference: {fileID: 0}
    - target: {fileID: 5819130909031639895, guid: 570da8ee0b5c7b840b142f1929bd9787,
        type: 3}
      propertyPath: m_LocalRotation.x
      value: 0
      objectReference: {fileID: 0}
    - target: {fileID: 5819130909031639895, guid: 570da8ee0b5c7b840b142f1929bd9787,
        type: 3}
      propertyPath: m_LocalRotation.y
      value: 0
      objectReference: {fileID: 0}
    - target: {fileID: 5819130909031639895, guid: 570da8ee0b5c7b840b142f1929bd9787,
        type: 3}
      propertyPath: m_LocalRotation.z
      value: 0
      objectReference: {fileID: 0}
    - target: {fileID: 5819130909031639895, guid: 570da8ee0b5c7b840b142f1929bd9787,
        type: 3}
      propertyPath: m_LocalRotation.w
      value: 1
      objectReference: {fileID: 0}
    - target: {fileID: 5819130909031639895, guid: 570da8ee0b5c7b840b142f1929bd9787,
        type: 3}
      propertyPath: m_RootOrder
      value: 0
      objectReference: {fileID: 0}
    - target: {fileID: 5819130909031639895, guid: 570da8ee0b5c7b840b142f1929bd9787,
        type: 3}
      propertyPath: m_LocalEulerAnglesHint.x
      value: 0
      objectReference: {fileID: 0}
    - target: {fileID: 5819130909031639895, guid: 570da8ee0b5c7b840b142f1929bd9787,
        type: 3}
      propertyPath: m_LocalEulerAnglesHint.y
      value: 0
      objectReference: {fileID: 0}
    - target: {fileID: 5819130909031639895, guid: 570da8ee0b5c7b840b142f1929bd9787,
        type: 3}
      propertyPath: m_LocalEulerAnglesHint.z
      value: 0
      objectReference: {fileID: 0}
    - target: {fileID: 5819130909031639895, guid: 570da8ee0b5c7b840b142f1929bd9787,
        type: 3}
      propertyPath: m_LocalScale.x
      value: 1
      objectReference: {fileID: 0}
    - target: {fileID: 5819130909031639895, guid: 570da8ee0b5c7b840b142f1929bd9787,
        type: 3}
      propertyPath: m_LocalScale.y
      value: 1
      objectReference: {fileID: 0}
    - target: {fileID: 5819130909031639895, guid: 570da8ee0b5c7b840b142f1929bd9787,
        type: 3}
      propertyPath: m_LocalScale.z
      value: 1
      objectReference: {fileID: 0}
    - target: {fileID: 8545874997036922621, guid: 570da8ee0b5c7b840b142f1929bd9787,
        type: 3}
      propertyPath: m_LocalScale.x
      value: 1.246461
      objectReference: {fileID: 0}
    - target: {fileID: 8545874997036922621, guid: 570da8ee0b5c7b840b142f1929bd9787,
        type: 3}
      propertyPath: m_LocalScale.y
      value: 1.246461
      objectReference: {fileID: 0}
    - target: {fileID: 8545874997036922621, guid: 570da8ee0b5c7b840b142f1929bd9787,
        type: 3}
      propertyPath: m_LocalScale.z
      value: 1.246461
      objectReference: {fileID: 0}
    m_RemovedComponents: []
  m_SourcePrefab: {fileID: 100100000, guid: 570da8ee0b5c7b840b142f1929bd9787, type: 3}
