\boolfalse {citerequest}\boolfalse {citetracker}\boolfalse {pagetracker}\boolfalse {backtracker}\relax 
\babel@toc {spanish}{}
\contentsline {chapter}{Declaraci\IeC {\'o}n de Autor\IeC {\'\i }a}{\es@scroman {iii}}{section*.1}
\contentsline {chapter}{\numberline {1}Introducci\IeC {\'o}n}{1}{chapter.7}
\contentsline {section}{\numberline {1.1}Introducci\IeC {\'o}n}{1}{section.8}
\contentsline {section}{\numberline {1.2}Learning \LaTeX {}}{1}{section.9}
\contentsline {subsection}{\numberline {1.2.1}A (not so short) Introduction to \LaTeX {}}{1}{subsection.10}
\contentsline {subsection}{\numberline {1.2.2}A Short Math Guide for \LaTeX {}}{1}{subsection.11}
\contentsline {chapter}{\numberline {A}Frequently Asked Questions}{3}{appendix.12}
\contentsline {section}{\numberline {A.1}How do I change the colors of links?}{3}{section.13}
