%YAML 1.1
%TAG !u! tag:unity3d.com,2011:
--- !u!74 &7400000
AnimationClip:
  m_ObjectHideFlags: 0
  m_CorrespondingSourceObject: {fileID: 0}
  m_PrefabInstance: {fileID: 0}
  m_PrefabAsset: {fileID: 0}
  m_Name: Idle
  serializedVersion: 6
  m_Legacy: 0
  m_Compressed: 0
  m_UseHighQualityCurve: 1
  m_RotationCurves: []
  m_CompressedRotationCurves: []
  m_EulerCurves: []
  m_PositionCurves: []
  m_ScaleCurves: []
  m_FloatCurves: []
  m_PPtrCurves:
  - curve:
    - time: 0
      value: {fileID: -8599862213955204830, guid: e1dcc6736adddb64aa7a9ce0da9b2408, type: 3}
    - time: 0.11666667
      value: {fileID: 7281135418989021229, guid: e1dcc6736adddb64aa7a9ce0da9b2408, type: 3}
    - time: 0.21666667
      value: {fileID: 6501268561217820092, guid: e1dcc6736adddb64aa7a9ce0da9b2408, type: 3}
    - time: 0.33333334
      value: {fileID: 8360979106315957038, guid: e1dcc6736adddb64aa7a9ce0da9b2408, type: 3}
    - time: 0.45
      value: {fileID: 605419512897359108, guid: e1dcc6736adddb64aa7a9ce0da9b2408, type: 3}
    - time: 0.55
      value: {fileID: -1214480532785023975, guid: e1dcc6736adddb64aa7a9ce0da9b2408, type: 3}
    - time: 0.6666667
      value: {fileID: -4830811391328811214, guid: e1dcc6736adddb64aa7a9ce0da9b2408, type: 3}
    - time: 0.75
      value: {fileID: 3384493420599841878, guid: e1dcc6736adddb64aa7a9ce0da9b2408, type: 3}
    attribute: m_Sprite
    path: GFX
    classID: 212
    script: {fileID: 0}
  m_SampleRate: 60
  m_WrapMode: 0
  m_Bounds:
    m_Center: {x: 0, y: 0, z: 0}
    m_Extent: {x: 0, y: 0, z: 0}
  m_ClipBindingConstant:
    genericBindings:
    - serializedVersion: 2
      path: 1225224978
      attribute: 0
      script: {fileID: 0}
      typeID: 212
      customType: 23
      isPPtrCurve: 1
    pptrCurveMapping:
    - {fileID: -8599862213955204830, guid: e1dcc6736adddb64aa7a9ce0da9b2408, type: 3}
    - {fileID: 7281135418989021229, guid: e1dcc6736adddb64aa7a9ce0da9b2408, type: 3}
    - {fileID: 6501268561217820092, guid: e1dcc6736adddb64aa7a9ce0da9b2408, type: 3}
    - {fileID: 8360979106315957038, guid: e1dcc6736adddb64aa7a9ce0da9b2408, type: 3}
    - {fileID: 605419512897359108, guid: e1dcc6736adddb64aa7a9ce0da9b2408, type: 3}
    - {fileID: -1214480532785023975, guid: e1dcc6736adddb64aa7a9ce0da9b2408, type: 3}
    - {fileID: -4830811391328811214, guid: e1dcc6736adddb64aa7a9ce0da9b2408, type: 3}
    - {fileID: 3384493420599841878, guid: e1dcc6736adddb64aa7a9ce0da9b2408, type: 3}
  m_AnimationClipSettings:
    serializedVersion: 2
    m_AdditiveReferencePoseClip: {fileID: 0}
    m_AdditiveReferencePoseTime: 0
    m_StartTime: 0
    m_StopTime: 0.76666665
    m_OrientationOffsetY: 0
    m_Level: 0
    m_CycleOffset: 0
    m_HasAdditiveReferencePose: 0
    m_LoopTime: 1
    m_LoopBlend: 0
    m_LoopBlendOrientation: 0
    m_LoopBlendPositionY: 0
    m_LoopBlendPositionXZ: 0
    m_KeepOriginalOrientation: 0
    m_KeepOriginalPositionY: 1
    m_KeepOriginalPositionXZ: 0
    m_HeightFromFeet: 0
    m_Mirror: 0
  m_EditorCurves: []
  m_EulerEditorCurves: []
  m_HasGenericRootTransform: 0
  m_HasMotionFloatCurves: 0
  m_Events: []
