%YAML 1.1
%TAG !u! tag:unity3d.com,2011:
--- !u!114 &11400000
MonoBehaviour:
  m_ObjectHideFlags: 0
  m_CorrespondingSourceObject: {fileID: 0}
  m_PrefabInstance: {fileID: 0}
  m_PrefabAsset: {fileID: 0}
  m_GameObject: {fileID: 0}
  m_Enabled: 1
  m_EditorHideFlags: 0
  m_Script: {fileID: 11500000, guid: e6114d2c49056c041b36148b2a716c4b, type: 3}
  m_Name: PinkShroomDigestionTimer
  m_EditorClassIdentifier: 
  name: PinkShroom
  percentageLeft: 1
  icon: {fileID: 2005518571936551860, guid: db558ee209c6d744b9fdbe21cefca8ff, type: 3}
