%YAML 1.1
%TAG !u! tag:unity3d.com,2011:
--- !u!74 &7400000
AnimationClip:
  m_ObjectHideFlags: 0
  m_CorrespondingSourceObject: {fileID: 0}
  m_PrefabInstance: {fileID: 0}
  m_PrefabAsset: {fileID: 0}
  m_Name: AttackBackRight 2
  serializedVersion: 6
  m_Legacy: 0
  m_Compressed: 0
  m_UseHighQualityCurve: 1
  m_RotationCurves: []
  m_CompressedRotationCurves: []
  m_EulerCurves: []
  m_PositionCurves: []
  m_ScaleCurves: []
  m_FloatCurves: []
  m_PPtrCurves:
  - curve:
    - time: 0
      value: {fileID: 142479550201901831, guid: e1dcc6736adddb64aa7a9ce0da9b2408, type: 3}
    - time: 0.033333335
      value: {fileID: -6084651237311787544, guid: e1dcc6736adddb64aa7a9ce0da9b2408, type: 3}
    - time: 0.05
      value: {fileID: 3993113416876173833, guid: e1dcc6736adddb64aa7a9ce0da9b2408, type: 3}
    - time: 0.06666667
      value: {fileID: 6765961720825456951, guid: e1dcc6736adddb64aa7a9ce0da9b2408, type: 3}
    - time: 0.1
      value: {fileID: -8881960895266564580, guid: e1dcc6736adddb64aa7a9ce0da9b2408, type: 3}
    - time: 0.15
      value: {fileID: 7918650697625877406, guid: e1dcc6736adddb64aa7a9ce0da9b2408, type: 3}
    - time: 0.16666667
      value: {fileID: 3449274958817418697, guid: e1dcc6736adddb64aa7a9ce0da9b2408, type: 3}
    - time: 0.2
      value: {fileID: -116865477262073008, guid: e1dcc6736adddb64aa7a9ce0da9b2408, type: 3}
    - time: 0.23333333
      value: {fileID: 9164391901321709159, guid: e1dcc6736adddb64aa7a9ce0da9b2408, type: 3}
    - time: 0.26666668
      value: {fileID: -6270747744156410720, guid: e1dcc6736adddb64aa7a9ce0da9b2408, type: 3}
    - time: 0.28333333
      value: {fileID: -907092730272664441, guid: e1dcc6736adddb64aa7a9ce0da9b2408, type: 3}
    - time: 0.31666666
      value: {fileID: 6260267703348235690, guid: e1dcc6736adddb64aa7a9ce0da9b2408, type: 3}
    - time: 0.36666667
      value: {fileID: 6237246148893462291, guid: e1dcc6736adddb64aa7a9ce0da9b2408, type: 3}
    - time: 0.4
      value: {fileID: -8187918340743229470, guid: e1dcc6736adddb64aa7a9ce0da9b2408, type: 3}
    - time: 0.41666666
      value: {fileID: -4774727025002397186, guid: e1dcc6736adddb64aa7a9ce0da9b2408, type: 3}
    attribute: m_Sprite
    path: GFX
    classID: 212
    script: {fileID: 0}
  m_SampleRate: 60
  m_WrapMode: 0
  m_Bounds:
    m_Center: {x: 0, y: 0, z: 0}
    m_Extent: {x: 0, y: 0, z: 0}
  m_ClipBindingConstant:
    genericBindings:
    - serializedVersion: 2
      path: 1225224978
      attribute: 0
      script: {fileID: 0}
      typeID: 212
      customType: 23
      isPPtrCurve: 1
    pptrCurveMapping:
    - {fileID: 142479550201901831, guid: e1dcc6736adddb64aa7a9ce0da9b2408, type: 3}
    - {fileID: -6084651237311787544, guid: e1dcc6736adddb64aa7a9ce0da9b2408, type: 3}
    - {fileID: 3993113416876173833, guid: e1dcc6736adddb64aa7a9ce0da9b2408, type: 3}
    - {fileID: 6765961720825456951, guid: e1dcc6736adddb64aa7a9ce0da9b2408, type: 3}
    - {fileID: -8881960895266564580, guid: e1dcc6736adddb64aa7a9ce0da9b2408, type: 3}
    - {fileID: 7918650697625877406, guid: e1dcc6736adddb64aa7a9ce0da9b2408, type: 3}
    - {fileID: 3449274958817418697, guid: e1dcc6736adddb64aa7a9ce0da9b2408, type: 3}
    - {fileID: -116865477262073008, guid: e1dcc6736adddb64aa7a9ce0da9b2408, type: 3}
    - {fileID: 9164391901321709159, guid: e1dcc6736adddb64aa7a9ce0da9b2408, type: 3}
    - {fileID: -6270747744156410720, guid: e1dcc6736adddb64aa7a9ce0da9b2408, type: 3}
    - {fileID: -907092730272664441, guid: e1dcc6736adddb64aa7a9ce0da9b2408, type: 3}
    - {fileID: 6260267703348235690, guid: e1dcc6736adddb64aa7a9ce0da9b2408, type: 3}
    - {fileID: 6237246148893462291, guid: e1dcc6736adddb64aa7a9ce0da9b2408, type: 3}
    - {fileID: -8187918340743229470, guid: e1dcc6736adddb64aa7a9ce0da9b2408, type: 3}
    - {fileID: -4774727025002397186, guid: e1dcc6736adddb64aa7a9ce0da9b2408, type: 3}
  m_AnimationClipSettings:
    serializedVersion: 2
    m_AdditiveReferencePoseClip: {fileID: 0}
    m_AdditiveReferencePoseTime: 0
    m_StartTime: 0
    m_StopTime: 0.43333334
    m_OrientationOffsetY: 0
    m_Level: 0
    m_CycleOffset: 0
    m_HasAdditiveReferencePose: 0
    m_LoopTime: 0
    m_LoopBlend: 0
    m_LoopBlendOrientation: 0
    m_LoopBlendPositionY: 0
    m_LoopBlendPositionXZ: 0
    m_KeepOriginalOrientation: 0
    m_KeepOriginalPositionY: 1
    m_KeepOriginalPositionXZ: 0
    m_HeightFromFeet: 0
    m_Mirror: 0
  m_EditorCurves: []
  m_EulerEditorCurves: []
  m_HasGenericRootTransform: 0
  m_HasMotionFloatCurves: 0
  m_Events:
  - time: 0.28333333
    functionName: DisableInputs
    data: 
    objectReferenceParameter: {fileID: 0}
    floatParameter: 0
    intParameter: 0
    messageOptions: 0
  - time: 0.31666666
    functionName: MoveForward
    data: 
    objectReferenceParameter: {fileID: 0}
    floatParameter: 0
    intParameter: 0
    messageOptions: 0
  - time: 0.41666666
    functionName: AttackEnemiesOnRange
    data: 
    objectReferenceParameter: {fileID: 0}
    floatParameter: 0
    intParameter: 0
    messageOptions: 0
