%YAML 1.1
%TAG !u! tag:unity3d.com,2011:
--- !u!74 &7400000
AnimationClip:
  m_ObjectHideFlags: 0
  m_CorrespondingSourceObject: {fileID: 0}
  m_PrefabInstance: {fileID: 0}
  m_PrefabAsset: {fileID: 0}
  m_Name: EatLeft
  serializedVersion: 6
  m_Legacy: 0
  m_Compressed: 0
  m_UseHighQualityCurve: 1
  m_RotationCurves: []
  m_CompressedRotationCurves: []
  m_EulerCurves: []
  m_PositionCurves: []
  m_ScaleCurves: []
  m_FloatCurves: []
  m_PPtrCurves:
  - curve:
    - time: 0
      value: {fileID: -7944934015479956843, guid: e1dcc6736adddb64aa7a9ce0da9b2408, type: 3}
    - time: 0.06666667
      value: {fileID: 1756346317526757678, guid: e1dcc6736adddb64aa7a9ce0da9b2408, type: 3}
    - time: 0.13333334
      value: {fileID: -1946461389380148575, guid: e1dcc6736adddb64aa7a9ce0da9b2408, type: 3}
    - time: 0.21666667
      value: {fileID: 3551564095558790320, guid: e1dcc6736adddb64aa7a9ce0da9b2408, type: 3}
    - time: 0.28333333
      value: {fileID: 5503621814265061525, guid: e1dcc6736adddb64aa7a9ce0da9b2408, type: 3}
    - time: 0.33333334
      value: {fileID: 4647905564630848576, guid: e1dcc6736adddb64aa7a9ce0da9b2408, type: 3}
    - time: 0.38333333
      value: {fileID: 3464501222758705163, guid: e1dcc6736adddb64aa7a9ce0da9b2408, type: 3}
    - time: 0.43333334
      value: {fileID: -4624658045877878517, guid: e1dcc6736adddb64aa7a9ce0da9b2408, type: 3}
    - time: 0.48333332
      value: {fileID: -7450236646612076084, guid: e1dcc6736adddb64aa7a9ce0da9b2408, type: 3}
    - time: 0.53333336
      value: {fileID: 9147951022947863030, guid: e1dcc6736adddb64aa7a9ce0da9b2408, type: 3}
    - time: 0.6
      value: {fileID: 835283837792226673, guid: e1dcc6736adddb64aa7a9ce0da9b2408, type: 3}
    - time: 0.68333334
      value: {fileID: 6141173100500461771, guid: e1dcc6736adddb64aa7a9ce0da9b2408, type: 3}
    - time: 0.75
      value: {fileID: 495815615657616469, guid: e1dcc6736adddb64aa7a9ce0da9b2408, type: 3}
    - time: 0.8
      value: {fileID: 7069399238134224842, guid: e1dcc6736adddb64aa7a9ce0da9b2408, type: 3}
    - time: 0.9
      value: {fileID: 6452987628614784580, guid: e1dcc6736adddb64aa7a9ce0da9b2408, type: 3}
    - time: 1
      value: {fileID: 6185260399035345410, guid: e1dcc6736adddb64aa7a9ce0da9b2408, type: 3}
    attribute: m_Sprite
    path: GFX
    classID: 212
    script: {fileID: 0}
  m_SampleRate: 60
  m_WrapMode: 0
  m_Bounds:
    m_Center: {x: 0, y: 0, z: 0}
    m_Extent: {x: 0, y: 0, z: 0}
  m_ClipBindingConstant:
    genericBindings:
    - serializedVersion: 2
      path: 1225224978
      attribute: 0
      script: {fileID: 0}
      typeID: 212
      customType: 23
      isPPtrCurve: 1
    pptrCurveMapping:
    - {fileID: -7944934015479956843, guid: e1dcc6736adddb64aa7a9ce0da9b2408, type: 3}
    - {fileID: 1756346317526757678, guid: e1dcc6736adddb64aa7a9ce0da9b2408, type: 3}
    - {fileID: -1946461389380148575, guid: e1dcc6736adddb64aa7a9ce0da9b2408, type: 3}
    - {fileID: 3551564095558790320, guid: e1dcc6736adddb64aa7a9ce0da9b2408, type: 3}
    - {fileID: 5503621814265061525, guid: e1dcc6736adddb64aa7a9ce0da9b2408, type: 3}
    - {fileID: 4647905564630848576, guid: e1dcc6736adddb64aa7a9ce0da9b2408, type: 3}
    - {fileID: 3464501222758705163, guid: e1dcc6736adddb64aa7a9ce0da9b2408, type: 3}
    - {fileID: -4624658045877878517, guid: e1dcc6736adddb64aa7a9ce0da9b2408, type: 3}
    - {fileID: -7450236646612076084, guid: e1dcc6736adddb64aa7a9ce0da9b2408, type: 3}
    - {fileID: 9147951022947863030, guid: e1dcc6736adddb64aa7a9ce0da9b2408, type: 3}
    - {fileID: 835283837792226673, guid: e1dcc6736adddb64aa7a9ce0da9b2408, type: 3}
    - {fileID: 6141173100500461771, guid: e1dcc6736adddb64aa7a9ce0da9b2408, type: 3}
    - {fileID: 495815615657616469, guid: e1dcc6736adddb64aa7a9ce0da9b2408, type: 3}
    - {fileID: 7069399238134224842, guid: e1dcc6736adddb64aa7a9ce0da9b2408, type: 3}
    - {fileID: 6452987628614784580, guid: e1dcc6736adddb64aa7a9ce0da9b2408, type: 3}
    - {fileID: 6185260399035345410, guid: e1dcc6736adddb64aa7a9ce0da9b2408, type: 3}
  m_AnimationClipSettings:
    serializedVersion: 2
    m_AdditiveReferencePoseClip: {fileID: 0}
    m_AdditiveReferencePoseTime: 0
    m_StartTime: 0
    m_StopTime: 1.0166667
    m_OrientationOffsetY: 0
    m_Level: 0
    m_CycleOffset: 0
    m_HasAdditiveReferencePose: 0
    m_LoopTime: 0
    m_LoopBlend: 0
    m_LoopBlendOrientation: 0
    m_LoopBlendPositionY: 0
    m_LoopBlendPositionXZ: 0
    m_KeepOriginalOrientation: 0
    m_KeepOriginalPositionY: 1
    m_KeepOriginalPositionXZ: 0
    m_HeightFromFeet: 0
    m_Mirror: 0
  m_EditorCurves: []
  m_EulerEditorCurves: []
  m_HasGenericRootTransform: 0
  m_HasMotionFloatCurves: 0
  m_Events:
  - time: 0.43333334
    functionName: EatConsumableEvent
    data: 
    objectReferenceParameter: {fileID: 0}
    floatParameter: 0
    intParameter: 0
    messageOptions: 0
