fix TestRenterHandlerRename

4 jobs for partial-uploads in 35 minutes and 10 seconds (queued for 2 minutes and 51 seconds)
Status Job ID Name Coverage
  Lint
passed #216583046
lint

00:06:02

 
  Test
failed #216583050
integration-tests

00:29:07

75.0%
failed #216583047
legacy-tests

00:08:15

45.9%
failed #216583048
package-tests

00:20:18

87.0%
 
Name Stage Failure
failed
integration-tests Test
coverage: 75.0% of statements
ok gitlab.com/NebulousLabs/Sia/siatest/wallet 36.059s coverage: 75.0% of statements
Makefile:99: recipe for target 'test-long' failed
make: *** [test-long] Error 1
Uploading artifacts...
WARNING: /builds/NebulousLabs/Sia/SiaTesting: no matching files
WARNING: /builds/NebulousLabs/Sia/cover/cover.out: no matching files
ERROR: No files to upload
ERROR: Job failed: exit code 1
failed
package-tests Test
coverage: 87.0% of statements
ok gitlab.com/NebulousLabs/Sia/types 6.100s coverage: 87.0% of statements
Makefile:99: recipe for target 'test-long' failed
make: *** [test-long] Error 1
Uploading artifacts...
WARNING: /builds/NebulousLabs/Sia/SiaTesting: no matching files
WARNING: /builds/NebulousLabs/Sia/cover/cover.out: no matching files
ERROR: No files to upload
ERROR: Job failed: exit code 1
failed
legacy-tests Test
FAIL
coverage: 45.9% of statements
FAIL gitlab.com/NebulousLabs/Sia/node/api 311.726s
? gitlab.com/NebulousLabs/Sia/node/api/server [no test files]
Makefile:99: recipe for target 'test-long' failed
make: *** [test-long] Error 1
Uploading artifacts...
WARNING: /builds/NebulousLabs/Sia/SiaTesting: no matching files
WARNING: /builds/NebulousLabs/Sia/cover/cover.out: no matching files
ERROR: No files to upload