"\"1\"",0.14040924737361504
"\"3\"",8.464768877291442E-4
"\"2\"",0.08827536062097428
"\"Cas\"",0.01906500761623284
"\"Dis\"",3.190146310964631E-5
"\"NA \"",2.9259838148048384E-5
"\"NOC\"",8.750883935458973E-4
"\"UNK\"",7.829834926341607E-4
"\"No \"",1.4668043356710965E-4
"\"\"",0.013760455658616744
"\"5\"",1.5205807950693879E-6
"\"4\"",3.4893963187334595E-4
"\"CAS\"",0.022532114035255707
"\"CASH\"",0.050576875680919536
"\"CRD\"",0.2796849398156134
"\"CRE\"",0.0024659788542136718
"\"CREDIT\"",0.0017054206354224833
"\"CSH\"",0.28536105791076416
"\"Cash\"",0.04118490375962789
"\"Cre\"",0.020061752717913224
"\"Credit\"",0.03114437924966888
"\"DIS\"",2.67693199882704E-4
"\"Dispute\"",6.935838791138443E-5
"\"No Charge\"",3.7260376196562167E-4
