<svg width="19" height="14" viewBox="0 0 19 14" fill="none" xmlns="http://www.w3.org/2000/svg">
<path d="M9.58088 13.0875C7.76026 13.0875 5.93963 13.1102 4.12278 13.08C2.26439 13.0498 0.866818 11.6597 0.836601 9.80135C0.806383 7.81831 0.802606 5.83526 0.836601 3.85599C0.866818 2.01271 2.26439 0.607578 4.10012 0.596246C7.76025 0.569806 11.4242 0.569806 15.0843 0.596246C16.9351 0.611355 18.3252 2.02404 18.3516 3.88621C18.3818 5.85792 18.3818 7.82964 18.3516 9.80135C18.3176 11.7126 16.886 13.0762 14.9408 13.0875C13.1541 13.1026 11.3675 13.0913 9.58088 13.0875C9.58088 13.0913 9.58088 13.0913 9.58088 13.0875ZM11.9114 6.83623C10.3477 5.92591 8.84054 5.05338 7.31454 4.16195C7.31454 5.95991 7.31454 7.7201 7.31454 9.5105C8.85188 8.6153 10.3552 7.74276 11.9114 6.83623Z" fill="#457C9E"/>
</svg>
