<svg width="33" height="22" viewBox="0 0 33 22" fill="none" xmlns="http://www.w3.org/2000/svg">
<g clip-path="url(#clip0_544_3214)">
<path d="M14.8975 5.38889C15.097 5.50327 15.2835 5.45048 15.4569 5.32291C15.6261 5.19973 15.7605 5.04136 15.7605 4.81701C15.7649 4.49147 15.9037 4.25832 16.1942 4.12634C16.1509 3.8668 15.895 3.8668 15.7519 3.73482C15.2705 3.29051 15.3268 2.47667 15.908 2.17314C16.1769 2.03236 16.346 1.83 16.5629 1.64964C16.9792 1.30211 17.4693 1.04696 17.942 0.769816C18.1025 0.673035 18.276 0.743421 18.4408 0.809408C18.8962 0.989772 19.3559 1.16134 19.8113 1.3505C20.3187 1.56166 20.8088 1.81681 21.3292 1.99717C21.7889 2.15554 22.1446 2.42388 22.4481 2.78461C23.1594 3.62924 23.8707 4.47827 24.5863 5.32291C24.725 5.48567 24.7858 5.67484 24.8508 5.8684C25.2845 7.13974 25.7269 8.41109 26.1693 9.67803C26.4078 10.3687 26.6507 11.0594 26.8892 11.75C26.9369 11.8864 26.9889 12.0272 27.028 12.1635C27.1364 12.5419 27.0367 12.8454 26.7331 13.1005C26.243 13.5053 25.7659 13.932 25.2802 14.3455C25.059 14.5347 24.8161 14.6974 24.608 14.8954C24.3738 15.1197 24.0962 15.2077 23.8099 15.089C23.116 14.803 22.4048 14.5479 21.8453 14.0024C21.5114 13.6768 21.1644 13.3689 20.8001 13.083C19.9587 12.4275 19.0263 12.1239 17.9594 12.4099C17.6558 12.4935 17.3435 12.5595 17.0313 12.6034C16.8361 12.6342 16.6236 12.6474 16.4328 12.6034C15.7692 12.4495 15.5263 11.7016 15.9557 11.1605C16.2159 10.8306 16.5542 10.615 16.9662 10.5227C17.8943 10.3071 18.8268 10.1311 19.7896 10.1883C20.0194 10.2015 20.2536 10.1839 20.4835 10.1927C20.7307 10.2015 20.9345 10.1223 21.108 9.94198C21.3943 9.65164 21.6848 9.3657 21.9711 9.07535C22.1272 8.92139 22.1923 8.74982 22.1359 8.52107C21.9797 7.87 21.8149 7.21893 21.6935 6.55906C21.6371 6.24672 21.4983 6.01797 21.2728 5.82001C20.7914 5.40209 20.3057 4.98417 19.8243 4.56626C19.5424 4.32431 19.1737 4.30671 18.8441 4.26272C18.302 4.19233 17.7555 4.15714 17.2178 4.05156C17.144 4.03836 17.0573 4.08235 16.9749 4.09995C16.9749 4.37709 17.118 4.56186 17.3175 4.68943C17.6081 4.8742 17.8987 4.90939 18.1979 4.66744C18.4972 4.42548 18.7791 4.50027 19.0523 4.74662C19.2431 4.91819 19.3168 5.10295 19.2822 5.3669C19.1781 6.14994 19.1824 6.15874 19.9067 6.55466C20.2016 6.71743 20.3057 6.95498 20.2883 7.27611C20.2753 7.49607 20.1973 7.67204 19.9847 7.76442C19.8807 7.81281 19.7722 7.8568 19.6725 7.92279C19.3255 8.15154 19.2344 8.42428 19.3385 8.90819C19.4426 9.39649 19.3862 9.55926 19.0349 9.78801C18.8832 9.88919 18.7183 9.93758 18.5449 9.8672C18.4364 9.8276 18.3367 9.76162 18.2239 9.73082C17.8379 9.62964 17.4693 9.62525 17.2438 10.0388C17.0356 10.4127 16.719 10.4479 16.3504 10.3863C16.1248 10.3511 15.9687 10.2631 15.9384 10.0168C15.9253 9.90239 15.9253 9.77921 15.8906 9.66924C15.7909 9.3613 15.5784 9.18533 15.2618 9.14574C15.175 9.13694 15.0883 9.14134 15.0016 9.14574C14.7327 9.16334 14.4898 9.15894 14.338 8.8598C14.1689 8.52107 14.0778 8.19993 14.3597 7.88759C14.5505 7.67204 14.5982 7.42129 14.5549 7.15294C14.5418 7.07815 14.4941 6.98577 14.4378 6.94178C14.3293 6.867 14.2816 6.98137 14.2643 7.05616C14.2209 7.27172 14.0865 7.41689 13.9433 7.56646C13.5313 7.99317 13.4663 8.00637 12.8895 7.76442C12.3257 7.52686 11.8443 7.66764 11.6187 8.22193C11.3715 8.8246 11.198 8.8642 10.5301 8.72782C10.309 8.68383 10.1572 8.57825 10.0748 8.3715C9.95767 8.06796 9.84925 7.77322 9.50662 7.64124C9.18135 7.51807 8.89511 7.58405 8.58719 7.69843C8.18819 7.848 7.56366 7.43888 7.46391 7.00337C7.42054 6.80981 7.5333 6.66464 7.61137 6.51067C7.7328 6.26872 7.81954 6.04436 7.70678 5.76282C7.59402 5.48127 7.47259 5.23052 7.15599 5.14694C7.07359 5.12494 6.99118 5.09855 6.90878 5.06336C6.70061 4.97977 6.59218 4.82141 6.58784 4.58825C6.58784 4.44308 6.59652 4.29351 6.58784 4.14834C6.56616 3.8316 6.73096 3.66004 7.00419 3.56326C7.05624 3.53246 7.11262 3.51927 7.16466 3.49727C7.72413 3.25972 7.98435 2.88139 7.75449 2.3359C7.49427 1.72442 7.77617 1.41649 8.15783 1.06896C8.366 0.879794 8.55249 0.875395 8.78235 1.00297C8.98185 1.11735 9.18569 1.25372 9.4329 1.20093C9.81889 1.11735 10.1398 0.967776 10.2439 0.523465C10.3133 0.228724 10.4651 -0.0308242 10.8381 0.00436881C11.2414 0.0439609 11.6794 0.0351626 11.8009 0.563057C11.8746 0.875395 12.0438 1.07335 12.3257 1.21413C12.5729 1.3373 12.8027 1.40329 13.0586 1.24492C13.6224 0.892991 13.6961 1.09535 14.0821 1.47807C14.1428 1.53966 14.2036 1.60565 14.2599 1.67164C14.3901 1.82121 14.4074 1.97957 14.312 2.15554C14.2426 2.28311 14.1689 2.41509 14.1255 2.55146C13.9867 2.96058 14.1906 3.45768 14.5765 3.66444C14.6026 3.67763 14.6329 3.68203 14.6546 3.69963C14.8584 3.836 15.2141 3.79641 15.2401 4.14394C15.2748 4.57506 15.3659 5.03696 14.9018 5.3273C14.8888 5.3273 14.8975 5.3625 14.8975 5.38889ZM10.9118 6.63384C12.0871 6.66024 13.0369 5.71003 13.1106 4.49587C13.18 3.31691 12.1392 2.19953 10.9595 2.20833C9.56734 2.22153 8.72163 3.3521 8.72163 4.40349C8.7173 5.64404 9.69311 6.63384 10.9118 6.63384ZM18.727 7.29811C18.7834 6.18073 18.0591 5.61325 17.1093 5.52527C16.1812 5.43728 15.4396 6.23792 15.4353 7.23652C15.4266 8.23512 16.1205 8.94778 17.092 8.94338C18.0331 8.93898 18.7183 8.24832 18.727 7.29811Z" fill="white"/>
<path d="M7.14285 10.1708C7.42041 10.2192 7.68063 10.1884 7.93651 9.98601C8.18372 9.78805 8.30949 9.58569 8.3225 9.25576C8.34419 8.52991 8.37888 8.5343 9.07714 8.30115C9.43277 8.18237 9.68431 8.23076 9.88815 8.5651C10.0963 8.90383 10.3652 9.11499 10.8076 9.09739C11.1589 9.08419 11.4278 9.00941 11.6013 8.68387C11.6576 8.58269 11.7314 8.49031 11.8051 8.40233C11.9092 8.27476 12.0436 8.24396 12.1954 8.29675C12.3038 8.33634 12.4036 8.39793 12.5164 8.42872C13.0411 8.5651 13.2927 8.87304 13.1929 9.44052C13.1452 9.71767 13.2189 9.96402 13.4705 10.1312C13.7264 10.3028 13.9432 10.5887 14.3162 10.4083C14.4159 10.3599 14.5417 10.3643 14.6545 10.3511C14.841 10.3335 14.9971 10.3863 15.0925 10.5623C15.1749 10.7163 15.24 10.8834 15.3397 11.0242C15.5783 11.3761 15.5392 11.6665 15.2053 11.9304C14.7803 12.2648 14.893 12.7179 14.9711 13.1446C15.0101 13.3601 15.2486 13.4261 15.4091 13.5449C15.5913 13.6813 15.8385 13.7649 15.8255 14.0552C15.8038 14.4027 15.8428 14.7679 15.5999 15.0626C15.4612 15.2298 15.2573 15.2914 15.0535 15.2782C14.6415 15.2562 14.4246 15.4937 14.2425 15.8236C14.1167 16.0436 14.069 16.246 14.1904 16.4835C14.2555 16.6111 14.2728 16.7651 14.3292 16.9014C14.4073 17.0994 14.3292 17.2402 14.1948 17.3677C14.0907 17.4689 13.9779 17.5613 13.8652 17.6537C13.5486 17.9176 13.2363 18.054 12.8676 17.7241C12.6031 17.4865 12.2778 17.5261 11.9612 17.6097C11.6967 17.6757 11.4842 17.8164 11.3931 18.098C11.3497 18.2388 11.3107 18.3839 11.2413 18.5071C11.1892 18.6039 11.0982 18.7183 11.0028 18.7447C10.6645 18.8414 10.3175 18.8282 9.97923 18.7359C9.9055 18.7139 9.83177 18.6435 9.78406 18.5775C9.73636 18.5115 9.71033 18.4191 9.68431 18.3399C9.57155 17.9792 9.49782 17.6273 9.04244 17.4909C8.66946 17.3809 8.36587 17.4293 8.05795 17.6273C7.98422 17.6757 7.90616 17.7197 7.82375 17.7373C7.74135 17.7549 7.62859 17.7769 7.57655 17.7373C7.30332 17.5217 7.03876 17.3018 6.79155 17.0554C6.73084 16.9938 6.73084 16.831 6.75252 16.7255C6.79155 16.5275 6.8913 16.3383 6.926 16.1404C7.02141 15.5685 6.70048 15.1066 6.14535 14.979C6.03258 14.9526 5.91115 14.957 5.80272 14.9262C5.72466 14.9042 5.62057 14.8602 5.59021 14.7943C5.42975 14.4467 5.32132 14.0772 5.38638 13.6901C5.40372 13.5889 5.49914 13.4877 5.58154 13.4173C5.66828 13.3425 5.7767 13.2986 5.88079 13.2458C6.11499 13.127 6.35786 13.0214 6.38388 12.7003C6.4099 12.3527 6.51399 11.9964 6.22775 11.7017C6.128 11.5961 6.04126 11.4773 5.95886 11.3585C5.9285 11.3145 5.90681 11.253 5.90247 11.1958C5.86778 10.8658 6.47062 10.1488 6.79155 10.1444C6.89564 10.1444 7.0084 10.162 7.14285 10.1708ZM10.6081 16.1448C11.7921 16.2636 13.297 15.1154 13.2883 13.5097C13.2797 11.97 12.139 10.813 10.6992 10.7691C9.22026 10.7251 8.01892 11.9612 7.99289 13.4701C7.96254 14.9306 9.1899 16.1844 10.6081 16.1448Z" fill="white"/>
<path d="M28.7539 22C28.6541 21.9121 28.5587 21.8461 28.4893 21.7625C28.0209 21.2038 27.5569 20.6451 27.0885 20.0864C26.4553 19.3254 25.8221 18.5643 25.1932 17.8033C24.8983 17.4426 24.8983 17.425 25.2669 17.1038C25.6399 16.7783 26.0216 16.466 26.4032 16.1492C27.1622 15.5157 27.9168 14.8823 28.6758 14.2488C28.8102 14.1388 28.949 14.0332 29.0878 13.9277C29.2309 13.8221 29.3567 13.8705 29.4738 13.9761C29.4955 13.9937 29.5128 14.02 29.5302 14.042C30.6578 15.4146 31.7854 16.7871 32.913 18.1596C33.0518 18.3268 33.0214 18.4808 32.8696 18.6127C32.4273 18.9911 31.9806 19.3606 31.5339 19.7345C30.7098 20.4252 29.8858 21.1158 29.0574 21.8021C28.9707 21.8725 28.871 21.9253 28.7539 22ZM26.581 17.7725C26.555 17.6053 26.4683 17.4954 26.3035 17.5085C26.1473 17.5173 26.0389 17.6229 26.0519 17.7901C26.0649 17.9485 26.156 18.0628 26.3252 18.054C26.49 18.0452 26.568 17.9309 26.581 17.7725ZM27.8951 19.321C27.8951 19.1714 27.8127 19.0614 27.6609 19.035C27.4961 19.0086 27.3921 19.1186 27.366 19.2726C27.34 19.4354 27.4311 19.5497 27.5916 19.5717C27.7564 19.5937 27.8431 19.4882 27.8951 19.321ZM27.1839 18.5951C27.2099 18.4588 27.0928 18.3092 26.954 18.318C26.8369 18.3268 26.7458 18.3796 26.7285 18.5115C26.7111 18.6347 26.7545 18.7271 26.8716 18.7711C27.0061 18.8239 27.1579 18.7359 27.1839 18.5951Z" fill="#323232"/>
<path d="M2.13847 12.6386C2.68493 12.6342 3.23139 12.6386 3.76484 12.8058C4.23323 12.951 4.29395 13.0126 4.33732 13.5361C4.34165 13.5668 4.33732 13.5932 4.34165 13.624C4.42406 14.0376 4.18986 14.4511 4.25925 14.825C4.33732 15.2473 4.35033 15.6168 4.22889 16.0172C4.17685 16.1755 4.21155 16.3647 4.20721 16.5407C4.19853 17.007 4.18986 17.4733 4.17685 17.944C4.16818 18.2035 4.04674 18.3927 3.7952 18.4631C2.68493 18.7666 1.57467 18.749 0.473078 18.4499C0.134794 18.3575 -0.0560324 18.0759 0.017696 17.702C0.152142 17.0334 0.104435 16.3647 0.134794 15.696C0.139131 15.608 0.182501 15.5113 0.156479 15.4365C-0.0733803 14.7766 0.204186 14.1167 0.160816 13.4569C0.134794 13.0522 0.247555 12.9466 0.607524 12.8102C1.10194 12.6166 1.62237 12.643 2.13847 12.6386Z" fill="white"/>
<path d="M4.31992 9.34813C3.73877 9.36133 3.17496 9.31734 2.64585 9.0182C2.32491 8.83783 2.21649 8.59148 2.22083 8.23075C2.22516 7.86563 2.35961 7.61488 2.69356 7.4785C3.76045 7.05179 4.82735 7.06059 5.88123 7.53129C6.30625 7.72485 6.4407 7.9976 6.406 8.43751C6.37565 8.84663 6.11543 9.03579 5.76847 9.17216C5.29574 9.35693 4.81 9.34373 4.31992 9.34813Z" fill="white"/>
<path d="M4.52325 10.5095C4.53626 10.7031 4.45386 10.8526 4.31074 10.9626C4.12858 11.1034 3.9421 11.2486 3.73826 11.3541C2.96194 11.7589 2.1596 12.0844 1.30088 12.2428C0.897542 12.3176 0.567933 12.0404 0.554922 11.6093C0.550585 11.5037 0.606966 11.3717 0.680694 11.3014C0.845499 11.1386 1.02765 10.9978 1.21848 10.8614C1.96877 10.3336 2.83617 10.0916 3.69922 9.86724C4.16762 9.74847 4.48855 10.0256 4.52325 10.5095Z" fill="white"/>
<path d="M26.5809 17.7725C26.5679 17.9308 26.4899 18.0452 26.3251 18.054C26.1559 18.0628 26.0648 17.9528 26.0518 17.7901C26.0388 17.6185 26.1473 17.5173 26.3034 17.5085C26.4682 17.4953 26.5593 17.6053 26.5809 17.7725Z" fill="white"/>
<path d="M27.8948 19.3209C27.8471 19.488 27.7561 19.5936 27.5913 19.5672C27.4308 19.5452 27.3397 19.4309 27.3657 19.2681C27.3918 19.1185 27.4958 19.0041 27.6606 19.0305C27.8124 19.0613 27.8948 19.1713 27.8948 19.3209Z" fill="white"/>
<path d="M27.1832 18.5951C27.1572 18.7359 27.0054 18.8238 26.8753 18.7755C26.7582 18.7315 26.7148 18.6391 26.7322 18.5159C26.7495 18.3839 26.8406 18.3267 26.9577 18.3223C27.0922 18.3092 27.2093 18.4587 27.1832 18.5951Z" fill="white"/>
</g>
<defs>
<clipPath id="clip0_544_3214">
<rect width="33" height="22" fill="white"/>
</clipPath>
</defs>
</svg>
