<svg width="11" height="18" viewBox="0 0 11 18" fill="none" xmlns="http://www.w3.org/2000/svg">
<path d="M3.24203 13.8946C3.24203 12.7463 3.23826 11.5981 3.24582 10.4498C3.24959 10.2345 3.18916 10.174 2.97385 10.1778C2.3355 10.1929 1.69715 10.174 1.0588 10.1854C0.737733 10.1929 0.597983 10.0418 0.594205 9.74344C0.590428 8.85579 0.586651 7.96814 0.594205 7.08049C0.597983 6.71788 0.722622 6.61212 1.10412 6.60834C1.71981 6.60456 2.33928 6.59701 2.95497 6.61212C3.17783 6.6159 3.24959 6.56679 3.24582 6.3326C3.23071 5.66026 3.20427 4.98791 3.2496 4.31934C3.35158 2.77068 3.95594 1.50153 5.41017 0.764971C6.05985 0.436352 6.76241 0.323035 7.48387 0.31548C8.16754 0.307926 8.84744 0.307926 9.53112 0.31548C9.93528 0.319258 10.041 0.413688 10.0448 0.810297C10.0562 1.59974 10.0599 2.39296 10.0599 3.1824C10.0599 3.58278 9.95417 3.67721 9.55756 3.68099C8.9532 3.68854 8.34507 3.66966 7.74071 3.73009C7.20813 3.78675 6.95883 4.04738 6.95506 4.56864C6.9475 5.16544 6.9626 5.75847 6.94749 6.35527C6.93994 6.56679 7.01172 6.60079 7.20435 6.60079C7.94091 6.58946 8.67746 6.59323 9.41402 6.59701C9.84085 6.59701 9.94661 6.70655 9.94661 7.13715C9.95039 7.97192 9.94661 8.80669 9.94661 9.63768C9.94661 10.0834 9.85597 10.174 9.42159 10.174C8.71902 10.1778 8.01268 10.1892 7.31012 10.1665C7.00794 10.1552 6.90972 10.2231 6.9135 10.548C6.92861 12.6935 6.92106 14.8351 6.92106 16.9806C6.92106 17.0675 6.92106 17.1544 6.92106 17.2412C6.90973 17.7172 6.84174 17.7965 6.37714 17.8003C5.51216 17.8078 4.64339 17.8078 3.77841 17.8003C3.31758 17.7965 3.24582 17.7096 3.24582 17.2375C3.24204 16.127 3.24203 15.0089 3.24203 13.8946Z" fill="#457C9E"/>
</svg>
