Namespace(bp_file='bandpass_i.txt', chunk_size=5000000, npix=1000, outfile=None, sed_file='sky_sed.txt', seed=None, sky_level=1000.0)
time for get_waves = 0.15
time for get_angles = 0.00
0 0, 0 1, 0 2, 0 3, 0 4, 0 5, 0 6, 0 7, 1 0, 1 1, 1 2, 1 3, 1 4, 1 5, 1 6, 1 7, 
total photons = 1_016_014_249
time for sky_background = 781.86
704.60user 80.89system 13:03.97elapsed 100%CPU (0avgtext+0avgdata 3142820maxresident)k
140inputs+0outputs (55major+34524839minor)pagefaults 0swaps
