
Currently Loaded Modules:
  1) craype-x86-milan                       10) gcc/11.2.0
  2) libfabric/1.15.2.0                     11) perftools-base/23.03.0
  3) craype-network-ofi                     12) cpe/23.03
  4) xpmem/2.6.2-2.5_2.33__gd067c3f.shasta  13) Nsight-Compute/2022.1.1
  5) PrgEnv-gnu/8.3.3                       14) Nsight-Systems/2022.2.1
  6) cray-dsmml/0.2.2                       15) cudatoolkit/11.7
  7) cray-libsci/23.02.1.1                  16) craype-accel-nvidia80
  8) cray-mpich/8.1.25                      17) gpu/1.0
  9) craype/2.7.20                          18) forge/23.0.2-linux-x86_64

 

Linaro Forge 23.0.2 - Linaro MAP

MAP: No debug symbols were loaded for the glibc library.
MAP: It is recommended you install the glibc debug symbols.
Profiling             : /global/cfs/cdirs/m888/baustin/N10bench/HMM/profile/hmmer-3.3.2/src/hpc_hmmsearch --cpu 64 -o out.txt --noali data/Pfam-A.hmm data/uniprot_sprot.fasta
Linaro Forge sampler  : preload
MPI implementation    : Auto-Detect (SLURM (MPMD))
* number of processes : 1
* number of nodes     : 1
* MPI wrapper         : preload (JIT compiled)


MAP analysing program...
MAP gathering samples...
MAP generated /global/cfs/cdirs/m888/baustin/N10bench/HMM/profile/benchmark/single-18957313/hpc_hmmsearch_1p_1n_2023-12-04_17-21.map

Linaro MAP profiling summary
============================
Profiling time:      565 seconds
Peak process memory: 6597197824 B (~6.14 GiB)

Compute:              99.1% |=========|
MPI:                   0.0% |
I/O:                   0.9% ||
  (based on time on the main thread)
HMMsearch_walltime: 598
Missing Query Count: 0    Allowed: 0
Average Mantissa Error: 1.18e-06    Tolerance: 1.00e-04
Validation: PASSED
