
 BerkeleyGW version 3.0+git v3.0-211-g429f1d3 by mdelben <mdelben@lbl.gov> at 2022-11-28 13:25:36 -0800
 Epsilon code, Complex version, run on 22-Dec-2022 at 15:11:01 -0800

                                                                 ..o.          
                                                                .oxxo.         
                                                               .oxxxxo...      
                                                               oxxxxxxo.       
                                                              .oxxxxxxx.       
                                                              .ooooooxxo..     
                                                              .oooooooxo..     
                                                              .oooooxxo...     
                                                       .........oxooo......    
                                                 ............................  
                                             ................................. 
                                          .................................... 
           .          ..oo. ....  .................................oooxxxxxxxo.
     .............oxxxx@ox@@@x@x.....................o...........ooooooooooxx. 
    .o.........oox@x.oo........xxx@@............ooxxxxo..........ooooxxxxxoxo  
    .x........x@xxo...............o@xxo........oxxx@@@xoooooooooooooooxxxo...  
    .o......ox@@o..................oox@o.....ooxxx@xoooxxxxxxxoooooooooooo.... 
    o..ooooo@@xoooo....ooo...........x@o.....ooxxxxo   .oxxxxxxxxxxooooooo.... 
    . .oooo@@@@@@@@@@@@@@@@@@@@@@@@@@@@@@....ooooox.     .oxx@@@@@xxoo........ 
      .ooooxxxxxxxooooooxooooooooooooooxo...oooooxx.        ..ox@xxxoo.........
      .ooooooxxxx@xoooooooooooooxxoooooooooooxxxxx.            .oxxooooooooxxo.
     .oooooxxxxx@@@xxxxxxxxxxxxxxxxxxxxxxxxoxxxxo.                .oxxxxxxxxo. 
   ....oooxxxxx@@@xo..oxxx@@@@@@xxxxoxxoooooooxx.                  .oxxxoo..   
  .....ooxxxx@@xo.       ........    .ooooooooxxo                              
  ..oooxxxx@@@o                       .oooooooxoo.                             
  ....oxooxxxxx.                       .ooo..oooo.                             
  .....o.ooxxxxxo.                     .oooooooxo.                             
 ......ooooxxxxxxo.                     .ooooooxoo..                           
........ooxxxxxxxo..                     .o....oxoo...                         
.......ooooxxxxxxxo.                     ........oooo.                         
.ooooooo..ooxxxxoooo.                    .........ooo...                       
..oxo...ooooxxxoooo..                    .ooo......oooo...                     
  .ooooo....o.                            .oxxxoo....ooo....                   
    .oooooo...                              ...ooooo...ooo..                   
       ...                                     .oo.......                      
                                               ....ooo...                      
                      __              __                                       
 ______              [  |            [  |                 ._____  _          _ 
|_   _               | |  _          | |                /  ___ | |        | |
  | |_) | .---.  _. _.| | / |  .---.  | | .---.  _    _ / /    _|   /  / / 
  |  __'./ /__\[ /`_| '' <  / /__\ | |/ /__\|   | | |   _____  /  / /  
 _| |__| | __. | |   | |`  | ___. | || ___.  / /  .___| |    /  /   
|_______/ .__./[_]  [__|  _] .__./[___].__./    /   .____./    /  /    
                                                  / /                          
                                                 /_/                           
 --------------------------------------------------------------------------------
 Please cite the main BerkeleyGW paper when using results from this calculation:

 Jack Deslippe, Georgy Samsonidze, David A. Strubbe, Manish Jain, Marvin L.
 Cohen, and Steven G. Louie, "BerkeleyGW: A Massively Parallel Computer Package
 for the Calculation of the Quasiparticle and Optical Properties of Materials
 and Nanostructures," Comput. Phys. Commun. 183, 1269 (2012)

 Aditionally, PLEASE CITE ALL PAPERS REPORTED AT THE END OF THIS CALCULATION.
 --------------------------------------------------------------------------------

 Running MPI version (parallel)
 Running with 256 MPI task(s)
 Using OpenMP. Number of threads per MPI task: 16
 Number of threads used for sorting routines: 1

 Compilation flags:
 - Compiler: PGI
 - Para. flags: MPI, OMP
 - Math  flags: USESCALAPACK, UNPACKED, USEFFTW3, HDF5
 - Debug flags: 

 Running with verbosity level 1 (default).

 We will start a new calculation from scratch.

 Experimental Features:
  - FFTs Optimization Level: 0
  - Use HDF5 Parallel IO: T

 
 We`ll perform a uniform sampling of the full BZ.
 
 Computing the static inverse dielectric matrix

 We are using matrix communication scheme

 We are using non-blocking cyclic communication scheme

 Using block algorithm over valence bands

 We are communicating via MPI

 We are using no truncation
 Reading header of WFN.h5
 Highest occupied band (unshifted grid) = 1996
 Valence max    (unshifted grid) = 6.233852 eV
 Conduction min (unshifted grid) = 6.597934 eV
 Middle energy  (unshifted grid) = 6.415893 eV
 Fermi  energy  (unshifted grid) = 6.415893 eV

 Reading header of WFNq.h5
 Highest occupied band (shifted grid) = 1996

 Calculation parameters:
 - Cutoff of the dielectric matrix (Ry): 8.00
 - Total number of bands in the calculation: 29346
 - Number of fully occupied valence bands: 1996
 - Number of partially occ. conduction bands: 0
 - Monkhorst-Pack q-grid for epsilon(q): 1 1 1
 
 Running with 4 valence pools
 Number of conduction bands per processor: 428
 Number of valence bands per processor: 499

 Memory available: 59596.4 MB per PE
 Memory required for execution: 15721.9 MB per PE
 Memory required for vcoul: 0.0 MB per PE

 Valence block alogorithm info
 Max memory allowed per valence block (Gb):    20.00
 Memory for a single valence band (Gb):         0.71
 Number of valence bands per block:              28

 Number of electrons per unit cell (from ifmax) = 3992.000000
 Number of electrons per unit cell (from occupations) = 3992.000000
 Plasma Frequency = 1.218925 Ry

 Reading using H5FD_MPIO_INDEPENDENT.
 Using communication style:  1
 
 Reading using H5FD_MPIO_INDEPENDENT.
 Using communication style:  1
 
 Initializing eps0mat.h5
 - Screened Coulomb cutoff: 8.000 Ry
 - Total number of bands: 29346
 - Number of q-points: 1

 Scissors parameters:
 - Valence:    es =   0.0000 eV, e0 =   0.0000 eV, edel =   0.0000
 - Conduction: es =   0.0000 eV, e0 =   0.0000 eV, edel =   0.0000

 Q0 and |Q0| =  0.000000  0.000000  0.200000  0.024493

 GPU acceleration is : ENABLED
 
 Algorithms used:
 - mtxel         : OPENACC_ALGO
 - chi_summation : OPENACC_ALGO
 
 You have a slightly shifted q0 vector and a semiconductor.
 So, reading from WFNq.
 Reading header of WFNq.h5
 Highest occupied band (shifted grid) = 1996
 Reading using H5FD_MPIO_INDEPENDENT.
 Using communication style:  1
 
 Summary of the WFN files:
 - Number of k-points in WFN: 1
 - Number of k-points in WFNq: 1
 - Number of k-points in the full BZ of WFN: 1

================================================================================
 15:11:12   Dealing with q =  0.000000  0.000000  0.200000                 1 / 1
================================================================================

 This is the special q->0 point.
 Rank of the polarizability matrix (nmtx): 51627
 
 BLACS processor grid:  16 x  16; BLOCKSIZE =   32
 
 Number of k-points in the irreducible BZ(q) (nrk): 1
 
 ========================================================
 == Start Building Polarizability Using:    18 Blocks. ==
 ========================================================
 
 Valence Block Number:     1 of    18
 ------------------------------------
 
 Using GPU support via OpenACC/OMP-Target implementation
 Using batch implementation, batch size:    20
 
 Started calculation of matrix elements with 28 transition(s) at 15:11:14.
 [ 15:11:14 |   0% ] transition  1 / 28.
 [ 15:11:15 |   7% ] transition  3 / 28, remaining: 7 s.
 [ 15:11:16 |  18% ] transition  6 / 28, remaining: 6 s.
 [ 15:11:17 |  29% ] transition  9 / 28, remaining: 5 s.
 [ 15:11:17 |  39% ] transition 12 / 28, remaining: 4 s.
 [ 15:11:18 |  46% ] transition 14 / 28, remaining: 4 s.
 [ 15:11:19 |  57% ] transition 17 / 28, remaining: 3 s.
 [ 15:11:20 |  68% ] transition 20 / 28, remaining: 2 s.
 [ 15:11:20 |  79% ] transition 23 / 28, remaining: 2 s.
 [ 15:11:21 |  89% ] transition 26 / 28, remaining: 1 s.
 [ 15:11:22 |  96% ] transition 28 / 28, remaining: 0 s.
 Finished calculation of matrix elements at 15:11:22.
 Elapsed time: 8 s.
 
 CHI summation GPU algorithm offloading all matrix elements to device.
 
 Started building polarizability matrix with 256 processor(s) at 15:11:24.
 [ 15:11:25 |   0% ] processor   1 / 256.
 [ 15:11:26 |   1% ] processor   3 / 256, remaining: 92 s.
 [ 15:11:29 |  10% ] processor  26 / 256, remaining: 39 s.
 [ 15:11:33 |  20% ] processor  52 / 256, remaining: 34 s.
 [ 15:11:38 |  30% ] processor  77 / 256, remaining: 31 s.
 [ 15:11:42 |  40% ] processor 103 / 256, remaining: 26 s.
 [ 15:11:47 |  50% ] processor 129 / 256, remaining: 22 s.
 [ 15:11:51 |  60% ] processor 154 / 256, remaining: 18 s.
 [ 15:11:56 |  70% ] processor 180 / 256, remaining: 13 s.
 [ 15:12:00 |  80% ] processor 205 / 256, remaining: 9 s.
 [ 15:12:05 |  90% ] processor 231 / 256, remaining: 5 s.
 Finished building polarizability matrix at 15:12:09.
 Elapsed time: 45 s.
 
 Done With Block Number:     1
 -----------------------------
 
 
 Valence Block Number:     2 of    18
 ------------------------------------
 
 Using GPU support via OpenACC/OMP-Target implementation
 Using batch implementation, batch size:    20
 
 Started calculation of matrix elements with 28 transition(s) at 15:12:11.
 [ 15:12:11 |   0% ] transition  1 / 28.
 [ 15:12:12 |   7% ] transition  3 / 28, remaining: 7 s.
 [ 15:12:13 |  18% ] transition  6 / 28, remaining: 6 s.
 [ 15:12:13 |  29% ] transition  9 / 28, remaining: 5 s.
 [ 15:12:14 |  39% ] transition 12 / 28, remaining: 4 s.
 [ 15:12:15 |  46% ] transition 14 / 28, remaining: 4 s.
 [ 15:12:15 |  57% ] transition 17 / 28, remaining: 3 s.
 [ 15:12:16 |  68% ] transition 20 / 28, remaining: 2 s.
 [ 15:12:17 |  79% ] transition 23 / 28, remaining: 2 s.
 [ 15:12:18 |  89% ] transition 26 / 28, remaining: 1 s.
 [ 15:12:18 |  96% ] transition 28 / 28, remaining: 0 s.
 Finished calculation of matrix elements at 15:12:19.
 Elapsed time: 8 s.
 
 CHI summation GPU algorithm offloading all matrix elements to device.
 
 Started building polarizability matrix with 256 processor(s) at 15:12:20.
 [ 15:12:20 |   0% ] processor   1 / 256.
 [ 15:12:21 |   1% ] processor   3 / 256, remaining: 39 s.
 [ 15:12:24 |  10% ] processor  26 / 256, remaining: 38 s.
 [ 15:12:29 |  20% ] processor  52 / 256, remaining: 34 s.
 [ 15:12:33 |  30% ] processor  77 / 256, remaining: 30 s.
 [ 15:12:38 |  40% ] processor 103 / 256, remaining: 26 s.
 [ 15:12:42 |  50% ] processor 129 / 256, remaining: 22 s.
 [ 15:12:47 |  60% ] processor 154 / 256, remaining: 18 s.
 [ 15:12:51 |  70% ] processor 180 / 256, remaining: 13 s.
 [ 15:12:55 |  80% ] processor 205 / 256, remaining: 9 s.
 [ 15:13:00 |  90% ] processor 231 / 256, remaining: 4 s.
 Finished building polarizability matrix at 15:13:04.
 Elapsed time: 45 s.
 
 Done With Block Number:     2
 -----------------------------
 
 
 Valence Block Number:     3 of    18
 ------------------------------------
 
 Using GPU support via OpenACC/OMP-Target implementation
 Using batch implementation, batch size:    20
 
 Started calculation of matrix elements with 28 transition(s) at 15:13:06.
 [ 15:13:06 |   0% ] transition  1 / 28.
 [ 15:13:07 |   7% ] transition  3 / 28, remaining: 7 s.
 [ 15:13:07 |  18% ] transition  6 / 28, remaining: 6 s.
 [ 15:13:08 |  29% ] transition  9 / 28, remaining: 5 s.
 [ 15:13:09 |  39% ] transition 12 / 28, remaining: 4 s.
 [ 15:13:10 |  46% ] transition 14 / 28, remaining: 4 s.
 [ 15:13:10 |  57% ] transition 17 / 28, remaining: 3 s.
 [ 15:13:11 |  68% ] transition 20 / 28, remaining: 2 s.
 [ 15:13:12 |  79% ] transition 23 / 28, remaining: 2 s.
 [ 15:13:13 |  89% ] transition 26 / 28, remaining: 1 s.
 [ 15:13:13 |  96% ] transition 28 / 28, remaining: 0 s.
 Finished calculation of matrix elements at 15:13:13.
 Elapsed time: 8 s.
 
 CHI summation GPU algorithm offloading all matrix elements to device.
 
 Started building polarizability matrix with 256 processor(s) at 15:13:14.
 [ 15:13:15 |   0% ] processor   1 / 256.
 [ 15:13:15 |   1% ] processor   3 / 256, remaining: 41 s.
 [ 15:13:19 |  10% ] processor  26 / 256, remaining: 40 s.
 [ 15:13:24 |  20% ] processor  52 / 256, remaining: 36 s.
 [ 15:13:28 |  30% ] processor  77 / 256, remaining: 31 s.
 [ 15:13:32 |  40% ] processor 103 / 256, remaining: 26 s.
 [ 15:13:37 |  50% ] processor 129 / 256, remaining: 22 s.
 [ 15:13:41 |  60% ] processor 154 / 256, remaining: 18 s.
 [ 15:13:46 |  70% ] processor 180 / 256, remaining: 13 s.
 [ 15:13:50 |  80% ] processor 205 / 256, remaining: 9 s.
 [ 15:13:54 |  90% ] processor 231 / 256, remaining: 4 s.
 Finished building polarizability matrix at 15:13:59.
 Elapsed time: 45 s.
 
 Done With Block Number:     3
 -----------------------------
 
 
 Valence Block Number:     4 of    18
 ------------------------------------
 
 Using GPU support via OpenACC/OMP-Target implementation
 Using batch implementation, batch size:    20
 
 Started calculation of matrix elements with 28 transition(s) at 15:14:00.
 [ 15:14:00 |   0% ] transition  1 / 28.
 [ 15:14:01 |   7% ] transition  3 / 28, remaining: 7 s.
 [ 15:14:02 |  18% ] transition  6 / 28, remaining: 6 s.
 [ 15:14:03 |  29% ] transition  9 / 28, remaining: 5 s.
 [ 15:14:04 |  39% ] transition 12 / 28, remaining: 4 s.
 [ 15:14:04 |  46% ] transition 14 / 28, remaining: 4 s.
 [ 15:14:05 |  57% ] transition 17 / 28, remaining: 3 s.
 [ 15:14:06 |  68% ] transition 20 / 28, remaining: 2 s.
 [ 15:14:07 |  79% ] transition 23 / 28, remaining: 2 s.
 [ 15:14:07 |  89% ] transition 26 / 28, remaining: 1 s.
 [ 15:14:08 |  96% ] transition 28 / 28, remaining: 0 s.
 Finished calculation of matrix elements at 15:14:08.
 Elapsed time: 8 s.
 
 CHI summation GPU algorithm offloading all matrix elements to device.
 
 Started building polarizability matrix with 256 processor(s) at 15:14:09.
 [ 15:14:10 |   0% ] processor   1 / 256.
 [ 15:14:10 |   1% ] processor   3 / 256, remaining: 40 s.
 [ 15:14:14 |  10% ] processor  26 / 256, remaining: 41 s.
 [ 15:14:19 |  20% ] processor  52 / 256, remaining: 35 s.
 [ 15:14:23 |  30% ] processor  77 / 256, remaining: 31 s.
 [ 15:14:27 |  40% ] processor 103 / 256, remaining: 26 s.
 [ 15:14:32 |  50% ] processor 129 / 256, remaining: 22 s.
 [ 15:14:36 |  60% ] processor 154 / 256, remaining: 17 s.
 [ 15:14:40 |  70% ] processor 180 / 256, remaining: 13 s.
 [ 15:14:44 |  80% ] processor 205 / 256, remaining: 9 s.
 [ 15:14:49 |  90% ] processor 231 / 256, remaining: 4 s.
 Finished building polarizability matrix at 15:14:53.
 Elapsed time: 44 s.
 
 Done With Block Number:     4
 -----------------------------
 
 
 Valence Block Number:     5 of    18
 ------------------------------------
 
 Using GPU support via OpenACC/OMP-Target implementation
 Using batch implementation, batch size:    20
 
 Started calculation of matrix elements with 28 transition(s) at 15:14:54.
 [ 15:14:54 |   0% ] transition  1 / 28.
 [ 15:14:55 |   7% ] transition  3 / 28, remaining: 7 s.
 [ 15:14:56 |  18% ] transition  6 / 28, remaining: 6 s.
 [ 15:14:57 |  29% ] transition  9 / 28, remaining: 5 s.
 [ 15:14:58 |  39% ] transition 12 / 28, remaining: 4 s.
 [ 15:14:58 |  46% ] transition 14 / 28, remaining: 4 s.
 [ 15:14:59 |  57% ] transition 17 / 28, remaining: 3 s.
 [ 15:15:00 |  68% ] transition 20 / 28, remaining: 2 s.
 [ 15:15:01 |  79% ] transition 23 / 28, remaining: 2 s.
 [ 15:15:01 |  89% ] transition 26 / 28, remaining: 1 s.
 [ 15:15:02 |  96% ] transition 28 / 28, remaining: 0 s.
 Finished calculation of matrix elements at 15:15:02.
 Elapsed time: 8 s.
 
 CHI summation GPU algorithm offloading all matrix elements to device.
 
 Started building polarizability matrix with 256 processor(s) at 15:15:04.
 [ 15:15:05 |   0% ] processor   1 / 256.
 [ 15:15:05 |   1% ] processor   3 / 256, remaining: 39 s.
 [ 15:15:09 |  10% ] processor  26 / 256, remaining: 38 s.
 [ 15:15:13 |  20% ] processor  52 / 256, remaining: 34 s.
 [ 15:15:17 |  30% ] processor  77 / 256, remaining: 30 s.
 [ 15:15:22 |  40% ] processor 103 / 256, remaining: 26 s.
 [ 15:15:26 |  50% ] processor 129 / 256, remaining: 22 s.
 [ 15:15:31 |  60% ] processor 154 / 256, remaining: 18 s.
 [ 15:15:35 |  70% ] processor 180 / 256, remaining: 13 s.
 [ 15:15:39 |  80% ] processor 205 / 256, remaining: 9 s.
 [ 15:15:44 |  90% ] processor 231 / 256, remaining: 4 s.
 Finished building polarizability matrix at 15:15:49.
 Elapsed time: 45 s.
 
 Done With Block Number:     5
 -----------------------------
 
 
 Valence Block Number:     6 of    18
 ------------------------------------
 
 Using GPU support via OpenACC/OMP-Target implementation
 Using batch implementation, batch size:    20
 
 Started calculation of matrix elements with 28 transition(s) at 15:15:50.
 [ 15:15:50 |   0% ] transition  1 / 28.
 [ 15:15:51 |   7% ] transition  3 / 28, remaining: 7 s.
 [ 15:15:51 |  18% ] transition  6 / 28, remaining: 6 s.
 [ 15:15:52 |  29% ] transition  9 / 28, remaining: 5 s.
 [ 15:15:53 |  39% ] transition 12 / 28, remaining: 4 s.
 [ 15:15:54 |  46% ] transition 14 / 28, remaining: 4 s.
 [ 15:15:54 |  57% ] transition 17 / 28, remaining: 3 s.
 [ 15:15:55 |  68% ] transition 20 / 28, remaining: 2 s.
 [ 15:15:56 |  79% ] transition 23 / 28, remaining: 2 s.
 [ 15:15:57 |  89% ] transition 26 / 28, remaining: 1 s.
 [ 15:15:57 |  96% ] transition 28 / 28, remaining: 0 s.
 Finished calculation of matrix elements at 15:15:57.
 Elapsed time: 8 s.
 
 CHI summation GPU algorithm offloading all matrix elements to device.
 
 Started building polarizability matrix with 256 processor(s) at 15:15:58.
 [ 15:15:59 |   0% ] processor   1 / 256.
 [ 15:15:59 |   1% ] processor   3 / 256, remaining: 38 s.
 [ 15:16:03 |  10% ] processor  26 / 256, remaining: 39 s.
 [ 15:16:07 |  20% ] processor  52 / 256, remaining: 34 s.
 [ 15:16:12 |  30% ] processor  77 / 256, remaining: 30 s.
 [ 15:16:16 |  40% ] processor 103 / 256, remaining: 26 s.
 [ 15:16:21 |  50% ] processor 129 / 256, remaining: 22 s.
 [ 15:16:25 |  60% ] processor 154 / 256, remaining: 18 s.
 [ 15:16:30 |  70% ] processor 180 / 256, remaining: 13 s.
 [ 15:16:34 |  80% ] processor 205 / 256, remaining: 9 s.
 [ 15:16:38 |  90% ] processor 231 / 256, remaining: 4 s.
 Finished building polarizability matrix at 15:16:43.
 Elapsed time: 44 s.
 
 Done With Block Number:     6
 -----------------------------
 
 
 Valence Block Number:     7 of    18
 ------------------------------------
 
 Using GPU support via OpenACC/OMP-Target implementation
 Using batch implementation, batch size:    20
 
 Started calculation of matrix elements with 28 transition(s) at 15:16:44.
 [ 15:16:44 |   0% ] transition  1 / 28.
 [ 15:16:45 |   7% ] transition  3 / 28, remaining: 7 s.
 [ 15:16:46 |  18% ] transition  6 / 28, remaining: 6 s.
 [ 15:16:47 |  29% ] transition  9 / 28, remaining: 5 s.
 [ 15:16:47 |  39% ] transition 12 / 28, remaining: 4 s.
 [ 15:16:48 |  46% ] transition 14 / 28, remaining: 4 s.
 [ 15:16:49 |  57% ] transition 17 / 28, remaining: 3 s.
 [ 15:16:49 |  68% ] transition 20 / 28, remaining: 2 s.
 [ 15:16:50 |  79% ] transition 23 / 28, remaining: 2 s.
 [ 15:16:51 |  89% ] transition 26 / 28, remaining: 1 s.
 [ 15:16:52 |  96% ] transition 28 / 28, remaining: 0 s.
 Finished calculation of matrix elements at 15:16:52.
 Elapsed time: 8 s.
 
 CHI summation GPU algorithm offloading all matrix elements to device.
 
 Started building polarizability matrix with 256 processor(s) at 15:16:53.
 [ 15:16:54 |   0% ] processor   1 / 256.
 [ 15:16:54 |   1% ] processor   3 / 256, remaining: 40 s.
 [ 15:16:58 |  10% ] processor  26 / 256, remaining: 38 s.
 [ 15:17:02 |  20% ] processor  52 / 256, remaining: 34 s.
 [ 15:17:06 |  30% ] processor  77 / 256, remaining: 30 s.
 [ 15:17:11 |  40% ] processor 103 / 256, remaining: 26 s.
 [ 15:17:15 |  50% ] processor 129 / 256, remaining: 22 s.
 [ 15:17:20 |  60% ] processor 154 / 256, remaining: 17 s.
 [ 15:17:24 |  70% ] processor 180 / 256, remaining: 13 s.
 [ 15:17:28 |  80% ] processor 205 / 256, remaining: 9 s.
 [ 15:17:33 |  90% ] processor 231 / 256, remaining: 4 s.
 Finished building polarizability matrix at 15:17:37.
 Elapsed time: 44 s.
 
 Done With Block Number:     7
 -----------------------------
 
 
 Valence Block Number:     8 of    18
 ------------------------------------
 
 Using GPU support via OpenACC/OMP-Target implementation
 Using batch implementation, batch size:    20
 
 Started calculation of matrix elements with 28 transition(s) at 15:17:38.
 [ 15:17:38 |   0% ] transition  1 / 28.
 [ 15:17:39 |   7% ] transition  3 / 28, remaining: 7 s.
 [ 15:17:40 |  18% ] transition  6 / 28, remaining: 6 s.
 [ 15:17:41 |  29% ] transition  9 / 28, remaining: 5 s.
 [ 15:17:42 |  39% ] transition 12 / 28, remaining: 4 s.
 [ 15:17:42 |  46% ] transition 14 / 28, remaining: 4 s.
 [ 15:17:43 |  57% ] transition 17 / 28, remaining: 3 s.
 [ 15:17:44 |  68% ] transition 20 / 28, remaining: 2 s.
 [ 15:17:45 |  79% ] transition 23 / 28, remaining: 2 s.
 [ 15:17:45 |  89% ] transition 26 / 28, remaining: 1 s.
 [ 15:17:46 |  96% ] transition 28 / 28, remaining: 0 s.
 Finished calculation of matrix elements at 15:17:46.
 Elapsed time: 8 s.
 
 CHI summation GPU algorithm offloading all matrix elements to device.
 
 Started building polarizability matrix with 256 processor(s) at 15:17:48.
 [ 15:17:48 |   0% ] processor   1 / 256.
 [ 15:17:49 |   1% ] processor   3 / 256, remaining: 39 s.
 [ 15:17:53 |  10% ] processor  26 / 256, remaining: 39 s.
 [ 15:17:57 |  20% ] processor  52 / 256, remaining: 34 s.
 [ 15:18:01 |  30% ] processor  77 / 256, remaining: 31 s.
 [ 15:18:06 |  40% ] processor 103 / 256, remaining: 26 s.
 [ 15:18:10 |  50% ] processor 129 / 256, remaining: 22 s.
 [ 15:18:15 |  60% ] processor 154 / 256, remaining: 18 s.
 [ 15:18:19 |  70% ] processor 180 / 256, remaining: 13 s.
 [ 15:18:24 |  80% ] processor 205 / 256, remaining: 9 s.
 [ 15:18:28 |  90% ] processor 231 / 256, remaining: 4 s.
 Finished building polarizability matrix at 15:18:33.
 Elapsed time: 45 s.
 
 Done With Block Number:     8
 -----------------------------
 
 
 Valence Block Number:     9 of    18
 ------------------------------------
 
 Using GPU support via OpenACC/OMP-Target implementation
 Using batch implementation, batch size:    20
 
 Started calculation of matrix elements with 28 transition(s) at 15:18:34.
 [ 15:18:34 |   0% ] transition  1 / 28.
 [ 15:18:35 |   7% ] transition  3 / 28, remaining: 7 s.
 [ 15:18:36 |  18% ] transition  6 / 28, remaining: 6 s.
 [ 15:18:36 |  29% ] transition  9 / 28, remaining: 5 s.
 [ 15:18:37 |  39% ] transition 12 / 28, remaining: 4 s.
 [ 15:18:38 |  46% ] transition 14 / 28, remaining: 4 s.
 [ 15:18:38 |  57% ] transition 17 / 28, remaining: 3 s.
 [ 15:18:39 |  68% ] transition 20 / 28, remaining: 2 s.
 [ 15:18:40 |  79% ] transition 23 / 28, remaining: 2 s.
 [ 15:18:41 |  89% ] transition 26 / 28, remaining: 1 s.
 [ 15:18:41 |  96% ] transition 28 / 28, remaining: 0 s.
 Finished calculation of matrix elements at 15:18:42.
 Elapsed time: 8 s.
 
 CHI summation GPU algorithm offloading all matrix elements to device.
 
 Started building polarizability matrix with 256 processor(s) at 15:18:43.
 [ 15:18:43 |   0% ] processor   1 / 256.
 [ 15:18:44 |   1% ] processor   3 / 256, remaining: 41 s.
 [ 15:18:48 |  10% ] processor  26 / 256, remaining: 39 s.
 [ 15:18:52 |  20% ] processor  52 / 256, remaining: 34 s.
 [ 15:18:56 |  30% ] processor  77 / 256, remaining: 30 s.
 [ 15:19:01 |  40% ] processor 103 / 256, remaining: 26 s.
 [ 15:19:05 |  50% ] processor 129 / 256, remaining: 22 s.
 [ 15:19:10 |  60% ] processor 154 / 256, remaining: 18 s.
 [ 15:19:14 |  70% ] processor 180 / 256, remaining: 13 s.
 [ 15:19:19 |  80% ] processor 205 / 256, remaining: 9 s.
 [ 15:19:23 |  90% ] processor 231 / 256, remaining: 4 s.
 Finished building polarizability matrix at 15:19:27.
 Elapsed time: 45 s.
 
 Done With Block Number:     9
 -----------------------------
 
 
 Valence Block Number:    10 of    18
 ------------------------------------
 
 Using GPU support via OpenACC/OMP-Target implementation
 Using batch implementation, batch size:    20
 
 Started calculation of matrix elements with 28 transition(s) at 15:19:29.
 [ 15:19:29 |   0% ] transition  1 / 28.
 [ 15:19:30 |   7% ] transition  3 / 28, remaining: 7 s.
 [ 15:19:30 |  18% ] transition  6 / 28, remaining: 6 s.
 [ 15:19:31 |  29% ] transition  9 / 28, remaining: 5 s.
 [ 15:19:32 |  39% ] transition 12 / 28, remaining: 4 s.
 [ 15:19:33 |  46% ] transition 14 / 28, remaining: 4 s.
 [ 15:19:33 |  57% ] transition 17 / 28, remaining: 3 s.
 [ 15:19:34 |  68% ] transition 20 / 28, remaining: 2 s.
 [ 15:19:35 |  79% ] transition 23 / 28, remaining: 2 s.
 [ 15:19:36 |  89% ] transition 26 / 28, remaining: 1 s.
 [ 15:19:36 |  96% ] transition 28 / 28, remaining: 0 s.
 Finished calculation of matrix elements at 15:19:36.
 Elapsed time: 8 s.
 
 CHI summation GPU algorithm offloading all matrix elements to device.
 
 Started building polarizability matrix with 256 processor(s) at 15:19:37.
 [ 15:19:38 |   0% ] processor   1 / 256.
 [ 15:19:38 |   1% ] processor   3 / 256, remaining: 38 s.
 [ 15:19:42 |  10% ] processor  26 / 256, remaining: 38 s.
 [ 15:19:46 |  20% ] processor  52 / 256, remaining: 34 s.
 [ 15:19:51 |  30% ] processor  77 / 256, remaining: 30 s.
 [ 15:19:55 |  40% ] processor 103 / 256, remaining: 26 s.
 [ 15:20:00 |  50% ] processor 129 / 256, remaining: 22 s.
 [ 15:20:04 |  60% ] processor 154 / 256, remaining: 18 s.
 [ 15:20:09 |  70% ] processor 180 / 256, remaining: 13 s.
 [ 15:20:13 |  80% ] processor 205 / 256, remaining: 9 s.
 [ 15:20:18 |  90% ] processor 231 / 256, remaining: 4 s.
 Finished building polarizability matrix at 15:20:22.
 Elapsed time: 45 s.
 
 Done With Block Number:    10
 -----------------------------
 
 
 Valence Block Number:    11 of    18
 ------------------------------------
 
 Using GPU support via OpenACC/OMP-Target implementation
 Using batch implementation, batch size:    20
 
 Started calculation of matrix elements with 28 transition(s) at 15:20:23.
 [ 15:20:23 |   0% ] transition  1 / 28.
 [ 15:20:24 |   7% ] transition  3 / 28, remaining: 7 s.
 [ 15:20:25 |  18% ] transition  6 / 28, remaining: 6 s.
 [ 15:20:26 |  29% ] transition  9 / 28, remaining: 5 s.
 [ 15:20:27 |  39% ] transition 12 / 28, remaining: 4 s.
 [ 15:20:27 |  46% ] transition 14 / 28, remaining: 4 s.
 [ 15:20:28 |  57% ] transition 17 / 28, remaining: 3 s.
 [ 15:20:29 |  68% ] transition 20 / 28, remaining: 2 s.
 [ 15:20:29 |  79% ] transition 23 / 28, remaining: 2 s.
 [ 15:20:30 |  89% ] transition 26 / 28, remaining: 1 s.
 [ 15:20:31 |  96% ] transition 28 / 28, remaining: 0 s.
 Finished calculation of matrix elements at 15:20:31.
 Elapsed time: 8 s.
 
 CHI summation GPU algorithm offloading all matrix elements to device.
 
 Started building polarizability matrix with 256 processor(s) at 15:20:32.
 [ 15:20:32 |   0% ] processor   1 / 256.
 [ 15:20:33 |   1% ] processor   3 / 256, remaining: 39 s.
 [ 15:20:37 |  10% ] processor  26 / 256, remaining: 39 s.
 [ 15:20:41 |  20% ] processor  52 / 256, remaining: 35 s.
 [ 15:20:45 |  30% ] processor  77 / 256, remaining: 30 s.
 [ 15:20:50 |  40% ] processor 103 / 256, remaining: 26 s.
 [ 15:20:54 |  50% ] processor 129 / 256, remaining: 22 s.
 [ 15:20:58 |  60% ] processor 154 / 256, remaining: 17 s.
 [ 15:21:03 |  70% ] processor 180 / 256, remaining: 13 s.
 [ 15:21:07 |  80% ] processor 205 / 256, remaining: 9 s.
 [ 15:21:11 |  90% ] processor 231 / 256, remaining: 4 s.
 Finished building polarizability matrix at 15:21:16.
 Elapsed time: 44 s.
 
 Done With Block Number:    11
 -----------------------------
 
 
 Valence Block Number:    12 of    18
 ------------------------------------
 
 Using GPU support via OpenACC/OMP-Target implementation
 Using batch implementation, batch size:    20
 
 Started calculation of matrix elements with 28 transition(s) at 15:21:17.
 [ 15:21:17 |   0% ] transition  1 / 28.
 [ 15:21:18 |   7% ] transition  3 / 28, remaining: 7 s.
 [ 15:21:19 |  18% ] transition  6 / 28, remaining: 6 s.
 [ 15:21:20 |  29% ] transition  9 / 28, remaining: 5 s.
 [ 15:21:20 |  39% ] transition 12 / 28, remaining: 4 s.
 [ 15:21:21 |  46% ] transition 14 / 28, remaining: 4 s.
 [ 15:21:22 |  57% ] transition 17 / 28, remaining: 3 s.
 [ 15:21:22 |  68% ] transition 20 / 28, remaining: 2 s.
 [ 15:21:23 |  79% ] transition 23 / 28, remaining: 2 s.
 [ 15:21:24 |  89% ] transition 26 / 28, remaining: 1 s.
 [ 15:21:24 |  96% ] transition 28 / 28, remaining: 0 s.
 Finished calculation of matrix elements at 15:21:25.
 Elapsed time: 8 s.
 
 CHI summation GPU algorithm offloading all matrix elements to device.
 
 Started building polarizability matrix with 256 processor(s) at 15:21:27.
 [ 15:21:28 |   0% ] processor   1 / 256.
 [ 15:21:28 |   1% ] processor   3 / 256, remaining: 40 s.
 [ 15:21:32 |  10% ] processor  26 / 256, remaining: 39 s.
 [ 15:21:37 |  20% ] processor  52 / 256, remaining: 35 s.
 [ 15:21:41 |  30% ] processor  77 / 256, remaining: 31 s.
 [ 15:21:45 |  40% ] processor 103 / 256, remaining: 26 s.
 [ 15:21:50 |  50% ] processor 129 / 256, remaining: 22 s.
 [ 15:21:54 |  60% ] processor 154 / 256, remaining: 18 s.
 [ 15:21:59 |  70% ] processor 180 / 256, remaining: 13 s.
 [ 15:22:03 |  80% ] processor 205 / 256, remaining: 9 s.
 [ 15:22:07 |  90% ] processor 231 / 256, remaining: 4 s.
 Finished building polarizability matrix at 15:22:12.
 Elapsed time: 45 s.
 
 Done With Block Number:    12
 -----------------------------
 
 
 Valence Block Number:    13 of    18
 ------------------------------------
 
 Using GPU support via OpenACC/OMP-Target implementation
 Using batch implementation, batch size:    20
 
 Started calculation of matrix elements with 28 transition(s) at 15:22:13.
 [ 15:22:13 |   0% ] transition  1 / 28.
 [ 15:22:14 |   7% ] transition  3 / 28, remaining: 7 s.
 [ 15:22:15 |  18% ] transition  6 / 28, remaining: 6 s.
 [ 15:22:16 |  29% ] transition  9 / 28, remaining: 5 s.
 [ 15:22:16 |  39% ] transition 12 / 28, remaining: 4 s.
 [ 15:22:17 |  46% ] transition 14 / 28, remaining: 4 s.
 [ 15:22:18 |  57% ] transition 17 / 28, remaining: 3 s.
 [ 15:22:19 |  68% ] transition 20 / 28, remaining: 2 s.
 [ 15:22:19 |  79% ] transition 23 / 28, remaining: 2 s.
 [ 15:22:20 |  89% ] transition 26 / 28, remaining: 1 s.
 [ 15:22:21 |  96% ] transition 28 / 28, remaining: 0 s.
 Finished calculation of matrix elements at 15:22:21.
 Elapsed time: 8 s.
 
 CHI summation GPU algorithm offloading all matrix elements to device.
 
 Started building polarizability matrix with 256 processor(s) at 15:22:22.
 [ 15:22:22 |   0% ] processor   1 / 256.
 [ 15:22:23 |   1% ] processor   3 / 256, remaining: 38 s.
 [ 15:22:27 |  10% ] processor  26 / 256, remaining: 40 s.
 [ 15:22:31 |  20% ] processor  52 / 256, remaining: 35 s.
 [ 15:22:35 |  30% ] processor  77 / 256, remaining: 31 s.
 [ 15:22:40 |  40% ] processor 103 / 256, remaining: 26 s.
 [ 15:22:44 |  50% ] processor 129 / 256, remaining: 22 s.
 [ 15:22:48 |  60% ] processor 154 / 256, remaining: 18 s.
 [ 15:22:53 |  70% ] processor 180 / 256, remaining: 13 s.
 [ 15:22:57 |  80% ] processor 205 / 256, remaining: 9 s.
 [ 15:23:01 |  90% ] processor 231 / 256, remaining: 4 s.
 Finished building polarizability matrix at 15:23:06.
 Elapsed time: 44 s.
 
 Done With Block Number:    13
 -----------------------------
 
 
 Valence Block Number:    14 of    18
 ------------------------------------
 
 Using GPU support via OpenACC/OMP-Target implementation
 Using batch implementation, batch size:    20
 
 Started calculation of matrix elements with 28 transition(s) at 15:23:07.
 [ 15:23:07 |   0% ] transition  1 / 28.
 [ 15:23:08 |   7% ] transition  3 / 28, remaining: 7 s.
 [ 15:23:09 |  18% ] transition  6 / 28, remaining: 6 s.
 [ 15:23:09 |  29% ] transition  9 / 28, remaining: 5 s.
 [ 15:23:10 |  39% ] transition 12 / 28, remaining: 4 s.
 [ 15:23:11 |  46% ] transition 14 / 28, remaining: 4 s.
 [ 15:23:11 |  57% ] transition 17 / 28, remaining: 3 s.
 [ 15:23:12 |  68% ] transition 20 / 28, remaining: 2 s.
 [ 15:23:13 |  79% ] transition 23 / 28, remaining: 2 s.
 [ 15:23:14 |  89% ] transition 26 / 28, remaining: 1 s.
 [ 15:23:14 |  96% ] transition 28 / 28, remaining: 0 s.
 Finished calculation of matrix elements at 15:23:15.
 Elapsed time: 8 s.
 
 CHI summation GPU algorithm offloading all matrix elements to device.
 
 Started building polarizability matrix with 256 processor(s) at 15:23:16.
 [ 15:23:17 |   0% ] processor   1 / 256.
 [ 15:23:17 |   1% ] processor   3 / 256, remaining: 39 s.
 [ 15:23:21 |  10% ] processor  26 / 256, remaining: 37 s.
 [ 15:23:25 |  20% ] processor  52 / 256, remaining: 33 s.
 [ 15:23:30 |  30% ] processor  77 / 256, remaining: 30 s.
 [ 15:23:34 |  40% ] processor 103 / 256, remaining: 26 s.
 [ 15:23:39 |  50% ] processor 129 / 256, remaining: 22 s.
 [ 15:23:43 |  60% ] processor 154 / 256, remaining: 18 s.
 [ 15:23:48 |  70% ] processor 180 / 256, remaining: 13 s.
 [ 15:23:52 |  80% ] processor 205 / 256, remaining: 9 s.
 [ 15:23:56 |  90% ] processor 231 / 256, remaining: 4 s.
 Finished building polarizability matrix at 15:24:01.
 Elapsed time: 45 s.
 
 Done With Block Number:    14
 -----------------------------
 
 
 Valence Block Number:    15 of    18
 ------------------------------------
 
 Using GPU support via OpenACC/OMP-Target implementation
 Using batch implementation, batch size:    20
 
 Started calculation of matrix elements with 28 transition(s) at 15:24:02.
 [ 15:24:02 |   0% ] transition  1 / 28.
 [ 15:24:03 |   7% ] transition  3 / 28, remaining: 7 s.
 [ 15:24:04 |  18% ] transition  6 / 28, remaining: 6 s.
 [ 15:24:05 |  29% ] transition  9 / 28, remaining: 5 s.
 [ 15:24:06 |  39% ] transition 12 / 28, remaining: 4 s.
 [ 15:24:06 |  46% ] transition 14 / 28, remaining: 4 s.
 [ 15:24:07 |  57% ] transition 17 / 28, remaining: 3 s.
 [ 15:24:08 |  68% ] transition 20 / 28, remaining: 2 s.
 [ 15:24:08 |  79% ] transition 23 / 28, remaining: 2 s.
 [ 15:24:09 |  89% ] transition 26 / 28, remaining: 1 s.
 [ 15:24:10 |  96% ] transition 28 / 28, remaining: 0 s.
 Finished calculation of matrix elements at 15:24:10.
 Elapsed time: 8 s.
 
 CHI summation GPU algorithm offloading all matrix elements to device.
 
 Started building polarizability matrix with 256 processor(s) at 15:24:11.
 [ 15:24:12 |   0% ] processor   1 / 256.
 [ 15:24:12 |   1% ] processor   3 / 256, remaining: 39 s.
 [ 15:24:16 |  10% ] processor  26 / 256, remaining: 39 s.
 [ 15:24:20 |  20% ] processor  52 / 256, remaining: 34 s.
 [ 15:24:25 |  30% ] processor  77 / 256, remaining: 30 s.
 [ 15:24:29 |  40% ] processor 103 / 256, remaining: 26 s.
 [ 15:24:34 |  50% ] processor 129 / 256, remaining: 22 s.
 [ 15:24:38 |  60% ] processor 154 / 256, remaining: 18 s.
 [ 15:24:43 |  70% ] processor 180 / 256, remaining: 13 s.
 [ 15:24:47 |  80% ] processor 205 / 256, remaining: 9 s.
 [ 15:24:51 |  90% ] processor 231 / 256, remaining: 4 s.
 Finished building polarizability matrix at 15:24:56.
 Elapsed time: 45 s.
 
 Done With Block Number:    15
 -----------------------------
 
 
 Valence Block Number:    16 of    18
 ------------------------------------
 
 Using GPU support via OpenACC/OMP-Target implementation
 Using batch implementation, batch size:    20
 
 Started calculation of matrix elements with 28 transition(s) at 15:24:57.
 [ 15:24:57 |   0% ] transition  1 / 28.
 [ 15:24:58 |   7% ] transition  3 / 28, remaining: 7 s.
 [ 15:24:59 |  18% ] transition  6 / 28, remaining: 6 s.
 [ 15:25:00 |  29% ] transition  9 / 28, remaining: 5 s.
 [ 15:25:00 |  39% ] transition 12 / 28, remaining: 4 s.
 [ 15:25:01 |  46% ] transition 14 / 28, remaining: 4 s.
 [ 15:25:02 |  57% ] transition 17 / 28, remaining: 3 s.
 [ 15:25:03 |  68% ] transition 20 / 28, remaining: 2 s.
 [ 15:25:03 |  79% ] transition 23 / 28, remaining: 2 s.
 [ 15:25:04 |  89% ] transition 26 / 28, remaining: 1 s.
 [ 15:25:05 |  96% ] transition 28 / 28, remaining: 0 s.
 Finished calculation of matrix elements at 15:25:05.
 Elapsed time: 8 s.
 
 CHI summation GPU algorithm offloading all matrix elements to device.
 
 Started building polarizability matrix with 256 processor(s) at 15:25:06.
 [ 15:25:06 |   0% ] processor   1 / 256.
 [ 15:25:07 |   1% ] processor   3 / 256, remaining: 39 s.
 [ 15:25:10 |  10% ] processor  26 / 256, remaining: 39 s.
 [ 15:26:26 |  20% ] processor  52 / 256, remaining: 327 s.
 [ 15:26:30 |  30% ] processor  77 / 256, remaining: 201 s.
 [ 15:26:35 |  40% ] processor 103 / 256, remaining: 135 s.
 [ 15:26:39 |  50% ] processor 129 / 256, remaining: 94 s.
 [ 15:26:44 |  60% ] processor 154 / 256, remaining: 66 s.
 [ 15:26:48 |  70% ] processor 180 / 256, remaining: 44 s.
 [ 15:26:53 |  80% ] processor 205 / 256, remaining: 27 s.
 [ 15:26:57 |  90% ] processor 231 / 256, remaining: 13 s.
 Finished building polarizability matrix at 15:27:02.
 Elapsed time: 116 s.
 
 Done With Block Number:    16
 -----------------------------
 
 
 Valence Block Number:    17 of    18
 ------------------------------------
 
 Using GPU support via OpenACC/OMP-Target implementation
 Using batch implementation, batch size:    20
 
 Started calculation of matrix elements with 28 transition(s) at 15:27:03.
 [ 15:27:03 |   0% ] transition  1 / 28.
 [ 15:27:04 |   7% ] transition  3 / 28, remaining: 7 s.
 [ 15:27:05 |  18% ] transition  6 / 28, remaining: 6 s.
 [ 15:27:05 |  29% ] transition  9 / 28, remaining: 5 s.
 [ 15:27:06 |  39% ] transition 12 / 28, remaining: 4 s.
 [ 15:27:07 |  46% ] transition 14 / 28, remaining: 4 s.
 [ 15:27:08 |  57% ] transition 17 / 28, remaining: 3 s.
 [ 15:27:08 |  68% ] transition 20 / 28, remaining: 2 s.
 [ 15:27:09 |  79% ] transition 23 / 28, remaining: 2 s.
 [ 15:27:10 |  89% ] transition 26 / 28, remaining: 1 s.
 [ 15:27:10 |  96% ] transition 28 / 28, remaining: 0 s.
 Finished calculation of matrix elements at 15:27:11.
 Elapsed time: 8 s.
 
 CHI summation GPU algorithm offloading all matrix elements to device.
 
 Started building polarizability matrix with 256 processor(s) at 15:27:11.
 [ 15:27:12 |   0% ] processor   1 / 256.
 [ 15:27:12 |   1% ] processor   3 / 256, remaining: 38 s.
 [ 15:27:16 |  10% ] processor  26 / 256, remaining: 39 s.
 [ 15:27:20 |  20% ] processor  52 / 256, remaining: 34 s.
 [ 15:27:25 |  30% ] processor  77 / 256, remaining: 30 s.
 [ 15:27:29 |  40% ] processor 103 / 256, remaining: 26 s.
 [ 15:27:34 |  50% ] processor 129 / 256, remaining: 22 s.
 [ 15:27:38 |  60% ] processor 154 / 256, remaining: 18 s.
 [ 15:27:43 |  70% ] processor 180 / 256, remaining: 13 s.
 [ 15:27:47 |  80% ] processor 205 / 256, remaining: 9 s.
 [ 15:27:51 |  90% ] processor 231 / 256, remaining: 4 s.
 Finished building polarizability matrix at 15:27:56.
 Elapsed time: 45 s.
 
 Done With Block Number:    17
 -----------------------------
 
 
 Valence Block Number:    18 of    18
 ------------------------------------
 
 Using GPU support via OpenACC/OMP-Target implementation
 Using batch implementation, batch size:    20
 
 Started calculation of matrix elements with 28 transition(s) at 15:27:57.
 [ 15:27:57 |   0% ] transition  1 / 28.
 [ 15:27:58 |   7% ] transition  3 / 28, remaining: 7 s.
 [ 15:27:59 |  18% ] transition  6 / 28, remaining: 6 s.
 [ 15:28:00 |  29% ] transition  9 / 28, remaining: 5 s.
 [ 15:28:00 |  39% ] transition 12 / 28, remaining: 4 s.
 [ 15:28:01 |  46% ] transition 14 / 28, remaining: 4 s.
 [ 15:28:02 |  57% ] transition 17 / 28, remaining: 3 s.
 [ 15:28:02 |  68% ] transition 20 / 28, remaining: 2 s.
 [ 15:28:03 |  79% ] transition 23 / 28, remaining: 2 s.
 Finished calculation of matrix elements at 15:28:04.
 Elapsed time: 7 s.
 
 CHI summation GPU algorithm offloading all matrix elements to device.
 
 Started building polarizability matrix with 256 processor(s) at 15:28:04.
 [ 15:28:05 |   0% ] processor   1 / 256.
 [ 15:28:05 |   1% ] processor   3 / 256, remaining: 38 s.
 [ 15:28:09 |  10% ] processor  26 / 256, remaining: 39 s.
 [ 15:28:14 |  20% ] processor  52 / 256, remaining: 34 s.
 [ 15:28:18 |  30% ] processor  77 / 256, remaining: 31 s.
 [ 15:28:23 |  40% ] processor 103 / 256, remaining: 26 s.
 [ 15:28:27 |  50% ] processor 129 / 256, remaining: 22 s.
 [ 15:28:31 |  60% ] processor 154 / 256, remaining: 18 s.
 [ 15:28:36 |  70% ] processor 180 / 256, remaining: 13 s.
 [ 15:28:40 |  80% ] processor 205 / 256, remaining: 9 s.
 [ 15:28:45 |  90% ] processor 231 / 256, remaining: 4 s.
 Finished building polarizability matrix at 15:28:49.
 Elapsed time: 45 s.
 
 Done With Block Number:    18
 -----------------------------
 
 q-pt      1: Head of Epsilon         =     1.416652250097135E+01   -7.887594660377001E-18
 q-pt      1: Epsilon(2,2)            =     1.151002087971401E+01    1.684791182146544E-18
 q-pt      1: Head of Epsilon Inverse =     7.899185187719435E-02    5.016643619980975E-20
 q-pt      1: Epsilon Inverse(2,2)    =     9.665226569824216E-02   -1.450543922172989E-20
 
 For q0 points, you should check the symmetry (eps(G,G') = eps*(-G,-G')) by
 using the eps0sym code. Wavefunction convergence, as well as a finite q-shift
 may cause this property of eps(G,G') to be broken.

 Writing dielectric matrix to file
 Ok


********************************************************************************
*                                                                              *
* Your calculation employed methods and algorithms published in peer-reviewed  *
* papers. Please, cite the following references to give proper credit to their *
*          authors and help support future development of BerkeleyGW.          *
*                                                                              *
********************************************************************************

 J. Deslippe, G. Samsonidze, D. A. Strubbe, M. Jain, M. L. Cohen, and S. G.
 Louie, BerkeleyGW: A Massively Parallel Computer Package for the Calculation
 of the Quasiparticle and Optical Properties of Materials and Nanostructures,
 Computer Physics Communications 183, 1269 (2012).

 M. S. Hybertsen and S. G. Louie, Electron Correlation in Semiconductors and
 Insulators: Band Gaps and Quasiparticle Energies, Phys. Rev. B 34, 5390
 (1986).

********************************************************************************

 
 Timing information
 
                                CPU time (s)          WALL time (s)       Number
 Routine                       min        max        min        max     of calls
 -------------------------  ---------  ---------  ---------  ---------  --------
 - Eps (I/O) Comm                0.03       0.07       0.03       0.07         1
 - Eps (I/O) IO                 19.42      19.43      19.42      19.43         1
 - I/O TOTAL                    26.51      27.19      26.51      27.19         8
 - INPUT                         8.40       8.52       8.40       8.52         1
 - INPUT_Q                       2.58       3.23       2.58       3.23         1
 - FULLBZ                        0.00       0.01       0.00       0.01         1
 - GVEC                          0.01       0.14       0.01       0.14         1
 - SUBGRP                        0.00       0.00       0.00       0.00         1
 - IRRBZ                         0.00       0.09       0.00       0.09         1
 - GENWF                         7.59       8.44       7.58       8.44       499
 - MTXEL                       108.76     133.99     108.77     133.99       499
 - RQSTAR                        0.00       0.00       0.00       0.00        18
 - GMAP                          0.06       0.06       0.05       0.06        18
 - EPSINV (TOTAL)               54.30      56.11      54.30      56.11         1
 - CHI SUM (COMM)              263.69     317.61     263.72     317.54     13824
 - CHI SUM (TOTAL)             893.92     922.42     893.92     922.43        18
 - GENWF (VAL)                   2.20       2.33       2.20       2.35       499
 - GENWF (COND)                  5.32       6.11       5.32       6.11        18
 - EPSINV (VCOUL)                0.00       1.82       0.00       1.82         1
 - JOB SETUP                     0.00       0.00       0.00       0.00         1
 - Q LOOP SETUP                  0.01       0.15       0.01       0.15         1
 - INIT CUTOFF                   0.00       0.00       0.00       0.00         1
 - INIT SCALAPACK                0.07       0.21       0.07       0.21         1
 - INIT ARRAYS                   8.92      10.61       8.92      10.61        19
 - MTXEL (DENOM)                 0.06       0.10       0.07       0.12    213572
 - MTXEL (FFT)                 108.76     133.99     108.77     133.99       499
 - GENWF (Ekin)                  0.04       0.05       0.04       0.05        36
 - GENWF (Sort)                  1.32       1.40       1.32       1.40        36
 - CHI SUM (zGEMM)             279.05     309.14     279.04     309.08      4608
 - CHI SUM (PREP)              101.28     102.38     101.27     102.41      4608
 - CHI SUM (ARRAY ALLOC)        70.83      99.69      70.79      99.71      4608
 - EPSINV (I/O)                 19.57      19.58      19.56      19.58         1
 - EPSINV (INVERT)              33.98      34.05      33.99      34.05         1
 - CHI SUM (BAR)                 7.98      43.03       7.98      43.03        18
 - FFT MLTPLY                   16.24      19.44      16.18      19.46    213572
 - TOTAL                      1123.57    1123.69    1123.57    1123.69         1
 
 Job Done
 
