
 BerkeleyGW version 3.0+git v3.0-211-g429f1d3 by mdelben <mdelben@lbl.gov> at 2022-11-28 13:25:36 -0800
 Sigma code, Complex version, run on 22-Dec-2022 at 16:09:04 -0800

                                                                 ..o.          
                                                                .oxxo.         
                                                               .oxxxxo...      
                                                               oxxxxxxo.       
                                                              .oxxxxxxx.       
                                                              .ooooooxxo..     
                                                              .oooooooxo..     
                                                              .oooooxxo...     
                                                       .........oxooo......    
                                                 ............................  
                                             ................................. 
                                          .................................... 
           .          ..oo. ....  .................................oooxxxxxxxo.
     .............oxxxx@ox@@@x@x.....................o...........ooooooooooxx. 
    .o.........oox@x.oo........xxx@@............ooxxxxo..........ooooxxxxxoxo  
    .x........x@xxo...............o@xxo........oxxx@@@xoooooooooooooooxxxo...  
    .o......ox@@o..................oox@o.....ooxxx@xoooxxxxxxxoooooooooooo.... 
    o..ooooo@@xoooo....ooo...........x@o.....ooxxxxo   .oxxxxxxxxxxooooooo.... 
    . .oooo@@@@@@@@@@@@@@@@@@@@@@@@@@@@@@....ooooox.     .oxx@@@@@xxoo........ 
      .ooooxxxxxxxooooooxooooooooooooooxo...oooooxx.        ..ox@xxxoo.........
      .ooooooxxxx@xoooooooooooooxxoooooooooooxxxxx.            .oxxooooooooxxo.
     .oooooxxxxx@@@xxxxxxxxxxxxxxxxxxxxxxxxoxxxxo.                .oxxxxxxxxo. 
   ....oooxxxxx@@@xo..oxxx@@@@@@xxxxoxxoooooooxx.                  .oxxxoo..   
  .....ooxxxx@@xo.       ........    .ooooooooxxo                              
  ..oooxxxx@@@o                       .oooooooxoo.                             
  ....oxooxxxxx.                       .ooo..oooo.                             
  .....o.ooxxxxxo.                     .oooooooxo.                             
 ......ooooxxxxxxo.                     .ooooooxoo..                           
........ooxxxxxxxo..                     .o....oxoo...                         
.......ooooxxxxxxxo.                     ........oooo.                         
.ooooooo..ooxxxxoooo.                    .........ooo...                       
..oxo...ooooxxxoooo..                    .ooo......oooo...                     
  .ooooo....o.                            .oxxxoo....ooo....                   
    .oooooo...                              ...ooooo...ooo..                   
       ...                                     .oo.......                      
                                               ....ooo...                      
                      __              __                                       
 ______              [  |            [  |                 ._____  _          _ 
|_   _               | |  _          | |                /  ___ | |        | |
  | |_) | .---.  _. _.| | / |  .---.  | | .---.  _    _ / /    _|   /  / / 
  |  __'./ /__\[ /`_| '' <  / /__\ | |/ /__\|   | | |   _____  /  / /  
 _| |__| | __. | |   | |`  | ___. | || ___.  / /  .___| |    /  /   
|_______/ .__./[_]  [__|  _] .__./[___].__./    /   .____./    /  /    
                                                  / /                          
                                                 /_/                           
 --------------------------------------------------------------------------------
 Please cite the main BerkeleyGW paper when using results from this calculation:

 Jack Deslippe, Georgy Samsonidze, David A. Strubbe, Manish Jain, Marvin L.
 Cohen, and Steven G. Louie, "BerkeleyGW: A Massively Parallel Computer Package
 for the Calculation of the Quasiparticle and Optical Properties of Materials
 and Nanostructures," Comput. Phys. Commun. 183, 1269 (2012)

 Aditionally, PLEASE CITE ALL PAPERS REPORTED AT THE END OF THIS CALCULATION.
 --------------------------------------------------------------------------------

 Running MPI version (parallel)
 Running with 512 MPI task(s)
 Using OpenMP. Number of threads per MPI task: 16
 Number of threads used for sorting routines: 1

 Compilation flags:
 - Compiler: PGI
 - Para. flags: MPI, OMP
 - Math  flags: USESCALAPACK, UNPACKED, USEFFTW3, HDF5
 - Debug flags: 

 Running with verbosity level 1 (default).

 Using the Generalized Plasmon Pole model

 We are communicating via MPI

 Computing CH as a partial sum over empty bands with the static remainder

 Running with semiconductor screening

 We are using no truncation
 Cutoff for Monte-Carlo average of Coulomb potential:  1.000E+00 Ry

 Computing exchange-correlation matrix elements from VXC file

 Treating W within the Hybertsen-Louie Generalized Plasmon Pole model
 
 Memory available: 59880.3 MB per PE
 
 Read from eps0mat.h5:
 - Number of G-vectors in the charge-density grid: 1167999
 - Max. number of G-vectors for dielectric matrices: 51627
 - Cutoff of the dielectric matrix (Ry): 8.000
 - Number of imaginary frequencies: 0
 - Total number of frequencies: 1
 - Frequency dependence: 0
 - Number of q-points: 1
 - Q grid: 1 1 1
 
 Reading header of WFN_inner.h5
 Highest occupied band (unshifted grid) = 1996
 Valence max    (unshifted grid) = 6.233852 eV
 Conduction min (unshifted grid) = 6.597934 eV
 Middle energy  (unshifted grid) = 6.415893 eV
 Fermi  energy  (unshifted grid) = 6.415893 eV

 
 Calculation parameters:
 - Cutoff of the bare Coulomb interaction (Ry): 16.00
 - Cutoff of the screened Coulomb interaction (Ry): 8.00
 - Number of G-vectors up to the bare int. cutoff: 145837
 - Number of G-vectors up to the screened int. cutoff: 51627
 - Total number of bands in the calculation: 29346
 - Number of fully occupied valence bands: 1996
 - Number of partially occ. conduction bands: 0
 
 Memory required for execution: 23326.8 MB per PE
 Memory required for vcoul: 114.4 MB per PE
 
 Number of electrons per unit cell (from ifmax) = 3992.000000
 Number of electrons per unit cell (from occupations) = 3992.000000
 Plasma Frequency = 1.218925 Ry

 Q-grid symmetries are not being used.
 
 Parallelization report:
 - Using 512 processor(s), 32 pool(s), 16 processor(s) per pool.
 - Each pool is computing 8 diagonal sigma matrix element(s).
 - Each pool is computing 0 off-diagonal sigma matrix element(s).
 - Each pool is holding 1821 to 1835 band(s).
 - Note: distribution is not ideal because the total number of bands
   (29346) is not divisible by the number of processors per pool (16).
 
 
 Started reading wavefunctions (WFN_inner) with 29346 state(s) at 16:09:09.
 Reading band block from WFN_inner.h5
 Reading using H5FD_MPIO_INDEPENDENT.
 Using communication style:  1
 
 [ 16:09:14 |   0% ] state     1 / 29346.
 [ 16:09:14 |   0% ] state     3 / 29346, remaining: 0 s.
 [ 16:09:15 |  10% ] state  2935 / 29346, remaining: 11 s.
 [ 16:09:15 |  20% ] state  5870 / 29346, remaining: 5 s.
 [ 16:09:15 |  30% ] state  8804 / 29346, remaining: 3 s.
 [ 16:09:15 |  40% ] state 11739 / 29346, remaining: 2 s.
 [ 16:09:15 |  50% ] state 14673 / 29346, remaining: 1 s.
 [ 16:09:15 |  60% ] state 17608 / 29346, remaining: 1 s.
 [ 16:09:15 |  70% ] state 20543 / 29346, remaining: 1 s.
 [ 16:09:15 |  80% ] state 23477 / 29346, remaining: 0 s.
 [ 16:09:15 |  90% ] state 26412 / 29346, remaining: 0 s.
 [ 16:09:15 | 100% ] state 29346 / 29346, remaining: 0 s.
 Finished reading wavefunctions (WFN_inner) at 16:09:15.
 Elapsed time: 7 s.
 

 Scissors parameters:
 - Valence:    es =   0.0000 eV, e0 =   0.0000 eV, edel =   0.0000
 - Conduction: es =   0.0000 eV, e0 =   0.0000 eV, edel =   0.0000

 Scissors parameters (outer):
 - Valence:    es =   0.0000 eV, e0 =   0.0000 eV, edel =   0.0000
 - Conduction: es =   0.0000 eV, e0 =   0.0000 eV, edel =   0.0000


 Data for sum rule:
 - rho(0,1) = 3992.000000 electrons
 - wp = 16.584325 eV

 Number of bands to compute diagonal self-energy matrix elements: 256
 Bands:
 - 1868
 - 1869
 - 1870
 - 1871
 - 1872
 - 1873
 - 1874
 - 1875
 - 1876
 - 1877
 - 1878
 - 1879
 - 1880
 - 1881
 - 1882
 - 1883
 - 1884
 - 1885
 - 1886
 - 1887
 - 1888
 - 1889
 - 1890
 - 1891
 - 1892
 - 1893
 - 1894
 - 1895
 - 1896
 - 1897
 - 1898
 - 1899
 - 1900
 - 1901
 - 1902
 - 1903
 - 1904
 - 1905
 - 1906
 - 1907
 - 1908
 - 1909
 - 1910
 - 1911
 - 1912
 - 1913
 - 1914
 - 1915
 - 1916
 - 1917
 - 1918
 - 1919
 - 1920
 - 1921
 - 1922
 - 1923
 - 1924
 - 1925
 - 1926
 - 1927
 - 1928
 - 1929
 - 1930
 - 1931
 - 1932
 - 1933
 - 1934
 - 1935
 - 1936
 - 1937
 - 1938
 - 1939
 - 1940
 - 1941
 - 1942
 - 1943
 - 1944
 - 1945
 - 1946
 - 1947
 - 1948
 - 1949
 - 1950
 - 1951
 - 1952
 - 1953
 - 1954
 - 1955
 - 1956
 - 1957
 - 1958
 - 1959
 - 1960
 - 1961
 - 1962
 - 1963
 - 1964
 - 1965
 - 1966
 - 1967
 - 1968
 - 1969
 - 1970
 - 1971
 - 1972
 - 1973
 - 1974
 - 1975
 - 1976
 - 1977
 - 1978
 - 1979
 - 1980
 - 1981
 - 1982
 - 1983
 - 1984
 - 1985
 - 1986
 - 1987
 - 1988
 - 1989
 - 1990
 - 1991
 - 1992
 - 1993
 - 1994
 - 1995
 - 1996
 - 1997
 - 1998
 - 1999
 - 2000
 - 2001
 - 2002
 - 2003
 - 2004
 - 2005
 - 2006
 - 2007
 - 2008
 - 2009
 - 2010
 - 2011
 - 2012
 - 2013
 - 2014
 - 2015
 - 2016
 - 2017
 - 2018
 - 2019
 - 2020
 - 2021
 - 2022
 - 2023
 - 2024
 - 2025
 - 2026
 - 2027
 - 2028
 - 2029
 - 2030
 - 2031
 - 2032
 - 2033
 - 2034
 - 2035
 - 2036
 - 2037
 - 2038
 - 2039
 - 2040
 - 2041
 - 2042
 - 2043
 - 2044
 - 2045
 - 2046
 - 2047
 - 2048
 - 2049
 - 2050
 - 2051
 - 2052
 - 2053
 - 2054
 - 2055
 - 2056
 - 2057
 - 2058
 - 2059
 - 2060
 - 2061
 - 2062
 - 2063
 - 2064
 - 2065
 - 2066
 - 2067
 - 2068
 - 2069
 - 2070
 - 2071
 - 2072
 - 2073
 - 2074
 - 2075
 - 2076
 - 2077
 - 2078
 - 2079
 - 2080
 - 2081
 - 2082
 - 2083
 - 2084
 - 2085
 - 2086
 - 2087
 - 2088
 - 2089
 - 2090
 - 2091
 - 2092
 - 2093
 - 2094
 - 2095
 - 2096
 - 2097
 - 2098
 - 2099
 - 2100
 - 2101
 - 2102
 - 2103
 - 2104
 - 2105
 - 2106
 - 2107
 - 2108
 - 2109
 - 2110
 - 2111
 - 2112
 - 2113
 - 2114
 - 2115
 - 2116
 - 2117
 - 2118
 - 2119
 - 2120
 - 2121
 - 2122
 - 2123
 Number of off-diagonal bands to compute self-energy matrix elements: 0
 
 GPU acceleration is : ENABLED
 
 Algorithms used:
 - mtxel     : OPENACC_ALGO
 - sigma_gpp : OPENACC_ALGO

 Total number of frequencies in the dielectric matrix: 1
 Number of imag. frequencies in the dielectric matrix: 0

 
 Started reading eps0mat.h5 with 1 q-point(s) at 16:09:17.
 [ 16:09:17 |   0% ] q-point 1 / 1.
 Finished reading eps0mat.h5 at 16:09:19.
 Elapsed time: 2 s.
 
 Number of k-points in WFN_inner: 1
 Number of k-points in the full BZ of WFN_inner: 1
 
================================================================================
 16:09:19   Dealing with k =  0.000000  0.000000  0.000000                 1 / 1
================================================================================

 Number of q-points in the irreducible BZ(k) (nrq): 1

 Using GPU support via OpenACC/OMP-Target implementation
 Band block size in MTXEL:    20
 
 Started calculating Sigma with 8 block(s) at 16:09:22.
 [ 16:09:24 |   0% ] block 1 / 8.
 [ 16:12:34 |  13% ] block 2 / 8.
 [ 16:15:43 |  25% ] block 3 / 8, remaining: 1133 s.
 [ 16:18:50 |  38% ] block 4 / 8, remaining: 941 s.
 [ 16:22:05 |  50% ] block 5 / 8, remaining: 761 s.
 [ 16:25:13 |  63% ] block 6 / 8, remaining: 569 s.
 [ 16:28:28 |  75% ] block 7 / 8, remaining: 381 s.
 [ 16:31:36 |  88% ] block 8 / 8, remaining: 190 s.
 Finished calculating Sigma at 16:34:43.
 Elapsed time: 1522 s.
 
 Unsymmetrized values for ik =   1 spin = 1
 
     n      Emf       Eo      Vxc        X     SX-X       CH      Cor      Sig
  1868    5.073    5.073  -10.738  -12.353    8.978   -8.436    0.542  -11.811
  1869    5.074    5.074  -10.736  -12.350    8.977   -8.436    0.541  -11.808
  1870    5.076    5.076  -10.744  -12.360    8.984   -8.440    0.544  -11.815
  1871    5.077    5.077  -10.838  -12.526    9.097   -8.502    0.594  -11.932
  1872    5.078    5.078  -10.867  -12.578    9.133   -8.521    0.612  -11.966
  1873    5.081    5.081  -10.841  -12.528    9.095   -8.501    0.595  -11.934
  1874    5.084    5.084  -10.868  -12.576    9.128   -8.516    0.612  -11.964
  1875    5.087    5.087  -10.887  -12.614    9.153   -8.527    0.627  -11.988
  1876    5.099    5.099  -11.038  -12.894    9.338   -8.614    0.724  -12.170
  1877    5.101    5.101  -11.037  -12.891    9.336   -8.613    0.723  -12.168
  1878    5.102    5.102  -11.036  -12.886    9.332   -8.617    0.715  -12.171
  1879    5.102    5.102  -11.039  -12.891    9.335   -8.618    0.717  -12.174
  1880    5.103    5.103  -11.037  -12.890    9.334   -8.611    0.723  -12.168
  1881    5.106    5.106  -11.034  -12.881    9.327   -8.615    0.712  -12.169
  1882    5.109    5.109  -11.034  -12.881    9.326   -8.616    0.710  -12.171
  1883    5.112    5.112  -11.028  -12.869    9.319   -8.614    0.705  -12.164
  1884    5.115    5.115  -11.020  -12.844    9.319   -8.623    0.697  -12.147
  1885    5.117    5.117  -11.015  -12.845    9.319   -8.614    0.705  -12.140
  1886    5.126    5.126  -11.007  -12.829    9.309   -8.609    0.700  -12.129
  1887    5.166    5.166  -10.974  -12.712    9.231   -8.602    0.629  -12.082
  1888    5.180    5.180  -10.984  -12.725    9.234   -8.605    0.629  -12.096
  1889    5.204    5.204  -10.970  -12.683    9.214   -8.607    0.607  -12.076
  1890    5.217    5.217  -10.988  -12.702    9.215   -8.603    0.612  -12.090
  1891    5.221    5.221  -10.989  -12.688    9.200   -8.606    0.594  -12.094
  1892    5.246    5.246  -11.013  -12.687    9.189   -8.617    0.572  -12.115
  1893    5.249    5.249  -11.010  -12.685    9.190   -8.617    0.573  -12.112
  1894    5.250    5.250  -11.010  -12.686    9.190   -8.615    0.575  -12.112
  1895    5.251    5.251  -11.006  -12.677    9.183   -8.614    0.569  -12.109
  1896    5.255    5.255  -11.009  -12.684    9.188   -8.614    0.575  -12.109
  1897    5.256    5.256  -11.015  -12.684    9.189   -8.623    0.566  -12.118
  1898    5.257    5.257  -11.009  -12.689    9.189   -8.612    0.577  -12.112
  1899    5.257    5.257  -11.008  -12.686    9.189   -8.611    0.578  -12.108
  1900    5.259    5.259  -11.009  -12.687    9.188   -8.613    0.575  -12.112
  1901    5.261    5.261  -11.011  -12.688    9.192   -8.615    0.577  -12.111
  1902    5.261    5.261  -11.008  -12.684    9.189   -8.613    0.576  -12.108
  1903    5.263    5.263  -11.035  -12.703    9.203   -8.631    0.572  -12.131
  1904    5.264    5.264  -11.015  -12.695    9.193   -8.615    0.578  -12.117
  1905    5.264    5.264  -11.015  -12.697    9.194   -8.615    0.579  -12.118
  1906    5.265    5.265  -11.015  -12.697    9.194   -8.616    0.578  -12.119
  1907    5.266    5.266  -11.016  -12.694    9.199   -8.619    0.580  -12.114
  1908    5.269    5.269  -11.016  -12.697    9.194   -8.618    0.575  -12.122
  1909    5.273    5.273  -11.016  -12.698    9.198   -8.618    0.580  -12.118
  1910    5.278    5.278  -11.021  -12.700    9.200   -8.624    0.576  -12.124
  1911    5.279    5.279  -11.056  -12.744    9.225   -8.645    0.581  -12.164
  1912    5.283    5.283  -11.059  -12.756    9.237   -8.652    0.585  -12.171
  1913    5.284    5.284  -11.056  -12.741    9.225   -8.646    0.578  -12.162
  1914    5.286    5.286  -11.046  -12.742    9.226   -8.641    0.585  -12.157
  1915    5.287    5.287  -11.086  -12.771    9.248   -8.665    0.582  -12.189
  1916    5.305    5.305  -11.226  -12.821    9.297   -8.781    0.517  -12.305
  1917    5.305    5.305  -11.230  -12.821    9.297   -8.784    0.513  -12.307
  1918    5.313    5.313  -11.181  -12.812    9.287   -8.745    0.541  -12.271
  1919    5.315    5.315  -11.199  -12.808    9.286   -8.762    0.524  -12.284
  1920    5.316    5.316  -11.193  -12.809    9.285   -8.756    0.529  -12.281
  1921    5.318    5.318  -11.092  -12.840    9.285   -8.661    0.624  -12.216
  1922    5.318    5.318  -11.093  -12.840    9.283   -8.660    0.623  -12.217
  1923    5.319    5.319  -11.101  -12.831    9.284   -8.673    0.610  -12.221
  1924    5.319    5.319  -11.091  -12.837    9.282   -8.663    0.619  -12.218
  1925    5.319    5.319  -11.099  -12.835    9.283   -8.669    0.615  -12.220
  1926    5.321    5.321  -11.094  -12.833    9.282   -8.666    0.616  -12.216
  1927    5.321    5.321  -11.091  -12.838    9.285   -8.663    0.622  -12.216
  1928    5.322    5.322  -11.092  -12.835    9.285   -8.665    0.620  -12.215
  1929    5.322    5.322  -11.094  -12.826    9.282   -8.670    0.612  -12.214
  1930    5.323    5.323  -11.089  -12.833    9.285   -8.664    0.622  -12.211
  1931    5.324    5.324  -11.088  -12.829    9.283   -8.666    0.617  -12.211
  1932    5.325    5.325  -11.090  -12.829    9.284   -8.666    0.618  -12.211
  1933    5.328    5.328  -11.086  -12.819    9.279   -8.668    0.611  -12.209
  1934    5.329    5.329  -11.089  -12.829    9.286   -8.665    0.621  -12.208
  1935    5.332    5.332  -11.088  -12.814    9.281   -8.673    0.608  -12.206
  1936    5.335    5.335  -11.081  -12.814    9.273   -8.660    0.613  -12.201
  1937    5.336    5.336  -11.080  -12.811    9.277   -8.666    0.611  -12.201
  1938    5.338    5.338  -11.080  -12.804    9.272   -8.668    0.604  -12.200
  1939    5.343    5.343  -11.076  -12.795    9.260   -8.660    0.600  -12.195
  1940    5.361    5.361  -11.096  -12.666    9.187   -8.708    0.479  -12.187
  1941    5.365    5.365  -11.089  -12.789    9.249   -8.667    0.582  -12.207
  1942    5.366    5.366  -11.088  -12.791    9.249   -8.665    0.584  -12.207
  1943    5.370    5.370  -11.083  -12.778    9.244   -8.667    0.577  -12.201
  1944    5.373    5.373  -11.087  -12.791    9.250   -8.662    0.588  -12.203
  1945    5.376    5.376  -11.082  -12.670    9.189   -8.696    0.493  -12.177
  1946    5.389    5.389  -11.090  -12.790    9.253   -8.669    0.584  -12.206
  1947    5.390    5.390  -11.090  -12.789    9.255   -8.672    0.583  -12.206
  1948    5.391    5.391  -11.092  -12.795    9.259   -8.672    0.587  -12.208
  1949    5.398    5.398  -11.088  -12.789    9.263   -8.674    0.588  -12.200
  1950    5.402    5.402  -11.075  -12.769    9.255   -8.670    0.584  -12.185
  1951    5.413    5.413  -11.070  -12.748    9.247   -8.680    0.567  -12.181
  1952    5.423    5.423  -11.053  -12.713    9.229   -8.672    0.557  -12.156
  1953    5.553    5.553  -11.010  -12.533    9.104   -8.664    0.440  -12.093
  1954    5.575    5.575  -11.018  -12.541    9.095   -8.659    0.436  -12.104
  1955    5.616    5.616  -11.032  -12.544    9.089   -8.657    0.432  -12.112
  1956    5.621    5.621  -11.027  -12.520    9.074   -8.666    0.408  -12.112
  1957    5.624    5.624  -11.040  -12.516    9.057   -8.665    0.392  -12.124
  1958    5.647    5.647  -11.050  -12.520    9.053   -8.666    0.387  -12.133
  1959    5.648    5.648  -11.049  -12.532    9.060   -8.659    0.401  -12.131
  1960    5.649    5.649  -11.057  -12.546    9.071   -8.663    0.408  -12.138
  1961    5.649    5.649  -11.069  -12.564    9.084   -8.672    0.411  -12.153
  1962    5.651    5.651  -11.060  -12.550    9.073   -8.666    0.406  -12.143
  1963    5.652    5.652  -11.057  -12.542    9.069   -8.664    0.405  -12.137
  1964    5.652    5.652  -11.041  -12.513    9.049   -8.654    0.395  -12.118
  1965    5.653    5.653  -11.071  -12.565    9.087   -8.674    0.413  -12.152
  1966    5.654    5.654  -11.082  -12.590    9.104   -8.681    0.423  -12.168
  1967    5.655    5.655  -11.039  -12.514    9.046   -8.654    0.392  -12.121
  1968    5.656    5.656  -11.051  -12.535    9.062   -8.662    0.400  -12.134
  1969    5.656    5.656  -11.052  -12.536    9.063   -8.662    0.401  -12.135
  1970    5.658    5.658  -11.037  -12.510    9.046   -8.653    0.393  -12.117
  1971    5.658    5.658  -11.037  -12.507    9.045   -8.653    0.392  -12.115
  1972    5.658    5.658  -11.061  -12.545    9.072   -8.670    0.401  -12.143
  1973    5.658    5.658  -11.041  -12.516    9.050   -8.656    0.393  -12.122
  1974    5.659    5.659  -11.067  -12.559    9.080   -8.676    0.404  -12.155
  1975    5.663    5.663  -11.046  -12.510    9.056   -8.666    0.390  -12.119
  1976    5.664    5.664  -11.088  -12.600    9.112   -8.689    0.423  -12.176
  1977    5.665    5.665  -11.052  -12.531    9.068   -8.667    0.402  -12.129
  1978    5.665    5.665  -11.067  -12.559    9.085   -8.676    0.409  -12.150
  1979    5.674    5.674  -11.042  -12.517    9.062   -8.662    0.399  -12.117
  1980    5.697    5.697  -11.051  -12.517    9.070   -8.685    0.385  -12.131
  1981    5.936    5.936  -11.100  -12.362    8.961   -8.760    0.201  -12.161
  1982    5.969    5.969  -11.169  -12.508    9.032   -8.773    0.259  -12.249
  1983    5.994    5.994  -10.972  -12.167    8.882   -8.739    0.143  -12.024
  1984    6.029    6.029  -11.244  -12.651    9.122   -8.803    0.319  -12.332
  1985    6.039    6.039  -11.243  -12.610    9.092   -8.814    0.278  -12.333
  1986    6.060    6.060  -11.286  -12.699    9.143   -8.825    0.318  -12.381
  1987    6.060    6.060  -11.286  -12.696    9.141   -8.824    0.317  -12.379
  1988    6.061    6.061  -11.286  -12.696    9.141   -8.825    0.317  -12.379
  1989    6.062    6.062  -11.284  -12.690    9.137   -8.830    0.306  -12.384
  1990    6.063    6.063  -11.283  -12.693    9.146   -8.827    0.320  -12.373
  1991    6.065    6.065  -11.268  -12.663    9.128   -8.820    0.308  -12.355
  1992    6.083    6.083  -11.270  -12.661    9.130   -8.830    0.300  -12.361
  1993    6.212    6.212  -11.253  -12.530    9.030   -8.834    0.196  -12.334
  1994    6.219    6.219  -11.273  -12.578    9.051   -8.833    0.218  -12.361
  1995    6.222    6.222  -10.541  -11.150    8.342   -8.686   -0.344  -11.495
  1996    6.234    6.234  -11.287  -12.610    9.078   -8.830    0.247  -12.362
  1997    6.598    6.598  -10.535   -8.850    6.387   -8.784   -2.397  -11.247
  1998    6.648    6.648   -9.860   -6.921    4.908   -8.393   -3.485  -10.406
  1999    6.827    6.827   -9.106   -5.593    3.806   -7.662   -3.856   -9.449
  2000    6.831    6.831   -9.107   -5.592    3.803   -7.661   -3.858   -9.450
  2001    6.833    6.833   -9.101   -5.579    3.792   -7.655   -3.863   -9.441
  2002    6.834    6.834   -9.123   -5.618    3.824   -7.674   -3.850   -9.468
  2003    6.836    6.836   -9.101   -5.581    3.795   -7.655   -3.861   -9.442
  2004    6.843    6.843   -9.124   -5.612    3.821   -7.679   -3.858   -9.470
  2005    6.956    6.956   -9.183   -5.688    3.895   -7.760   -3.865   -9.553
  2006    6.960    6.960   -8.985   -5.373    3.642   -7.587   -3.945   -9.318
  2007    6.965    6.965   -8.979   -5.363    3.633   -7.581   -3.948   -9.312
  2008    6.968    6.968   -8.980   -5.363    3.630   -7.578   -3.948   -9.311
  2009    6.970    6.970   -8.982   -5.367    3.634   -7.580   -3.946   -9.313
  2010    6.974    6.974   -8.991   -5.377    3.643   -7.589   -3.946   -9.323
  2011    7.022    7.022   -9.867   -6.712    4.727   -8.370   -3.643  -10.355
  2012    7.106    7.106   -9.265   -5.711    3.910   -7.797   -3.887   -9.597
  2013    7.109    7.109   -9.265   -5.708    3.907   -7.796   -3.889   -9.597
  2014    7.111    7.111   -9.264   -5.708    3.907   -7.795   -3.888   -9.596
  2015    7.112    7.112   -9.264   -5.707    3.906   -7.795   -3.889   -9.596
  2016    7.117    7.117   -9.267   -5.709    3.908   -7.799   -3.891   -9.600
  2017    7.121    7.121   -9.319   -5.786    3.971   -7.847   -3.876   -9.662
  2018    7.280    7.280   -9.047   -5.337    3.627   -7.657   -4.030   -9.367
  2019    7.284    7.284   -9.050   -5.336    3.625   -7.656   -4.031   -9.368
  2020    7.286    7.286   -9.048   -5.334    3.623   -7.655   -4.032   -9.366
  2021    7.287    7.287   -9.046   -5.332    3.622   -7.653   -4.032   -9.364
  2022    7.291    7.291   -9.046   -5.330    3.618   -7.649   -4.031   -9.361
  2023    7.291    7.291   -9.045   -5.329    3.619   -7.652   -4.033   -9.362
  2024    7.291    7.291   -9.046   -5.330    3.619   -7.650   -4.032   -9.362
  2025    7.294    7.294   -9.046   -5.330    3.619   -7.651   -4.032   -9.362
  2026    7.294    7.294   -9.044   -5.328    3.617   -7.648   -4.031   -9.359
  2027    7.296    7.296   -9.047   -5.332    3.620   -7.652   -4.032   -9.364
  2028    7.298    7.298   -9.056   -5.343    3.632   -7.662   -4.031   -9.374
  2029    7.302    7.302   -9.051   -5.334    3.622   -7.655   -4.033   -9.366
  2030    7.469    7.469   -9.132   -5.378    3.663   -7.730   -4.068   -9.446
  2031    7.472    7.472   -9.137   -5.381    3.663   -7.732   -4.070   -9.450
  2032    7.475    7.475   -9.137   -5.379    3.661   -7.731   -4.071   -9.449
  2033    7.479    7.479   -9.131   -5.372    3.654   -7.723   -4.069   -9.441
  2034    7.481    7.481   -9.132   -5.373    3.654   -7.724   -4.070   -9.443
  2035    7.481    7.481   -9.131   -5.370    3.653   -7.726   -4.072   -9.442
  2036    7.482    7.482   -9.130   -5.369    3.651   -7.721   -4.070   -9.439
  2037    7.484    7.484   -9.130   -5.368    3.652   -7.723   -4.071   -9.440
  2038    7.485    7.485   -9.130   -5.368    3.652   -7.724   -4.072   -9.440
  2039    7.486    7.486   -9.130   -5.368    3.651   -7.722   -4.071   -9.439
  2040    7.486    7.486   -9.130   -5.368    3.651   -7.723   -4.072   -9.439
  2041    7.486    7.486   -9.130   -5.367    3.650   -7.722   -4.071   -9.438
  2042    7.487    7.487   -9.130   -5.367    3.651   -7.723   -4.072   -9.439
  2043    7.488    7.488   -9.130   -5.368    3.651   -7.723   -4.072   -9.440
  2044    7.488    7.488   -9.131   -5.368    3.650   -7.722   -4.071   -9.440
  2045    7.488    7.488   -9.129   -5.365    3.648   -7.720   -4.072   -9.437
  2046    7.489    7.489   -9.128   -5.365    3.647   -7.719   -4.072   -9.437
  2047    7.489    7.489   -9.130   -5.366    3.650   -7.722   -4.072   -9.438
  2048    7.491    7.491   -9.129   -5.365    3.650   -7.722   -4.072   -9.438
  2049    7.492    7.492   -9.130   -5.367    3.650   -7.721   -4.071   -9.438
  2050    7.493    7.493   -9.131   -5.368    3.651   -7.725   -4.073   -9.442
  2051    7.499    7.499   -9.133   -5.372    3.654   -7.726   -4.073   -9.444
  2052    7.502    7.502   -9.139   -5.378    3.661   -7.734   -4.073   -9.451
  2053    7.508    7.508   -9.137   -5.371    3.653   -7.728   -4.075   -9.446
  2054    7.573    7.573   -8.920   -5.077    3.435   -7.583   -4.148   -9.225
  2055    7.575    7.575   -8.927   -5.086    3.443   -7.591   -4.148   -9.234
  2056    7.575    7.575   -8.917   -5.074    3.433   -7.582   -4.149   -9.223
  2057    7.578    7.578   -8.920   -5.076    3.434   -7.584   -4.149   -9.225
  2058    7.580    7.580   -8.926   -5.083    3.440   -7.588   -4.148   -9.231
  2059    7.580    7.580   -8.921   -5.078    3.436   -7.585   -4.149   -9.227
  2060    7.696    7.696   -9.461   -5.740    3.948   -7.985   -4.037   -9.777
  2061    7.703    7.703   -9.489   -5.765    3.980   -8.005   -4.026   -9.790
  2062    7.704    7.704   -9.489   -5.767    3.981   -8.005   -4.024   -9.791
  2063    7.705    7.705   -9.485   -5.761    3.973   -8.001   -4.028   -9.788
  2064    7.708    7.708   -9.485   -5.760    3.974   -8.001   -4.028   -9.788
  2065    7.708    7.708   -9.488   -5.764    3.979   -8.005   -4.025   -9.790
  2066    7.718    7.718   -9.437   -5.695    3.885   -7.954   -4.069   -9.764
  2067    7.723    7.723   -9.413   -5.661    3.847   -7.929   -4.082   -9.743
  2068    7.730    7.730   -9.414   -5.656    3.834   -7.922   -4.088   -9.743
  2069    7.730    7.730   -9.414   -5.656    3.835   -7.923   -4.088   -9.744
  2070    7.731    7.731   -9.414   -5.656    3.834   -7.921   -4.087   -9.742
  2071    7.731    7.731   -9.414   -5.655    3.833   -7.919   -4.086   -9.741
  2072    7.732    7.732   -9.413   -5.655    3.833   -7.919   -4.086   -9.741
  2073    7.732    7.732   -9.414   -5.656    3.834   -7.918   -4.084   -9.740
  2074    7.732    7.732   -9.413   -5.655    3.833   -7.919   -4.086   -9.741
  2075    7.732    7.732   -9.414   -5.657    3.836   -7.920   -4.084   -9.741
  2076    7.734    7.734   -9.414   -5.655    3.835   -7.921   -4.086   -9.742
  2077    7.734    7.734   -9.414   -5.656    3.837   -7.924   -4.088   -9.744
  2078    7.735    7.735   -9.414   -5.656    3.834   -7.923   -4.089   -9.745
  2079    7.736    7.736   -9.413   -5.653    3.833   -7.922   -4.089   -9.743
  2080    7.736    7.736   -9.414   -5.657    3.839   -7.924   -4.085   -9.742
  2081    7.743    7.743   -9.412   -5.651    3.833   -7.925   -4.092   -9.743
  2082    7.744    7.744   -9.413   -5.650    3.833   -7.924   -4.091   -9.741
  2083    7.744    7.744   -9.418   -5.652    3.837   -7.932   -4.095   -9.747
  2084    7.746    7.746   -9.414   -5.651    3.834   -7.932   -4.097   -9.748
  2085    7.757    7.757   -9.404   -5.637    3.823   -7.923   -4.100   -9.737
  2086    7.759    7.759   -9.404   -5.633    3.820   -7.919   -4.099   -9.732
  2087    7.762    7.762   -9.404   -5.633    3.820   -7.920   -4.100   -9.733
  2088    7.767    7.767   -9.401   -5.627    3.816   -7.918   -4.102   -9.729
  2089    7.768    7.768   -9.398   -5.623    3.813   -7.919   -4.105   -9.729
  2090    7.800    7.800   -9.310   -5.491    3.721   -7.863   -4.142   -9.633
  2091    7.800    7.800   -9.278   -5.453    3.688   -7.836   -4.149   -9.601
  2092    7.807    7.807   -9.295   -5.468    3.704   -7.854   -4.151   -9.619
  2093    7.812    7.812   -9.280   -5.446    3.686   -7.843   -4.157   -9.604
  2094    7.813    7.813   -9.272   -5.440    3.677   -7.830   -4.152   -9.593
  2095    7.814    7.814   -9.270   -5.437    3.672   -7.824   -4.152   -9.589
  2096    7.814    7.814   -9.271   -5.439    3.676   -7.829   -4.153   -9.592
  2097    7.814    7.814   -9.271   -5.437    3.673   -7.825   -4.152   -9.589
  2098    7.815    7.815   -9.271   -5.437    3.675   -7.829   -4.154   -9.591
  2099    7.815    7.815   -9.271   -5.437    3.672   -7.825   -4.153   -9.589
  2100    7.817    7.817   -9.274   -5.442    3.679   -7.831   -4.151   -9.594
  2101    7.819    7.819   -9.279   -5.447    3.683   -7.836   -4.152   -9.599
  2102    7.822    7.822   -9.276   -5.439    3.675   -7.831   -4.156   -9.595
  2103    7.823    7.823   -9.282   -5.447    3.684   -7.842   -4.158   -9.605
  2104    7.825    7.825   -9.280   -5.445    3.682   -7.839   -4.157   -9.602
  2105    7.828    7.828   -9.274   -5.437    3.674   -7.831   -4.157   -9.594
  2106    7.828    7.828   -9.273   -5.437    3.675   -7.832   -4.157   -9.593
  2107    7.831    7.831   -9.272   -5.434    3.671   -7.828   -4.157   -9.591
  2108    7.835    7.835   -9.319   -5.482    3.722   -7.888   -4.166   -9.648
  2109    7.838    7.838   -9.363   -5.525    3.757   -7.917   -4.160   -9.686
  2110    7.846    7.846   -9.357   -5.516    3.748   -7.908   -4.159   -9.676
  2111    7.850    7.850   -9.317   -5.479    3.718   -7.885   -4.167   -9.646
  2112    7.851    7.851   -9.390   -5.546    3.777   -7.940   -4.164   -9.710
  2113    7.858    7.858   -9.371   -5.534    3.765   -7.927   -4.162   -9.696
  2114    7.873    7.873   -9.949   -6.067    4.258   -8.428   -4.171  -10.238
  2115    7.874    7.874   -9.953   -6.067    4.259   -8.422   -4.163  -10.230
  2116    7.879    7.879  -10.064   -6.166    4.349   -8.523   -4.174  -10.340
  2117    7.880    7.880  -10.078   -6.178    4.360   -8.523   -4.163  -10.341
  2118    7.881    7.881  -10.043   -6.145    4.330   -8.494   -4.164  -10.309
  2119    7.883    7.883  -10.013   -6.117    4.304   -8.468   -4.163  -10.280
  2120    7.886    7.886   -9.978   -6.086    4.277   -8.442   -4.165  -10.251
  2121    7.899    7.899   -9.997   -6.102    4.292   -8.457   -4.165  -10.267
  2122    7.984    7.984   -9.500   -5.686    3.889   -8.030   -4.141   -9.827
  2123    8.007    8.007   -9.463   -5.605    3.836   -7.997   -4.161   -9.766

 Symmetrized values from band-averaging:

       k =  0.000000  0.000000  0.000000 ik =   1 spin = 1

     n      Emf       Eo      Vxc        X      Cor     Eqp0     Eqp1      Znk
  1868    5.073    5.073  -10.738  -12.353    0.542    3.999    4.230    0.785
  1869    5.074    5.074  -10.736  -12.350    0.541    4.002    4.232    0.785
  1870    5.076    5.076  -10.744  -12.360    0.544    4.005    4.235    0.785
  1871    5.077    5.077  -10.838  -12.526    0.594    3.983    4.218    0.785
  1872    5.078    5.078  -10.867  -12.578    0.612    3.979    4.216    0.785
  1873    5.081    5.081  -10.841  -12.528    0.595    3.989    4.224    0.785
  1874    5.084    5.084  -10.868  -12.576    0.612    3.988    4.224    0.785
  1875    5.087    5.087  -10.887  -12.614    0.627    3.987    4.224    0.785
  1876    5.099    5.099  -11.038  -12.894    0.724    3.968    4.212    0.784
  1877    5.101    5.101  -11.037  -12.891    0.723    3.970    4.214    0.784
  1878    5.102    5.102  -11.036  -12.886    0.715    3.967    4.212    0.784
  1879    5.102    5.102  -11.039  -12.891    0.717    3.967    4.212    0.784
  1880    5.103    5.103  -11.037  -12.890    0.723    3.971    4.216    0.784
  1881    5.106    5.106  -11.034  -12.881    0.712    3.970    4.216    0.784
  1882    5.109    5.109  -11.034  -12.881    0.710    3.972    4.217    0.784
  1883    5.112    5.112  -11.028  -12.869    0.705    3.976    4.221    0.784
  1884    5.115    5.115  -11.020  -12.844    0.697    3.987    4.231    0.784
  1885    5.117    5.117  -11.015  -12.845    0.705    3.992    4.235    0.784
  1886    5.126    5.126  -11.007  -12.829    0.700    4.004    4.247    0.784
  1887    5.166    5.166  -10.974  -12.712    0.629    4.057    4.296    0.784
  1888    5.180    5.180  -10.984  -12.725    0.629    4.068    4.308    0.784
  1889    5.204    5.204  -10.970  -12.683    0.607    4.098    4.336    0.784
  1890    5.217    5.217  -10.988  -12.702    0.612    4.114    4.352    0.785
  1891    5.221    5.221  -10.989  -12.688    0.594    4.116    4.354    0.785
  1892    5.246    5.246  -11.013  -12.687    0.572    4.143    4.380    0.785
  1893    5.249    5.249  -11.010  -12.685    0.573    4.147    4.384    0.785
  1894    5.250    5.250  -11.010  -12.686    0.575    4.149    4.386    0.785
  1895    5.251    5.251  -11.006  -12.677    0.569    4.148    4.385    0.785
  1896    5.255    5.255  -11.009  -12.684    0.575    4.155    4.392    0.785
  1897    5.256    5.256  -11.015  -12.684    0.566    4.153    4.390    0.785
  1898    5.257    5.257  -11.009  -12.689    0.577    4.154    4.391    0.785
  1899    5.257    5.257  -11.008  -12.686    0.578    4.157    4.394    0.785
  1900    5.259    5.259  -11.009  -12.687    0.575    4.156    4.393    0.785
  1901    5.261    5.261  -11.011  -12.688    0.577    4.161    4.398    0.785
  1902    5.261    5.261  -11.008  -12.684    0.576    4.162    4.398    0.785
  1903    5.263    5.263  -11.035  -12.703    0.572    4.168    4.403    0.785
  1904    5.264    5.264  -11.015  -12.695    0.578    4.162    4.399    0.785
  1905    5.264    5.264  -11.015  -12.697    0.579    4.161    4.398    0.785
  1906    5.265    5.265  -11.015  -12.697    0.578    4.161    4.399    0.785
  1907    5.266    5.266  -11.016  -12.694    0.580    4.167    4.404    0.785
  1908    5.269    5.269  -11.016  -12.697    0.575    4.162    4.400    0.785
  1909    5.273    5.273  -11.016  -12.698    0.580    4.171    4.408    0.785
  1910    5.278    5.278  -11.021  -12.700    0.576    4.175    4.412    0.785
  1911    5.279    5.279  -11.056  -12.744    0.581    4.172    4.410    0.785
  1912    5.283    5.283  -11.059  -12.756    0.585    4.171    4.410    0.785
  1913    5.284    5.284  -11.056  -12.741    0.578    4.178    4.416    0.785
  1914    5.286    5.286  -11.046  -12.742    0.585    4.175    4.414    0.785
  1915    5.287    5.287  -11.086  -12.771    0.582    4.184    4.422    0.785
  1916    5.305    5.305  -11.226  -12.821    0.517    4.226    4.458    0.785
  1917    5.305    5.305  -11.230  -12.821    0.513    4.227    4.459    0.785
  1918    5.313    5.313  -11.181  -12.812    0.541    4.223    4.458    0.785
  1919    5.315    5.315  -11.199  -12.808    0.524    4.230    4.464    0.785
  1920    5.316    5.316  -11.193  -12.809    0.529    4.229    4.463    0.785
  1921    5.318    5.318  -11.092  -12.840    0.624    4.194    4.436    0.785
  1922    5.318    5.318  -11.093  -12.840    0.623    4.194    4.436    0.785
  1923    5.319    5.319  -11.101  -12.831    0.610    4.199    4.440    0.785
  1924    5.319    5.319  -11.091  -12.837    0.619    4.192    4.434    0.785
  1925    5.319    5.319  -11.099  -12.835    0.615    4.198    4.439    0.785
  1926    5.321    5.321  -11.094  -12.833    0.616    4.198    4.440    0.785
  1927    5.321    5.321  -11.091  -12.838    0.622    4.196    4.438    0.785
  1928    5.322    5.322  -11.092  -12.835    0.620    4.199    4.441    0.785
  1929    5.322    5.322  -11.094  -12.826    0.612    4.202    4.443    0.785
  1930    5.323    5.323  -11.089  -12.833    0.622    4.202    4.443    0.785
  1931    5.324    5.324  -11.088  -12.829    0.617    4.200    4.442    0.785
  1932    5.325    5.325  -11.090  -12.829    0.618    4.204    4.445    0.785
  1933    5.328    5.328  -11.086  -12.819    0.611    4.205    4.447    0.785
  1934    5.329    5.329  -11.089  -12.829    0.621    4.209    4.450    0.785
  1935    5.332    5.332  -11.088  -12.814    0.608    4.214    4.454    0.785
  1936    5.335    5.335  -11.081  -12.814    0.613    4.216    4.457    0.785
  1937    5.336    5.336  -11.080  -12.811    0.611    4.216    4.457    0.785
  1938    5.338    5.338  -11.080  -12.804    0.604    4.218    4.459    0.785
  1939    5.343    5.343  -11.076  -12.795    0.600    4.225    4.465    0.785
  1940    5.361    5.361  -11.096  -12.666    0.479    4.270    4.505    0.785
  1941    5.365    5.365  -11.089  -12.789    0.582    4.247    4.487    0.785
  1942    5.366    5.366  -11.088  -12.791    0.584    4.246    4.487    0.785
  1943    5.370    5.370  -11.083  -12.778    0.577    4.252    4.492    0.785
  1944    5.373    5.373  -11.087  -12.791    0.588    4.257    4.496    0.785
  1945    5.376    5.376  -11.082  -12.670    0.493    4.281    4.516    0.785
  1946    5.389    5.389  -11.090  -12.790    0.584    4.273    4.513    0.785
  1947    5.390    5.390  -11.090  -12.789    0.583    4.275    4.514    0.785
  1948    5.391    5.391  -11.092  -12.795    0.587    4.275    4.514    0.785
  1949    5.398    5.398  -11.088  -12.789    0.588    4.285    4.524    0.785
  1950    5.402    5.402  -11.075  -12.769    0.584    4.293    4.531    0.785
  1951    5.413    5.413  -11.070  -12.748    0.567    4.302    4.541    0.785
  1952    5.423    5.423  -11.053  -12.713    0.557    4.319    4.557    0.785
  1953    5.553    5.553  -11.010  -12.533    0.440    4.470    4.702    0.786
  1954    5.575    5.575  -11.018  -12.541    0.436    4.488    4.720    0.786
  1955    5.616    5.616  -11.032  -12.544    0.432    4.536    4.766    0.786
  1956    5.621    5.621  -11.027  -12.520    0.408    4.536    4.768    0.786
  1957    5.624    5.624  -11.040  -12.516    0.392    4.540    4.771    0.787
  1958    5.647    5.647  -11.050  -12.520    0.387    4.564    4.795    0.787
  1959    5.648    5.648  -11.049  -12.532    0.401    4.565    4.796    0.787
  1960    5.649    5.649  -11.057  -12.546    0.408    4.568    4.798    0.787
  1961    5.649    5.649  -11.069  -12.564    0.411    4.566    4.797    0.787
  1962    5.651    5.651  -11.060  -12.550    0.406    4.567    4.798    0.787
  1963    5.652    5.652  -11.057  -12.542    0.405    4.571    4.802    0.787
  1964    5.652    5.652  -11.041  -12.513    0.395    4.575    4.805    0.787
  1965    5.653    5.653  -11.071  -12.565    0.413    4.572    4.802    0.787
  1966    5.654    5.654  -11.082  -12.590    0.423    4.568    4.799    0.787
  1967    5.655    5.655  -11.039  -12.514    0.392    4.573    4.803    0.787
  1968    5.656    5.656  -11.051  -12.535    0.400    4.573    4.804    0.787
  1969    5.656    5.656  -11.052  -12.536    0.401    4.572    4.803    0.787
  1970    5.658    5.658  -11.037  -12.510    0.393    4.578    4.808    0.787
  1971    5.658    5.658  -11.037  -12.507    0.392    4.580    4.810    0.787
  1972    5.658    5.658  -11.061  -12.545    0.401    4.576    4.807    0.787
  1973    5.658    5.658  -11.041  -12.516    0.393    4.577    4.807    0.787
  1974    5.659    5.659  -11.067  -12.559    0.404    4.572    4.804    0.787
  1975    5.663    5.663  -11.046  -12.510    0.390    4.589    4.818    0.787
  1976    5.664    5.664  -11.088  -12.600    0.423    4.575    4.808    0.787
  1977    5.665    5.665  -11.052  -12.531    0.402    4.588    4.818    0.787
  1978    5.665    5.665  -11.067  -12.559    0.409    4.582    4.813    0.787
  1979    5.674    5.674  -11.042  -12.517    0.399    4.598    4.828    0.787
  1980    5.697    5.697  -11.051  -12.517    0.385    4.616    4.847    0.787
  1981    5.936    5.936  -11.100  -12.362    0.201    4.875    5.101    0.787
  1982    5.969    5.969  -11.169  -12.508    0.259    4.889    5.118    0.787
  1983    5.994    5.994  -10.972  -12.167    0.143    4.942    5.167    0.786
  1984    6.029    6.029  -11.244  -12.651    0.319    4.942    5.173    0.788
  1985    6.039    6.039  -11.243  -12.610    0.278    4.949    5.180    0.788
  1986    6.060    6.060  -11.286  -12.699    0.318    4.965    5.198    0.788
  1987    6.060    6.060  -11.286  -12.696    0.317    4.967    5.199    0.788
  1988    6.061    6.061  -11.286  -12.696    0.317    4.967    5.199    0.788
  1989    6.062    6.062  -11.284  -12.690    0.306    4.963    5.196    0.788
  1990    6.063    6.063  -11.283  -12.693    0.320    4.973    5.205    0.788
  1991    6.065    6.065  -11.268  -12.663    0.308    4.978    5.209    0.788
  1992    6.083    6.083  -11.270  -12.661    0.300    4.993    5.224    0.788
  1993    6.212    6.212  -11.253  -12.530    0.196    5.131    5.360    0.788
  1994    6.219    6.219  -11.273  -12.578    0.218    5.131    5.361    0.789
  1995    6.222    6.222  -10.541  -11.150   -0.344    5.269    5.475    0.783
  1996    6.234    6.234  -11.287  -12.610    0.247    5.159    5.386    0.789
  1997    6.598    6.598  -10.535   -8.850   -2.397    5.886    6.044    0.779
  1998    6.648    6.648   -9.860   -6.921   -3.485    6.102    6.221    0.781
  1999    6.827    6.827   -9.106   -5.593   -3.856    6.484    6.555    0.794
  2000    6.831    6.831   -9.107   -5.592   -3.858    6.488    6.559    0.794
  2001    6.833    6.833   -9.101   -5.579   -3.863    6.493    6.563    0.794
  2002    6.834    6.834   -9.123   -5.618   -3.850    6.489    6.560    0.794
  2003    6.836    6.836   -9.101   -5.581   -3.861    6.495    6.565    0.794
  2004    6.843    6.843   -9.124   -5.612   -3.858    6.497    6.568    0.794
  2005    6.956    6.956   -9.183   -5.688   -3.865    6.586    6.663    0.792
  2006    6.960    6.960   -8.985   -5.373   -3.945    6.627    6.695    0.795
  2007    6.965    6.965   -8.979   -5.363   -3.948    6.632    6.701    0.795
  2008    6.968    6.968   -8.980   -5.363   -3.948    6.637    6.705    0.795
  2009    6.970    6.970   -8.982   -5.367   -3.946    6.639    6.707    0.795
  2010    6.974    6.974   -8.991   -5.377   -3.946    6.641    6.710    0.795
  2011    7.022    7.022   -9.867   -6.712   -3.643    6.534    6.640    0.783
  2012    7.106    7.106   -9.265   -5.711   -3.887    6.773    6.842    0.792
  2013    7.109    7.109   -9.265   -5.708   -3.889    6.778    6.847    0.792
  2014    7.111    7.111   -9.264   -5.708   -3.888    6.779    6.848    0.792
  2015    7.112    7.112   -9.264   -5.707   -3.889    6.780    6.849    0.792
  2016    7.117    7.117   -9.267   -5.709   -3.891    6.784    6.853    0.792
  2017    7.121    7.121   -9.319   -5.786   -3.876    6.778    6.850    0.791
  2018    7.280    7.280   -9.047   -5.337   -4.030    6.961    7.027    0.794
  2019    7.284    7.284   -9.050   -5.336   -4.031    6.965    7.031    0.794
  2020    7.286    7.286   -9.048   -5.334   -4.032    6.968    7.033    0.794
  2021    7.287    7.287   -9.046   -5.332   -4.032    6.969    7.035    0.794
  2022    7.291    7.291   -9.046   -5.330   -4.031    6.976    7.041    0.794
  2023    7.291    7.291   -9.045   -5.329   -4.033    6.975    7.040    0.794
  2024    7.291    7.291   -9.046   -5.330   -4.032    6.976    7.041    0.794
  2025    7.294    7.294   -9.046   -5.330   -4.032    6.978    7.043    0.794
  2026    7.294    7.294   -9.044   -5.328   -4.031    6.979    7.044    0.794
  2027    7.296    7.296   -9.047   -5.332   -4.032    6.980    7.045    0.794
  2028    7.298    7.298   -9.056   -5.343   -4.031    6.980    7.045    0.794
  2029    7.302    7.302   -9.051   -5.334   -4.033    6.987    7.052    0.794
  2030    7.469    7.469   -9.132   -5.378   -4.068    7.155    7.220    0.792
  2031    7.472    7.472   -9.137   -5.381   -4.070    7.159    7.224    0.793
  2032    7.475    7.475   -9.137   -5.379   -4.071    7.163    7.228    0.793
  2033    7.479    7.479   -9.131   -5.372   -4.069    7.169    7.233    0.793
  2034    7.481    7.481   -9.132   -5.373   -4.070    7.171    7.235    0.793
  2035    7.481    7.481   -9.131   -5.370   -4.072    7.170    7.235    0.793
  2036    7.482    7.482   -9.130   -5.369   -4.070    7.173    7.237    0.793
  2037    7.484    7.484   -9.130   -5.368   -4.071    7.175    7.239    0.793
  2038    7.485    7.485   -9.130   -5.368   -4.072    7.175    7.240    0.793
  2039    7.486    7.486   -9.130   -5.368   -4.071    7.177    7.241    0.793
  2040    7.486    7.486   -9.130   -5.368   -4.072    7.177    7.241    0.793
  2041    7.486    7.486   -9.130   -5.367   -4.071    7.178    7.242    0.793
  2042    7.487    7.487   -9.130   -5.367   -4.072    7.178    7.242    0.793
  2043    7.488    7.488   -9.130   -5.368   -4.072    7.178    7.242    0.793
  2044    7.488    7.488   -9.131   -5.368   -4.071    7.180    7.244    0.793
  2045    7.488    7.488   -9.129   -5.365   -4.072    7.181    7.244    0.793
  2046    7.489    7.489   -9.128   -5.365   -4.072    7.181    7.245    0.793
  2047    7.489    7.489   -9.130   -5.366   -4.072    7.180    7.244    0.793
  2048    7.491    7.491   -9.129   -5.365   -4.072    7.182    7.246    0.793
  2049    7.492    7.492   -9.130   -5.367   -4.071    7.184    7.248    0.793
  2050    7.493    7.493   -9.131   -5.368   -4.073    7.183    7.247    0.793
  2051    7.499    7.499   -9.133   -5.372   -4.073    7.188    7.252    0.793
  2052    7.502    7.502   -9.139   -5.378   -4.073    7.190    7.255    0.792
  2053    7.508    7.508   -9.137   -5.371   -4.075    7.199    7.263    0.793
  2054    7.573    7.573   -8.920   -5.077   -4.148    7.268    7.330    0.794
  2055    7.575    7.575   -8.927   -5.086   -4.148    7.268    7.331    0.794
  2056    7.575    7.575   -8.917   -5.074   -4.149    7.270    7.333    0.794
  2057    7.578    7.578   -8.920   -5.076   -4.149    7.273    7.336    0.794
  2058    7.580    7.580   -8.926   -5.083   -4.148    7.275    7.338    0.794
  2059    7.580    7.580   -8.921   -5.078   -4.149    7.274    7.337    0.794
  2060    7.696    7.696   -9.461   -5.740   -4.037    7.380    7.446    0.789
  2061    7.703    7.703   -9.489   -5.765   -4.026    7.401    7.465    0.789
  2062    7.704    7.704   -9.489   -5.767   -4.024    7.401    7.465    0.789
  2063    7.705    7.705   -9.485   -5.761   -4.028    7.402    7.466    0.789
  2064    7.708    7.708   -9.485   -5.760   -4.028    7.405    7.469    0.789
  2065    7.708    7.708   -9.488   -5.764   -4.025    7.406    7.470    0.789
  2066    7.718    7.718   -9.437   -5.695   -4.069    7.391    7.460    0.789
  2067    7.723    7.723   -9.413   -5.661   -4.082    7.392    7.462    0.790
  2068    7.730    7.730   -9.414   -5.656   -4.088    7.400    7.469    0.790
  2069    7.730    7.730   -9.414   -5.656   -4.088    7.400    7.469    0.790
  2070    7.731    7.731   -9.414   -5.656   -4.087    7.402    7.472    0.790
  2071    7.731    7.731   -9.414   -5.655   -4.086    7.404    7.473    0.790
  2072    7.732    7.732   -9.413   -5.655   -4.086    7.405    7.473    0.790
  2073    7.732    7.732   -9.414   -5.656   -4.084    7.406    7.474    0.790
  2074    7.732    7.732   -9.413   -5.655   -4.086    7.405    7.474    0.790
  2075    7.732    7.732   -9.414   -5.657   -4.084    7.405    7.474    0.790
  2076    7.734    7.734   -9.414   -5.655   -4.086    7.405    7.474    0.790
  2077    7.734    7.734   -9.414   -5.656   -4.088    7.404    7.474    0.790
  2078    7.735    7.735   -9.414   -5.656   -4.089    7.404    7.474    0.790
  2079    7.736    7.736   -9.413   -5.653   -4.089    7.407    7.476    0.790
  2080    7.736    7.736   -9.414   -5.657   -4.085    7.409    7.478    0.790
  2081    7.743    7.743   -9.412   -5.651   -4.092    7.412    7.481    0.790
  2082    7.744    7.744   -9.413   -5.650   -4.091    7.415    7.484    0.790
  2083    7.744    7.744   -9.418   -5.652   -4.095    7.415    7.484    0.789
  2084    7.746    7.746   -9.414   -5.651   -4.097    7.412    7.482    0.790
  2085    7.757    7.757   -9.404   -5.637   -4.100    7.424    7.494    0.790
  2086    7.759    7.759   -9.404   -5.633   -4.099    7.431    7.500    0.790
  2087    7.762    7.762   -9.404   -5.633   -4.100    7.433    7.502    0.790
  2088    7.767    7.767   -9.401   -5.627   -4.102    7.439    7.508    0.790
  2089    7.768    7.768   -9.398   -5.623   -4.105    7.437    7.506    0.790
  2090    7.800    7.800   -9.310   -5.491   -4.142    7.477    7.545    0.790
  2091    7.800    7.800   -9.278   -5.453   -4.149    7.477    7.545    0.790
  2092    7.807    7.807   -9.295   -5.468   -4.151    7.484    7.552    0.790
  2093    7.812    7.812   -9.280   -5.446   -4.157    7.489    7.556    0.790
  2094    7.813    7.813   -9.272   -5.440   -4.152    7.492    7.559    0.791
  2095    7.814    7.814   -9.270   -5.437   -4.152    7.495    7.562    0.791
  2096    7.814    7.814   -9.271   -5.439   -4.153    7.493    7.561    0.791
  2097    7.814    7.814   -9.271   -5.437   -4.152    7.496    7.563    0.791
  2098    7.815    7.815   -9.271   -5.437   -4.154    7.495    7.562    0.791
  2099    7.815    7.815   -9.271   -5.437   -4.153    7.497    7.564    0.791
  2100    7.817    7.817   -9.274   -5.442   -4.151    7.497    7.564    0.791
  2101    7.819    7.819   -9.279   -5.447   -4.152    7.498    7.565    0.791
  2102    7.822    7.822   -9.276   -5.439   -4.156    7.503    7.570    0.791
  2103    7.823    7.823   -9.282   -5.447   -4.158    7.500    7.568    0.791
  2104    7.825    7.825   -9.280   -5.445   -4.157    7.504    7.571    0.791
  2105    7.828    7.828   -9.274   -5.437   -4.157    7.509    7.576    0.791
  2106    7.828    7.828   -9.273   -5.437   -4.157    7.508    7.575    0.791
  2107    7.831    7.831   -9.272   -5.434   -4.157    7.512    7.579    0.791
  2108    7.835    7.835   -9.319   -5.482   -4.166    7.506    7.575    0.790
  2109    7.838    7.838   -9.363   -5.525   -4.160    7.515    7.583    0.790
  2110    7.846    7.846   -9.357   -5.516   -4.159    7.527    7.594    0.790
  2111    7.850    7.850   -9.317   -5.479   -4.167    7.522    7.590    0.790
  2112    7.851    7.851   -9.390   -5.546   -4.164    7.532    7.599    0.790
  2113    7.858    7.858   -9.371   -5.534   -4.162    7.533    7.601    0.790
  2114    7.873    7.873   -9.949   -6.067   -4.171    7.585    7.646    0.789
  2115    7.874    7.874   -9.953   -6.067   -4.163    7.597    7.656    0.788
  2116    7.879    7.879  -10.064   -6.166   -4.174    7.603    7.661    0.788
  2117    7.880    7.880  -10.078   -6.178   -4.163    7.618    7.674    0.788
  2118    7.881    7.881  -10.043   -6.145   -4.164    7.615    7.672    0.788
  2119    7.883    7.883  -10.013   -6.117   -4.163    7.616    7.672    0.788
  2120    7.886    7.886   -9.978   -6.086   -4.165    7.613    7.671    0.788
  2121    7.899    7.899   -9.997   -6.102   -4.165    7.629    7.686    0.788
  2122    7.984    7.984   -9.500   -5.686   -4.141    7.658    7.727    0.789
  2123    8.007    8.007   -9.463   -5.605   -4.161    7.704    7.768    0.789

================================================================================

    n = band index.
  Emf = "inner" mean-field energy eigenvalue used to construct Sigma(E),
        read from WFN_inner.
   Eo = "outer" mean-field energy eigenvalue where we center the evaluation
        frequency grid {E} of Sigma(E). Defaults to Emf, unless
        you use WFN_outer and eqp_outer.dat / scissors_outer.
  Vxc = exchange-correlation pot., calculated from VXC or read from vxc.dat.
  KIH = Kinetic energy + Ionic potential + Hartree, read from kih.dat.
    X = bare exchange.
   SX = screened exchange contrib. to Sigma(E) at energy E=Eo
   CH = Coulomb hole contrib. to Sigma(E) at energy E=Eo
  Cor = SX-X + CH = correlation portion of Sigma(E) at energy E=Eo.
  Sig = X + Cor = self energy, Sigma(E), at energy E=Eo.
 Eqp0 = on-shell QP energy = Emf - Vxc + Sig(Eo)
        Eqp0 is *not* the recommended quantity to use for QP properties.
 Eqp1 = off-shell solution to the linearized  Dyson`s equation
      = Eqp0 + (dSig/dE) / (1 - dSig/dE) * (Eqp0 - Eo),
        or a full linear interpolation if more freq. points where computed.
        Eqp1 is the recommended quantity to use for QP properties.
  Znk = quasiparticle renormalization factor

 Notes on the static remainder:
 - Unprimed values, such as Eqp0, are evaluated WITH the static remainder
 - Primed values, such as Eqp0`, are evaluated WITHOUT the static remainder

 Notes on the finite_difference_form from sigma.inp file:
   none    : -2 => dSig/dE = 0 (skip the expansion)
   backward: -1 => dSig/dE = (Sig(Eo) - Sig(Eo-dE)) / dE
   central :  0 => dSig/dE = (Sig(Eo+dE) - Sig(Eo-dE)) / (2*dE)
   forward :  1 => dSig/dE = (Sig(Eo+dE) - Sig(Eo)) / dE
   default :  2 => forward for diagonal and none for off-diagonal
   dE is finite_difference_spacing from Sigma.inp file.
   We are using the form #2 with dE = 1.000 eV.

 General notes:
 - All energies are reported here in eV.
 - Both Emf and Vxc contain the average pot. Vxc0, so Vxc0 doesn`t affect Sigma.
 - Eqp1 and Eqp0 are Eqs. (36-37) from Hybertsen & Louie PRB 34 5390.
 - We recommend you use Eqp1 for QP properties of materials.

================================================================================


WARNING: |Eqp0 - Eo| > finite_difference_spacing. Linear extrapolation for eqp1
may be inaccurate. You should test the validity of eqp1 by rerunning the
calculation with the self energy evaluated at the eqp0 energies. For that,
use the eqp_outer.dat file, created with eqp.py script and point WFN_outer to
WFN_inner, if you were not already using WFN_outer.


********************************************************************************
*                                                                              *
* Your calculation employed methods and algorithms published in peer-reviewed  *
* papers. Please, cite the following references to give proper credit to their *
*          authors and help support future development of BerkeleyGW.          *
*                                                                              *
********************************************************************************

 J. Deslippe, G. Samsonidze, D. A. Strubbe, M. Jain, M. L. Cohen, and S. G.
 Louie, BerkeleyGW: A Massively Parallel Computer Package for the Calculation
 of the Quasiparticle and Optical Properties of Materials and Nanostructures,
 Computer Physics Communications 183, 1269 (2012).

 M. S. Hybertsen and S. G. Louie, Electron Correlation in Semiconductors and
 Insulators: Band Gaps and Quasiparticle Energies, Phys. Rev. B 34, 5390
 (1986).

********************************************************************************

 
 Timing information
 
                                CPU time (s)          WALL time (s)       Number
 Routine                       min        max        min        max     of calls
 -------------------------  ---------  ---------  ---------  ---------  --------
 - Epscopy Comm                  0.86       3.46       0.85       3.45         1
 - Input I/O                     0.01       1.04       0.01       1.04         4
 - Input Comm                    0.08       1.11       0.07       1.11         4
 - FFT Zero                      0.03       0.06       0.03       0.06        25
 - FFT Put                       0.01       0.04       0.00       0.03        25
 - FFT Plan                      0.06       0.09       0.05       0.09        33
 - FFT Exec                      1.04       1.49       1.04       1.49        33
 - FFT Mltply                    0.02       0.04       0.02       0.04         8
 - FFT Conjg                     0.01       0.07       0.01       0.07         8
 - FFT Get                       0.00       0.03       0.00       0.03         8
 - I/O TOTAL                     9.71      13.36       9.70      13.36         6
 - INPUT                        11.07      13.00      11.07      12.99         1
 - EPSCOPY                       1.56       4.19       1.56       4.19         1
 - FULLBZ                        0.00       0.00       0.00       0.00         2
 - VXC                           0.08       2.60       0.08       2.60         2
 - SUBGRP                        1.11       1.22       1.11       1.22         9
 - IRRBZ                         0.00       0.00       0.00       0.00         1
 - GMAP                          0.01       0.01       0.01       0.01         1
 - GENWF                         0.91       1.39       0.91       1.39         1
 - MTXEL                        20.41      23.38      20.41      23.38         8
 - MTXEL_COR TOT              1457.07    1523.62    1457.07    1523.62         8
 - VCOUL                         0.51       0.52       0.51       0.52         1
 - EPSREAD                       0.63       0.67       0.63       0.68         1
 - INPUT_OUTER                   0.00       0.05       0.00       0.05         1
 - MTXEL COMM                    0.00       0.00       0.00       0.00         1
 - BARE X                        0.00      29.51       0.00      29.51         9
 - WF COMM                       0.00       0.00       0.00       0.00         1
 - INPUT (READ)                  0.86       0.92       0.83       0.95     29348
 - INPUT (WRITE)                 0.88       1.23       0.87       1.25     29346
 - SUB-TRANSF TOT                0.00       0.00       0.00       0.00         8
 - M.COR INIT                    3.55       3.70       3.55       3.70         8
 - M.COR EPSINIT                24.25      29.40      24.25      29.40         8
 - M.COR COMM                  138.19     208.92     138.19     208.91       128
 - M.COR PP PREP                28.77      49.01      28.75      49.22     25816
 - M.COR SX+CH                1246.48    1255.74    1246.48    1255.74       128
 - M.COR REMAIN                 20.97      21.91      20.98      21.92       128
 - READ NEPS                     0.00       1.64       0.00       1.64         1
 - EPSCOPY IO                    1.43       4.19       1.43       4.19         1
 - EQP LOOP TOTAL             1504.68    1548.83    1504.68    1548.83         1
 - TOTAL                      1566.82    1566.87    1566.82    1566.87         1
 
 Job Done
 
