{
  "id": "e1468503-c8f4-4dca-b735-553ba7ff6be4",
  "schema": "https://metadata.datadrivendiscovery.org/schemas/v0/pipeline.json",
  "created": "2020-06-03T02:45:53.179803Z",
  "inputs": [
    {
      "name": "input dataset"
    }
  ],
  "outputs": [
    {
      "data": "steps.9.produce",
      "name": "predictions of input dataset"
    }
  ],
  "steps": [
    {
      "type": "PRIMITIVE",
      "primitive": {
        "id": "dsbox-multi-table-featurization-aggregation",
        "version": "1.5.3",
        "python_path": "d3m.primitives.feature_extraction.multitable_featurization.DSBOX",
        "name": "DSBox Multiple Table Featurizer Aggregation",
        "digest": "a84a0cd27158041545883d0b04ffd5581b698414083ab80a03718310351d0d20"
      },
      "arguments": {
        "inputs": {
          "type": "CONTAINER",
          "data": "inputs.0"
        }
      },
      "outputs": [
        {
          "id": "produce"
        }
      ]
    },
    {
      "type": "PRIMITIVE",
      "primitive": {
        "id": "e193afa1-b45e-4d29-918f-5bb1fa3b88a7",
        "version": "0.2.0",
        "python_path": "d3m.primitives.schema_discovery.profiler.Common",
        "name": "Determine missing semantic types for columns automatically",
        "digest": "3bb60bc0c0a1f290b7f4d751274fd105471657cd6fb9237ab751e261d33af03f"
      },
      "arguments": {
        "inputs": {
          "type": "CONTAINER",
          "data": "steps.0.produce"
        }
      },
      "outputs": [
        {
          "id": "produce"
        }
      ]
    },
    {
      "type": "PRIMITIVE",
      "primitive": {
        "id": "4503a4c6-42f7-45a1-a1d4-ed69699cf5e1",
        "version": "0.4.0",
        "python_path": "d3m.primitives.data_transformation.extract_columns_by_semantic_types.Common",
        "name": "Extracts columns by semantic type",
        "digest": "edb6606a33dc74e0bfc7d149ea7ae1a469d51c6af4e14201775ef9826942528d"
      },
      "arguments": {
        "inputs": {
          "type": "CONTAINER",
          "data": "steps.1.produce"
        }
      },
      "outputs": [
        {
          "id": "produce"
        }
      ],
      "hyperparams": {
        "semantic_types": {
          "type": "VALUE",
          "data": [
            "https://metadata.datadrivendiscovery.org/types/PrimaryKey",
            "https://metadata.datadrivendiscovery.org/types/Attribute"
          ]
        }
      }
    },
    {
      "type": "PRIMITIVE",
      "primitive": {
        "id": "4503a4c6-42f7-45a1-a1d4-ed69699cf5e1",
        "version": "0.4.0",
        "python_path": "d3m.primitives.data_transformation.extract_columns_by_semantic_types.Common",
        "name": "Extracts columns by semantic type",
        "digest": "edb6606a33dc74e0bfc7d149ea7ae1a469d51c6af4e14201775ef9826942528d"
      },
      "arguments": {
        "inputs": {
          "type": "CONTAINER",
          "data": "steps.0.produce"
        }
      },
      "outputs": [
        {
          "id": "produce"
        }
      ],
      "hyperparams": {
        "semantic_types": {
          "type": "VALUE",
          "data": [
            "https://metadata.datadrivendiscovery.org/types/TrueTarget"
          ]
        }
      }
    },
    {
      "type": "PRIMITIVE",
      "primitive": {
        "id": "DSBox-unary-encoder",
        "version": "1.5.3",
        "python_path": "d3m.primitives.data_preprocessing.unary_encoder.DSBOX",
        "name": "DSBox Unary Data Encoder",
        "digest": "c430ce6c67a8246b23df079613f905e6e1c694d2878898c23d53216736e73b35"
      },
      "arguments": {
        "inputs": {
          "type": "CONTAINER",
          "data": "steps.2.produce"
        }
      },
      "outputs": [
        {
          "id": "produce"
        }
      ]
    },
    {
      "type": "PRIMITIVE",
      "primitive": {
        "id": "18f0bb42-6350-3753-8f2d-d1c3da70f279",
        "version": "1.5.3",
        "python_path": "d3m.primitives.data_preprocessing.encoder.DSBOX",
        "name": "ISI DSBox Data Encoder",
        "digest": "6835748d1a5972f42b13e64ac857e0cf70b34f9b0bfed0b1f89c86f02bfef92a"
      },
      "arguments": {
        "inputs": {
          "type": "CONTAINER",
          "data": "steps.4.produce"
        }
      },
      "outputs": [
        {
          "id": "produce"
        }
      ]
    },
    {
      "type": "PRIMITIVE",
      "primitive": {
        "id": "7ddf2fd8-2f7f-4e53-96a7-0d9f5aeecf93",
        "version": "1.5.3",
        "python_path": "d3m.primitives.data_transformation.to_numeric.DSBOX",
        "name": "ISI DSBox To Numeric DataFrame",
        "digest": "c9f7c07836ec711ea21f3baae5c0dedf2a06392d0ef15b2cc0239a77ded89c82"
      },
      "arguments": {
        "inputs": {
          "type": "CONTAINER",
          "data": "steps.5.produce"
        }
      },
      "outputs": [
        {
          "id": "produce"
        }
      ]
    },
    {
      "type": "PRIMITIVE",
      "primitive": {
        "id": "7894b699-61e9-3a50-ac9f-9bc510466667",
        "version": "1.5.3",
        "python_path": "d3m.primitives.data_preprocessing.mean_imputation.DSBOX",
        "name": "DSBox Mean Imputer",
        "digest": "32f20852b4a8565abd2fb63ad8dd3d236a4bc46cddd6476c530cc88f366896c1"
      },
      "arguments": {
        "inputs": {
          "type": "CONTAINER",
          "data": "steps.6.produce"
        }
      },
      "outputs": [
        {
          "id": "produce"
        }
      ]
    },
    {
      "type": "PRIMITIVE",
      "primitive": {
        "id": "f0fd7a62-09b5-3abc-93bb-f5f999f7cc80",
        "version": "2020.5.26",
        "python_path": "d3m.primitives.regression.random_forest.SKlearn",
        "name": "sklearn.ensemble.forest.RandomForestRegressor",
        "digest": "a47631439a900b370d82895f715b2179996cf22987bc297a2e2e11e2bbfac62a"
      },
      "arguments": {
        "inputs": {
          "type": "CONTAINER",
          "data": "steps.7.produce"
        },
        "outputs": {
          "type": "CONTAINER",
          "data": "steps.3.produce"
        }
      },
      "outputs": [
        {
          "id": "produce"
        }
      ],
      "hyperparams": {
        "add_index_columns": {
          "type": "VALUE",
          "data": true
        },
        "return_result": {
          "type": "VALUE",
          "data": "new"
        },
        "use_semantic_types": {
          "type": "VALUE",
          "data": true
        }
      }
    },
    {
      "type": "PRIMITIVE",
      "primitive": {
        "id": "8d38b340-f83f-4877-baaa-162f8e551736",
        "version": "0.3.0",
        "python_path": "d3m.primitives.data_transformation.construct_predictions.Common",
        "name": "Construct pipeline predictions output",
        "digest": "84c545aaa49cf043d60c3deee64c68fdf36e31c07c6c9e2a67b7004e9d43fa53"
      },
      "arguments": {
        "reference": {
          "type": "CONTAINER",
          "data": "steps.0.produce"
        },
        "inputs": {
          "type": "CONTAINER",
          "data": "steps.8.produce"
        }
      },
      "outputs": [
        {
          "id": "produce"
        }
      ]
    }
  ],
  "name": "UU3_Test_Template:140286801495600",
  "description": "",
  "digest": "df8b4a48e338264daa76cd7bcb24b3dd73f5c692301f3303c788fa725bb30eb0"
}
